{"text_format":"1","workbook":"xlsx","n_sheets":12,"sheets":["2. CADASTRO DE VEÍCULOS","3. CADASTROS GERAIS","4. ABASTECIMENTOS","5. MANUTENÇÕES","6. TROCAS DE ÓLEO","7. ANÁLISE GERAL","8 - LANÇAMENTOS","7.1 Abastecimento","7.2 Manutenção","7.3 Troca de óleo","7.4 Fechamento ","MENU"],"not_rendered":{"charts":2,"images":1,"macros":1,"external_links":0,"defined_names":49,"comments":0,"pivot_tables":8},"unopened":[],"bounds":{"document_bytes":16777216,"sheet_cells":100000,"rows_first":2000,"rows_last":500,"rows_between":2000,"halvings":0,"cell_chars":16384,"cell_head_chars":4096},"cells_cut":0,"cells_raw":0,"read":"whole","date_system":"1900"}

{"sheet":"2. CADASTRO DE VEÍCULOS","index":0,"n_rows":23,"n_cols":11,"rows_kept":23,"cut":false,"hidden":false,"merged":[[6,8,6,9],[2,0,2,9]]}
[]
[]
["2. CADASTRO DE VEICULOS"]
["3. CADASTROS GERAIS","4. ABASTECIMENTOS","5. MANUTENÇÕES","6. TROCAS DE ÓLEO","7. ANÁLISE GERAL","8 - LANÇAMENTOS","MENU"]
[]
["Cadastro de veículos"]
["DADOS CADASTRAIS",null,null,null,null,"SEGURO",null,null,"IPVA"]
["Placa","Fabricante","Modelo","Tipo","Ano","Seguradora","Vigência","Status do Seguro","Vigência2","Status do IPVA","E-mail"]
["XXX-0000","JOHN DEERE","PIONNER - TRATOR DE JARDIM JD D170","TRATOR",2014]
["OMQ-4338","HILUX","HILUX SRV D4 -D","PICK UP",2014,"CORASBEG ","2016-11-17",{"$f":"IF(Tabela1[[#This Row],[Vigência]]-TODAY()<60,\"Solicitar Renovação\",Tabela1[[#This Row],[Vigência]]-TODAY())","v":136},"2016-06-27",{"$f":"IF(Tabela1[[#This Row],[Vigência2]]-TODAY()<60,\"Solicitar Renovação\",Tabela1[[#This Row],[Vigência2]]-TODAY())","v":"Solicitar Renovação"},"eliel.silva@sammaservicos.com.br"]
["NLN-0358","FIAT","UNO MILLE","CARRO DE PASSEIO",2011,"B. Brasil","2016-12-02",{"$f":"IF(Tabela1[[#This Row],[Vigência]]-TODAY()<60,\"Solicitar Renovação\",Tabela1[[#This Row],[Vigência]]-TODAY())","v":151},"2016-06-29",{"$f":"IF(Tabela1[[#This Row],[Vigência2]]-TODAY()<60,\"Solicitar Renovação\",Tabela1[[#This Row],[Vigência2]]-TODAY())","v":"Solicitar Renovação"},"eliel.silva@sammaservicos.com.br"]
["OMN-4313","FIAT","STRADA WORKING - ADM","PICK UP",2014,"ASA SEGUROS","2016-11-19",{"$f":"IF(Tabela1[[#This Row],[Vigência]]-TODAY()<60,\"Solicitar Renovação\",Tabela1[[#This Row],[Vigência]]-TODAY())","v":138},"2016-04-12",{"$f":"IF(Tabela1[[#This Row],[Vigência2]]-TODAY()<60,\"Solicitar Renovação\",Tabela1[[#This Row],[Vigência2]]-TODAY())","v":"Solicitar Renovação"},"eliel.silva@sammaservicos.com.br"]
["OMR-2541","FIAT","STRADA WORKING - JUNIOR","PICK UP",2013,"CORASBEG ","2016-08-25",{"$f":"IF(Tabela1[[#This Row],[Vigência]]-TODAY()<60,\"Solicitar Renovação\",Tabela1[[#This Row],[Vigência]]-TODAY())","v":"Solicitar Renovação"},"2017-06-21",{"$f":"IF(Tabela1[[#This Row],[Vigência2]]-TODAY()<60,\"Solicitar Renovação\",Tabela1[[#This Row],[Vigência2]]-TODAY())","v":352},"eliel.silva@sammaservicos.com.br"]
["OMY-0862","FIAT","DOBLO","FURGÃO",null,"MAPFRE","2017-04-08",{"$f":"IF(Tabela1[[#This Row],[Vigência]]-TODAY()<60,\"Solicitar Renovação\",Tabela1[[#This Row],[Vigência]]-TODAY())","v":278},"2016-03-30",{"$f":"IF(Tabela1[[#This Row],[Vigência2]]-TODAY()<60,\"Solicitar Renovação\",Tabela1[[#This Row],[Vigência2]]-TODAY())","v":"Solicitar Renovação"},"eliel.silva@sammaservicos.com.br"]
["OMQ-4159","MITSUBISHI","L200 - ANGLO FOSFATO","PICK UP",2014,null,null,null,null,{"$f":"IF(Tabela1[[#This Row],[Vigência]]-TODAY()<60,\"Solicitar Renovação\",Tabela1[[#This Row],[Vigência]]-TODAY())","v":"Solicitar Renovação"},"eliel.silva@sammaservicos.com.br"]
["XXX-1111","STHIL","ROÇADEIRAS - CAMPO BELO"]
["XXX-2222","STHIL","ROÇADEIRAS - SESUC"]
["XXX-3333","STHIL","ROÇADEIRAS - ANGLO NIÓBIO"]
["XXX-4444","STHIL","ROÇADEIRAS - ANGLO FOSFATO"]
["NFT-6481","VOLKSWAGEN","COMBI - ANGLO FOSFATO","VAN"]
["PDE-0095","DIVERSOS","CAMINHÃO PIPA","CAMINHÃO"]
["ERH-7091","DIVERSOS","POLIGUINDASTE - ANGLO NIOBIO","GUINDASTE"]
["MRR-7188","DIVERSOS","CAMINHÃO CAÇAMBA","CAMINHÃO"]

{"sheet":"3. CADASTROS GERAIS","index":1,"n_rows":21,"n_cols":8,"rows_kept":21,"cut":false,"hidden":false,"merged":[[2,0,2,7]]}
[]
[]
["3. CADASTROS GERAIS"]
["2. CADASTRO DE VEÍCULOS","3. CADASTROS GERAIS","4. ABASTECIMENTOS","5. MANUTENÇÕES","6. TROCAS DE ÓLEO","7. ANÁLISE GERAL","8 - LANÇAMENTOS","MENU"]
[]
["CADASTROS GERAIS"]
["Tipo de óleo","Intervalo de troca",null,"Serviços"]
["MOBIL DELVAC MX ESP 15W-40",60000,null,"Lataria e pintura"]
["MOBIL DELVAC MX 15W-40",60000,null,"Mecânica"]
["MOBIL DELVAC 1 5W-40",120000,null,"Pneus"]
["MOBIL DELVAC SUPER 1400 15W-40",45000,null,"Lavação"]
["OLEO 2 TEMPOS",0,null,"Peças"]
[]
[]
[null,null,null,"Oficinas"]
["Combustível ",null,null,"POSTO JK"]
["POSTO JK",null,null,"POSTO SÃO JOÃO"]
["POSTO SÃO JOÃO",null,null,"D'PASCOAL"]
["POSTO CHAPADÃO",null,null,"FIAT"]
["POSTO MAIS",null,null,"PH LAVA-JATO"]
[null,null,null,"PNEUS SÃO BENTO"]

{"sheet":"4. ABASTECIMENTOS","index":2,"n_rows":65,"n_cols":12,"rows_kept":65,"cut":false,"hidden":false,"merged":[[2,0,2,11]]}
[]
[]
["4. ABASTECIMENTOS"]
["2. CADASTRO DE VEÍCULOS","3. CADASTROS GERAIS","4. ABASTECIMENTOS","5. MANUTENÇÕES","6. TROCAS DE ÓLEO","7. ANÁLISE GERAL","8 - LANÇAMENTOS","MENU"]
[]
["Data","Modelo","Placa","Fabricante","Posto","Nº da Requisição","Combustível","Custo total R$","Preço por litro","Litros abastecidos","Quilometragem do hodômetro (Km)","Km percorridos"]
["2016-05-20","POLIGUINDASTE - ANGLO NIOBIO","ERH-7091","DIVERSOS","POSTO CHAPADÃO",41,"DIESEL S10",688.88,3.17,217.31,142253,{"$f":"MAX(IF($C$7:$C$99999=C7,$K$7:$K$99999))-MIN(IF($C$7:$C$99999=C7,$K$7:$K$99999))","v":142253}]
["2016-05-21","L200 - ANGLO FOSFATO","OMQ-4159","MITSUBISHI","POSTO CHAPADÃO",51,"DIESEL S10",281,3.2690000000000001,85.95,0,{"$f":"MAX(IF($C$7:$C$99999=C8,$K$7:$K$99999))-MIN(IF($C$7:$C$99999=C8,$K$7:$K$99999))","v":69980}]
["2016-05-25","L200 - ANGLO FOSFATO","OMQ-4159","MITSUBISHI","POSTO CHAPADÃO",53,"DIESEL S10",196.47,3.2690000000000001,60.1,33254,{"$f":"MAX(IF($C$7:$C$99999=C9,$K$7:$K$99999))-MIN(IF($C$7:$C$99999=C9,$K$7:$K$99999))","v":69980}]
["2016-05-25","L200 - ANGLO FOSFATO","OMQ-4159","MITSUBISHI","POSTO CHAPADÃO",54,"DIESEL S10",327.64999999999998,3.2690000000000001,103.35,0,{"$f":"MAX(IF($C$7:$C$99999=C10,$K$7:$K$99999))-MIN(IF($C$7:$C$99999=C10,$K$7:$K$99999))","v":69980}]
["2016-05-27","ROÇADEIRAS - ANGLO NIÓBIO","XXX-3333","STHIL","POSTO CHAPADÃO",55,"GASOLINA",66.58,3.7890000000000001,18,0,{"$f":"MAX(IF($C$7:$C$99999=C11,$K$7:$K$99999))-MIN(IF($C$7:$C$99999=C11,$K$7:$K$99999))","v":0}]
["2016-05-28","POLIGUINDASTE - ANGLO NIOBIO","ERH-7091","DIVERSOS","POSTO CHAPADÃO",56,"GASOLINA",620.62,3.17,195.779,0,{"$f":"MAX(IF($C$7:$C$99999=C12,$K$7:$K$99999))-MIN(IF($C$7:$C$99999=C12,$K$7:$K$99999))","v":142253}]
["2016-05-29","L200 - ANGLO FOSFATO","OMQ-4159","MITSUBISHI","POSTO CHAPADÃO",57,"DIESEL S10",173.03,3.2690000000000001,52.43,0,{"$f":"MAX(IF($C$7:$C$99999=C13,$K$7:$K$99999))-MIN(IF($C$7:$C$99999=C13,$K$7:$K$99999))","v":69980}]
["2016-05-31","COMBI - ANGLO FOSFATO","NFT-6481","VOLKSWAGEN","POSTO CHAPADÃO",118,"GASOLINA",145.01,3.7890000000000001,38.270000000000003,148126,{"$f":"MAX(IF($C$7:$C$99999=C14,$K$7:$K$99999))-MIN(IF($C$7:$C$99999=C14,$K$7:$K$99999))","v":856}]
["2016-06-01","ROÇADEIRAS - ANGLO FOSFATO","XXX-4444","STHIL","POSTO JK",121,"GASOLINA",70.180000000000007,3.89,18,0,{"$f":"MAX(IF($C$7:$C$99999=C15,$K$7:$K$99999))-MIN(IF($C$7:$C$99999=C15,$K$7:$K$99999))","v":0}]
["2016-06-01","STRADA WORKING - ADM","OMN-4313","FIAT","POSTO JK",119,"GASOLINA",172.61,3.899,44.27,56742,{"$f":"MAX(IF($C$7:$C$99999=C16,$K$7:$K$99999))-MIN(IF($C$7:$C$99999=C16,$K$7:$K$99999))","v":58350}]
["2016-06-01","STRADA WORKING - JUNIOR","OMR-2541","FIAT","POSTO MAIS",124,"GASOLINA",183.58,3.8490000000000002,47.69,0,{"$f":"MAX(IF($C$7:$C$99999=C17,$K$7:$K$99999))-MIN(IF($C$7:$C$99999=C17,$K$7:$K$99999))","v":0}]
["2016-06-01","DOBLO","OMY-0862","FIAT","POSTO MAIS",122,"GASOLINA",131.44,3.8490000000000002,34.14,0,{"$f":"MAX(IF($C$7:$C$99999=C18,$K$7:$K$99999))-MIN(IF($C$7:$C$99999=C18,$K$7:$K$99999))","v":36233}]
["2016-06-02","ROÇADEIRAS - ANGLO NIÓBIO","XXX-3333","STHIL","POSTO JK",129,"GASOLINA",90.17,3.89,36.21,0,{"$f":"MAX(IF($C$7:$C$99999=C19,$K$7:$K$99999))-MIN(IF($C$7:$C$99999=C19,$K$7:$K$99999))","v":0}]
["2016-06-02","STRADA WORKING - ADM","OMN-4313","FIAT","POSTO MAIS",128,"GASOLINA",150.09,3.8490000000000002,38.994999999999997,57419,{"$f":"MAX(IF($C$7:$C$99999=C20,$K$7:$K$99999))-MIN(IF($C$7:$C$99999=C20,$K$7:$K$99999))","v":58350}]
["2016-06-03","ROÇADEIRAS - ANGLO FOSFATO","XXX-4444","STHIL","POSTO JK",133,"GASOLINA",70.180000000000007,3.89,18,0,{"$f":"MAX(IF($C$7:$C$99999=C21,$K$7:$K$99999))-MIN(IF($C$7:$C$99999=C21,$K$7:$K$99999))","v":0}]
["2016-06-03","UNO MILLE","NLN-0358","FIAT","POSTO MAIS",139,"GASOLINA",90.99,3.8490000000000002,23.64,147291,{"$f":"MAX(IF($C$7:$C$99999=C22,$K$7:$K$99999))-MIN(IF($C$7:$C$99999=C22,$K$7:$K$99999))","v":152143}]
["2016-06-03","COMBI - ANGLO FOSFATO","NFT-6481","VOLKSWAGEN","POSTO CHAPADÃO",137,"GASOLINA",121.02,3.7888999999999999,31.94,148357,{"$f":"MAX(IF($C$7:$C$99999=C23,$K$7:$K$99999))-MIN(IF($C$7:$C$99999=C23,$K$7:$K$99999))","v":856}]
["2016-06-06","DOBLO","OMY-0862","FIAT","POSTO JK",146,"GASOLINA",166.22,3.899,42.63,0,{"$f":"MAX(IF($C$7:$C$99999=C24,$K$7:$K$99999))-MIN(IF($C$7:$C$99999=C24,$K$7:$K$99999))","v":36233}]
["2016-06-06","ROÇADEIRAS - ANGLO FOSFATO","XXX-4444","STHIL","POSTO JK",144,"GASOLINA",139.78,3.88,36,0,{"$f":"MAX(IF($C$7:$C$99999=C25,$K$7:$K$99999))-MIN(IF($C$7:$C$99999=C25,$K$7:$K$99999))","v":0}]
["2016-06-07","L200 - ANGLO FOSFATO","OMQ-4159","MITSUBISHI","POSTO SÃO JOÃO",152,"DIESEL S10",287.89,3.26,88.65,0,{"$f":"MAX(IF($C$7:$C$99999=C26,$K$7:$K$99999))-MIN(IF($C$7:$C$99999=C26,$K$7:$K$99999))","v":69980}]
["2016-06-07","COMBI - ANGLO FOSFATO","NFT-6481","VOLKSWAGEN","POSTO SÃO JOÃO",151,"GASOLINA",118.76,3.7890000000000001,31.34,148600,{"$f":"MAX(IF($C$7:$C$99999=C27,$K$7:$K$99999))-MIN(IF($C$7:$C$99999=C27,$K$7:$K$99999))","v":856}]
["2016-06-07","UNO MILLE","NLN-0358","FIAT","POSTO MAIS",150,"GASOLINA",172.06,3.8490000000000002,44.7,147941,{"$f":"MAX(IF($C$7:$C$99999=C28,$K$7:$K$99999))-MIN(IF($C$7:$C$99999=C28,$K$7:$K$99999))","v":152143}]
["2016-06-08","PIONNER - TRATOR DE JARDIM JD D170","XXX-0000","JOHN DEERE","POSTO JK",153,"GASOLINA",38.99,3.899,10,0,{"$f":"MAX(IF($C$7:$C$99999=C29,$K$7:$K$99999))-MIN(IF($C$7:$C$99999=C29,$K$7:$K$99999))","v":0}]
["2016-06-08","STRADA WORKING - JUNIOR","OMR-2541","FIAT","POSTO JK",155,"GASOLINA",156.31,3.899,40.090000000000003,0,{"$f":"MAX(IF($C$7:$C$99999=C30,$K$7:$K$99999))-MIN(IF($C$7:$C$99999=C30,$K$7:$K$99999))","v":0}]
{"$rows_left_out":36}
{"sheet":"5. MANUTENÇÕES","index":3,"n_rows":11,"n_cols":10,"rows_kept":11,"cut":false,"hidden":false,"merged":[[2,0,2,9]]}
[]
[]
["5. MANUTENÇÕES"]
["2. CADASTRO DE VEÍCULOS","3. CADASTROS GERAIS","4. ABASTECIMENTOS","5. MANUTENÇÕES","6. TROCAS DE ÓLEO","7. ANÁLISE GERAL","8 - LANÇAMENTOS","MENU"]
[]
["Data","Modelo","Placa","Fabricante","Estabelecimento","Nº da Requisição","Tipo de serviço","Descrição do serviço","Custo total R$","KM (Hodometro)"]
["2016-06-01","CAMINHÃO PIPA","PDE-0095","DIVERSOS","POSTO JK",120,"Peças","02 TACOGRAFO",64]
["2016-06-20","DOBLO","OMY-0862","FIAT","PH LAVA-JATO",201,"Lavação","LAVAGEM C/ CERA",50,0]
["2016-06-25","DOBLO","OMY-0862","FIAT","PH LAVA-JATO","227_01","Lavação","LAVAGEM GERAL",30,0]
["2016-06-25","STRADA WORKING - ADM","OMN-4313","FIAT","PH LAVA-JATO","227_02","Lavação","LAVAGEM GERAL",50,0]
["2016-06-25","STRADA WORKING - JUNIOR","OMR-2541","FIAT","PH LAVA-JATO","227_03","Lavação","LAVAGEM GERAL",50,0]

{"sheet":"6. TROCAS DE ÓLEO","index":4,"n_rows":7,"n_cols":14,"rows_kept":7,"cut":false,"hidden":false,"merged":[[2,0,2,13]]}
[]
[]
["6. TROCA DE ÓLEO"]
["2. CADASTRO DE VEÍCULOS","3. CADASTROS GERAIS","4. ABASTECIMENTOS","5. MANUTENÇÕES","6. TROCAS DE ÓLEO","7. ANÁLISE GERAL","8 - LANÇAMENTOS","MENU"]
[]
["Data","Modelo","Placa","Fabricante","Estabelecimento","Nº da Requisição","Óleo","KM Óleo","Observação (opcional)","Filtro de óleo","Filtro de combustível","Custo total","Quilometragem (Km)","Próxima troca (Km)"]
["2016-06-06","ROÇADEIRAS - ANGLO FOSFATO","XXX-4444","STHIL","POSTO JK",144,"OLEO 2 TEMPOS",0,"OLEO P/ ROÇADEIRAS","NÃO","NÃO",28,0,{"$f":"M7+H7","v":0}]

{"sheet":"7. ANÁLISE GERAL","index":5,"n_rows":4,"n_cols":8,"rows_kept":4,"cut":false,"hidden":false,"merged":[]}
[]
[]
[]
["2. CADASTRO DE VEÍCULOS","3. CADASTROS GERAIS","4. ABASTECIMENTOS","5. MANUTENÇÕES","6. TROCAS DE ÓLEO","7. ANÁLISE GERAL","8 - LANÇAMENTOS","MENU"]

{"sheet":"8 - LANÇAMENTOS","index":6,"n_rows":19,"n_cols":10,"rows_kept":19,"cut":false,"hidden":false,"merged":[[3,5,3,8],[5,8,5,9],[5,3,5,4],[5,0,5,1],[2,0,2,9]]}
[]
[]
["8. LANÇAMENTOS GERAIS"]
["2. CADASTRO DE VEÍCULOS","3. CADASTROS GERAIS","4. ABASTECIMENTOS","5. MANUTENÇÕES","6. TROCAS DE ÓLEO","7. ANÁLISE GERAL",null,null,null,"MENU"]
[]
["MANUTENÇÕES",null,null,"TROCA DE OLEO",null,null,null,null,"ABASTECIMENTOS"]
["Data",null,null,"Data",null,null,null,null,"Data"]
["Modelo",null,null,"Modelo",null,null,null,null,"Modelo"]
["Placa",{"$f":"IFERROR(INDEX('2. CADASTRO DE VEÍCULOS'!$A$9:$A$24,MATCH($B$8,'2. CADASTRO DE VEÍCULOS'!C9:C24,0)),\"\")","v":""},null,"Placa",{"$f":"IFERROR(INDEX('2. CADASTRO DE VEÍCULOS'!$A$9:$A$24,MATCH($E$8,'2. CADASTRO DE VEÍCULOS'!C9:C24,0)),\"\")","v":""},null,null,null,"Placa",{"$f":"IFERROR(INDEX('2. CADASTRO DE VEÍCULOS'!$A$9:$A$24,MATCH($J$8,'2. CADASTRO DE VEÍCULOS'!C9:C24,0)),\"\")","v":""}]
["Fabricante",{"$f":"IFERROR(INDEX('2. CADASTRO DE VEÍCULOS'!$B$9:$B$24,MATCH($B$8,'2. CADASTRO DE VEÍCULOS'!$C$9:$C$24,0)),\"\")","v":""},null,"Fabricante",{"$f":"IFERROR(INDEX('2. CADASTRO DE VEÍCULOS'!$B$9:$B$24,MATCH($E$8,'2. CADASTRO DE VEÍCULOS'!$C$9:$C$24,0)),\"\")","v":""},null,null,null,"Fabricante",{"$f":"IFERROR(INDEX('2. CADASTRO DE VEÍCULOS'!$B$9:$B$24,MATCH($J$8,'2. CADASTRO DE VEÍCULOS'!$C$9:$C$24,0)),\"\")","v":""}]
["Estabelecimento",null,null,"Estabelecimento(Oficina)",null,null,null,null,"Posto"]
["Nº da Requisição",null,null,"Nº da Requisição",null,null,null,null,"Nº da Requisição"]
["Tipo de serviço",null,null,"Óleo",null,null,null,null,"Combustível"]
["Descrição do serviço",null,null,"KM Óleo",{"$f":"IFERROR(VLOOKUP(E13,Tabela3[#All],2,0),\"\")","v":""},null,null,null,"Custo total R$"]
["Custo total R$",null,null,"Observação (opcional)",null,null,null,null,"Preço por litro"]
["KM (Hodometro)",null,null,"Filtro de óleo",null,null,null,null,"Lts abastecidos"]
[null,null,null,"Filtro de combustível",null,null,null,null,"KM (Hodometro)"]
[null,null,null,"Custo total"]
[null,null,null,"KM (Hodometro)"]

{"sheet":"7.1 Abastecimento","index":7,"n_rows":24,"n_cols":12,"rows_kept":24,"cut":false,"hidden":false,"merged":[[1,1,1,2],[1,3,1,4],[1,5,1,6],[1,7,1,8],[0,0,0,14]]}
["7.1 ANALISE ABASTECIMENTO"]
[null,"2. CADASTRO DE VEÍCULOS",null,"3. CADASTROS GERAIS",null,"4. ABASTECIMENTOS",null,"5. MANUTENÇÕES",null,"6. TROCAS DE ÓLEO","7.1 Abastecimento","MENU"]
[]
["ANÁLISE ABASTECIMENTO",null,null,null,null,null,null,"<--VOLTAR PARA 7. ANÁLISE GERAL",null,null,null,"ATUALIZAR GRÁFICO E TABELA"]
[null,null,null,null,null,null,null,null,null,null,"Data","(Tudo)"]
[null,null,null,null,null,null,null,null,null,null,"Combustível","(Vários itens)"]
[null,null,null,null,null,null,null,null,null,null,"Placa","(Vários itens)"]
[]
[null,"QUADRO DE ABASTECIMENTO",null,null,null,null,null,null,null,null,"Rótulos de Linha","KM/L média."]
[null,null," ",null,null,null,null,null,null,null,"STRADA WORKING - JUNIOR",0]
[null,"Modelo","Lts Abastecidos","Custo Total","Km Total","KM/L média.","Média Custo Unit","Custo/KM.",null,null,"STRADA WORKING - ADM",941.18595882815498]
[null,"CAMINHÃO PIPA",206.44,674.86,0,0,3.2690370083317188,{"$error":"#DIV/0!"},null,null,"UNO MILLE",3680.9866417465837]
[null,"COMBI - ANGLO FOSFATO",163.81,623.79999999999995,4280,26.127831023747024,3.8080703253769608,0.14574766355140187,null,null,"DOBLO",938.28982805054909]
[null,"DOBLO",193.08,751.14999999999986,181165,938.28982805054898,3.8903563289828043,4.14622029641487E-3,null,null,"L200 - ANGLO FOSFATO",905.18690984348711]
[null,"L200 - ANGLO FOSFATO",541.16999999999996,1745.56,489860,905.18690984348734,3.2255298704658428,3.5633854570693668E-3,null,null,"COMBI - ANGLO FOSFATO",26.127831023747024]
[null,"PIONNER - TRATOR DE JARDIM JD D170",122,481.75,0,0,3.9487704918032787,{"$error":"#DIV/0!"},null,null,"POLIGUINDASTE - ANGLO NIOBIO",688.72809491417104]
[null,"POLIGUINDASTE - ANGLO NIOBIO",413.089,1309.5,284506,688.72809491417104,3.1700190515845255,4.6027148812327334E-3,null,null,"CAMINHÃO PIPA",0]
[null,"ROÇADEIRAS - ANGLO FOSFATO",126,487.44,0,0,3.8685714285714288,{"$error":"#DIV/0!"},null,null,"Total Geral",1062.4898890985639]
[null,"ROÇADEIRAS - ANGLO NIÓBIO",72.210000000000008,226.93,0,0,3.1426395236116877,{"$error":"#DIV/0!"}]
[null,"ROÇADEIRAS - CAMPO BELO",30,116.97,0,0,3.899,{"$error":"#DIV/0!"}]
[null,"STRADA WORKING - ADM",247.98500000000001,644.68000000000006,233400,941.18595882815487,2.5996733673407668,2.7621251071122538E-3]
[null,"STRADA WORKING - JUNIOR",172.36,669.51,0,0,3.8843699234161053,{"$error":"#DIV/0!"}]
[null,"UNO MILLE",330.65699999999998,1285.8699999999999,1217144,3680.9866417465837,3.8888334437196246,1.0564649704554268E-3]
[null,"Total Geral",2618.8010000000004,9018.02,2410355,920.40403222696227,3.4435682589093273,3.7413658983842637E-3]

{"sheet":"7.2 Manutenção","index":8,"n_rows":16,"n_cols":12,"rows_kept":16,"cut":false,"hidden":false,"merged":[[3,1,3,2],[3,3,3,4],[3,5,3,6],[3,7,3,8],[2,0,2,11]]}
[]
[]
["7.2 ANÁLISE DE MANUTENÇÃO"]
[null,"2. CADASTRO DE VEÍCULOS",null,"3. CADASTROS GERAIS",null,"4. ABASTECIMENTOS",null,"5. MANUTENÇÕES",null,"6. TROCAS DE ÓLEO","7.2 Manutenção","MENU"]
[]
["ANÁLISE MANUTENÇÃO",null,null,null,null,"<--VOLTAR PARA 7. ANÁLISE GERAL",null,null,null,null,"ATUALIZAR GRÁFICO E TABELA"]
[null,null,null,null,null,null,null,null,null,"Data","(Tudo)"]
["Data","(Tudo)"]
["QUADRO DE MANUTENÇÃO",null,null,null,null,null,null,null,null,"Rótulos de Linha","Soma de Custo total R$"]
[" ",null,null,"Tipo de serviço",null,null,null,null,null,"Peças",64]
["Placa","Modelo","Fabricante","Peças","Lavação","Total",null,null,null,"Lavação",180]
["PDE-0095","CAMINHÃO PIPA","DIVERSOS",64,null,64,null,null,null,"Total Geral",244]
["OMY-0862","DOBLO","FIAT",null,80,80]
["OMN-4313","STRADA WORKING - ADM","FIAT",null,50,50]
["OMR-2541","STRADA WORKING - JUNIOR","FIAT",null,50,50]
["Total",null,null,64,180,244]

{"sheet":"7.3 Troca de óleo","index":9,"n_rows":20,"n_cols":12,"rows_kept":20,"cut":false,"hidden":false,"merged":[[3,1,3,2],[3,3,3,4],[3,5,3,6],[3,7,3,8],[2,0,2,11]]}
[]
[]
["7.3 ANÁLISE DE TROCA DE ÓLEO"]
[null,"2. CADASTRO DE VEÍCULOS",null,"3. CADASTROS GERAIS",null,"4. ABASTECIMENTOS",null,"5. MANUTENÇÕES",null,"6. TROCAS DE ÓLEO","7.3 Troca de óleo","MENU"]
[]
["ANÁLISE MANUTENÇÃO",null,null,null,null,null,null,"<--VOLTAR PARA 7. ANÁLISE GERAL",null,null,"ATUALIZAR GRÁFICO E TABELA"]
[]
[null,null,null,null,null,null,"PRÓXIMA TROCA DE ÓLEO"]
[null,null,null,null,null,null,"Placa","Fabricante","Modelo","Últ. Abast.","Próx. Troca","Alerta"]
[null,null,null,null,null,null,"OGJ-0919","MITSUBISHI","L200 TRITON",{"$f":"IFERROR(LARGE(IF(G10=Tabela4[Placa],Tabela4[Quilometragem do hodômetro (Km)]),1),0)","v":0},{"$f":"IFERROR(LARGE(IF(G10=Tabela9[Placa],Tabela9[Próxima troca (Km)]),1),0)","v":0},{"$f":"IF(K10<=(J10*1.1),\"Troca está próxima\",\"\")","v":"Troca está próxima"}]
[null,null,null,null,null,null,"XXX-0000","JOHN DEERE","PIONNER - TRATOR DE JARDIM JD D170",{"$f":"IFERROR(LARGE(IF(G11=Tabela4[Placa],Tabela4[Quilometragem do hodômetro (Km)]),1),0)","v":0},{"$f":"IFERROR(LARGE(IF(G11=Tabela9[Placa],Tabela9[Próxima troca (Km)]),1),0)","v":0},{"$f":"IF(K11<=(J11*1.1),\"Troca está próxima\",\"\")","v":"Troca está próxima"}]
[null,"QUADRO DE TROCA DE ÓLEO",null,null,null,null,"OMQ-4338","HILUX","HILUX SRV D4 -D",{"$f":"IFERROR(LARGE(IF(G12=Tabela4[Placa],Tabela4[Quilometragem do hodômetro (Km)]),1),0)","v":0},{"$f":"IFERROR(LARGE(IF(G12=Tabela9[Placa],Tabela9[Próxima troca (Km)]),1),0)","v":0},"Troca está próxima"]
[null,null,null,null," ",null,"NLN-0358","FIAT","UNO MILLE",{"$f":"IFERROR(LARGE(IF(G13=Tabela4[Placa],Tabela4[Quilometragem do hodômetro (Km)]),1),0)","v":0},{"$f":"IFERROR(LARGE(IF(G13=Tabela9[Placa],Tabela9[Próxima troca (Km)]),1),0)","v":0},"Troca está próxima"]
[null,"Placa","Modelo","Data","Custo Total ","% do total","OMN-4313","FIAT","STRADA WORKING - ADM",{"$f":"IFERROR(LARGE(IF(G14=Tabela4[Placa],Tabela4[Quilometragem do hodômetro (Km)]),1),0)","v":0},{"$f":"IFERROR(LARGE(IF(G14=Tabela9[Placa],Tabela9[Próxima troca (Km)]),1),0)","v":0},{"$f":"IF(K14<=(J14*1.1),\"Troca está próxima\",\"\")","v":"Troca está próxima"}]
[null,"XXX-4444","ROÇADEIRAS - ANGLO FOSFATO","2016-06-06",28,1,"OMR-2541","FIAT","STRADA WORKING - JUNIOR",{"$f":"IFERROR(LARGE(IF(G15=Tabela4[Placa],Tabela4[Quilometragem do hodômetro (Km)]),1),0)","v":0},{"$f":"IFERROR(LARGE(IF(G15=Tabela9[Placa],Tabela9[Próxima troca (Km)]),1),0)","v":0},{"$f":"IF(K15<=(J15*1.1),\"Troca está próxima\",\"\")","v":"Troca está próxima"}]
[null,"Total Geral",null,null,28,1,"OMY-0862","FIAT","DOBLO",{"$f":"IFERROR(LARGE(IF(G16=Tabela4[Placa],Tabela4[Quilometragem do hodômetro (Km)]),1),0)","v":0},{"$f":"IFERROR(LARGE(IF(G16=Tabela9[Placa],Tabela9[Próxima troca (Km)]),1),0)","v":0},{"$f":"IF(K16<=(J16*1.1),\"Troca está próxima\",\"\")","v":"Troca está próxima"}]
[null,null,null,null,null,null,null,null,null,{"$f":"IFERROR(LARGE(IF(G17=Tabela4[Placa],Tabela4[Quilometragem do hodômetro (Km)]),1),0)","v":0},{"$f":"IFERROR(LARGE(IF(G17=Tabela9[Placa],Tabela9[Próxima troca (Km)]),1),0)","v":0},{"$f":"IF(K17<=(J17*1.1),\"Troca está próxima\",\"\")","v":"Troca está próxima"}]
[null,null,null,null,null,null,null,null,null,{"$f":"IFERROR(LARGE(IF(G18=Tabela4[Placa],Tabela4[Quilometragem do hodômetro (Km)]),1),0)","v":0},{"$f":"IFERROR(LARGE(IF(G18=Tabela9[Placa],Tabela9[Próxima troca (Km)]),1),0)","v":0},{"$f":"IF(K18<=(J18*1.1),\"Troca está próxima\",\"\")","v":"Troca está próxima"}]
[null,null,null,null,null,null,null,null,null,{"$f":"IFERROR(LARGE(IF(G19=Tabela4[Placa],Tabela4[Quilometragem do hodômetro (Km)]),1),0)","v":0},{"$f":"IFERROR(LARGE(IF(G19=Tabela9[Placa],Tabela9[Próxima troca (Km)]),1),0)","v":0},"Troca está próxima"]
[null,null,null,null,null,null,null,null,null,"CORRIGIR FORMULA",{"$f":"IFERROR(LARGE(IF(G20=Tabela9[Placa],Tabela9[Próxima troca (Km)]),1),0)","v":0},{"$f":"IF(K20<=(J20*1.1),\"Troca está próxima\",\"\")","v":{"$error":"#VALUE!"}}]

{"sheet":"7.4 Fechamento ","index":10,"n_rows":71,"n_cols":8,"rows_kept":71,"cut":false,"hidden":false,"merged":[[2,1,2,6],[0,1,0,8]]}
[null,"7.4 Fechamento Mensal"]
[]
[null,"QUADRO DE ABASTECIMENTO"]
[null,null,null,null,"Valores"]
[null,"Posto","Combustível","Modelo","LTs abastecidos","  Custo total R$","Preço Médio"]
[null,"POSTO CHAPADÃO","DIESEL S10","CAMINHÃO PIPA",206.44,674.86,3.2690000000000001]
[null,"POSTO CHAPADÃO","DIESEL S10","L200 - ANGLO FOSFATO",301.83,978.15,3.2690000000000001]
[null,"POSTO CHAPADÃO","DIESEL S10","POLIGUINDASTE - ANGLO NIOBIO",217.31,688.88,3.17]
[null,"POSTO CHAPADÃO","GASOLINA","COMBI - ANGLO FOSFATO",132.47000000000003,505.04,3.8137249999999998]
[null,"POSTO CHAPADÃO","GASOLINA","POLIGUINDASTE - ANGLO NIOBIO",195.779,620.62,3.17]
[null,"POSTO CHAPADÃO","GASOLINA","ROÇADEIRAS - ANGLO FOSFATO",18,69.099999999999994,3.8330000000000002]
[null,"POSTO CHAPADÃO","GASOLINA","ROÇADEIRAS - ANGLO NIÓBIO",18,66.58,3.7890000000000001]
[null,"POSTO CHAPADÃO Total",null,null,1089.8290000000002,3603.2299999999991,3.5047615384615387]
[null,"POSTO JK","GASOLINA","DOBLO",158.94,619.71,3.8967499999999999]
[null,"POSTO JK","GASOLINA","PIONNER - TRATOR DE JARDIM JD D170",122,481.75,3.8951428571428575]
[null,"POSTO JK","GASOLINA","ROÇADEIRAS - ANGLO FOSFATO",72,280.14,3.8866666666666667]
[null,"POSTO JK","GASOLINA","ROÇADEIRAS - ANGLO NIÓBIO",54.21,160.35000000000002,3.89]
[null,"POSTO JK","GASOLINA","ROÇADEIRAS - CAMPO BELO",30,116.97,3.8944999999999999]
[null,"POSTO JK","GASOLINA","STRADA WORKING - ADM",208.99,494.59000000000003,3.8989999999999996]
[null,"POSTO JK","GASOLINA","STRADA WORKING - JUNIOR",124.67,485.93,3.8959999999999995]
[null,"POSTO JK","GASOLINA","UNO MILLE",262.31700000000001,1022.8199999999999,3.8975000000000004]
[null,"POSTO JK Total",null,null,1033.1270000000002,3662.2600000000011,3.8950666666666671]
[null,"POSTO MAIS","GASOLINA","DOBLO",34.14,131.44,3.8490000000000002]
[null,"POSTO MAIS","GASOLINA","STRADA WORKING - ADM",38.994999999999997,150.09,3.8490000000000002]
[null,"POSTO MAIS","GASOLINA","STRADA WORKING - JUNIOR",47.69,183.58,3.8490000000000002]
[null,"POSTO MAIS","GASOLINA","UNO MILLE",68.34,263.05,3.8490000000000002]
[null,"POSTO MAIS Total",null,null,189.16499999999996,728.16000000000008,3.8490000000000002]
[null,"POSTO SÃO JOÃO","DIESEL S10","L200 - ANGLO FOSFATO",239.34000000000003,767.41,3.2033333333333331]
[null,"POSTO SÃO JOÃO","GASOLINA","COMBI - ANGLO FOSFATO",31.34,118.76,3.7890000000000001]
[null,"POSTO SÃO JOÃO","GASOLINA","ROÇADEIRAS - ANGLO FOSFATO",36,138.19999999999999,3.8380000000000001]
{"$rows_left_out":42}
{"sheet":"MENU","index":11,"n_rows":23,"n_cols":6,"rows_kept":23,"cut":false,"hidden":false,"merged":[[12,5,12,13],[17,5,17,13],[22,5,22,13]]}
[]
[]
[]
[]
[]
[]
[]
[]
[]
[]
[]
[]
[null,null,null,null,null,"INSERÇÃO DE INFORMAÇÕES"]
[]
[]
[]
[]
[null,null,null,null,null,"PLANILHAS DE ACOMPANHAMENTO"]
[]
[]
[]
[]
[null,null,null,null,null,"ANÁLISE GERENCIAL"]