{"text_format":"1","workbook":"xlsx","n_sheets":2,"sheets":["Plan1","Dados"],"not_rendered":{"charts":0,"images":0,"macros":0,"external_links":0,"defined_names":0,"comments":0,"pivot_tables":0},"unopened":[],"bounds":{"document_bytes":16777216,"sheet_cells":100000,"rows_first":2000,"rows_last":500,"rows_between":2000,"halvings":0,"cell_chars":16384,"cell_head_chars":4096},"cells_cut":0,"cells_raw":0,"read":"whole","date_system":"1900"}

{"sheet":"Plan1","index":0,"n_rows":200,"n_cols":29,"rows_kept":200,"cut":false,"hidden":false,"merged":[]}
[null,null,null,null,null,null,null,null,null,null,null,null,null,null,null,null,null,null,null,null,null,null,null,null,null,null,null,null,"2015-01-01"]
[null,null,null,null,null,null,null,null,null,null,null,null,null,null,null,null,null,null,null,null,null,null,null,null,null,null,null,null,"2015-02-01"]
[null,null,null,null,null,{"$f":"IFERROR(INDEX(Dados!$A$2:$A$1000,MATCH(ROW(A1),Dados!$X$2:$X$1000,0)),\"\")","v":"2015-06-02"},null,"2015-06-01",null,2015,null,null,null,null,null,null,null,null,null,null,null,null,null,null,null,null,null,null,"2015-03-01"]
[null,null,null,null,null,{"$f":"IFERROR(INDEX(Dados!$A$2:$A$1000,MATCH(ROW(A2),Dados!$X$2:$X$1000,0)),\"\")","v":"2015-06-03"},null,null,null,null,null,null,null,null,null,null,null,null,null,null,null,null,null,null,null,null,null,null,"2015-04-01"]
[null,null,null,null,null,{"$f":"IFERROR(INDEX(Dados!$A$2:$A$1000,MATCH(ROW(A3),Dados!$X$2:$X$1000,0)),\"\")","v":"2015-06-04"},"  **AS BORDAS SÃO COLOCADAS AUTOMATICAMENTE CONFORME O NÚMERO DE LINHAS UTILIZADOS",null,null,null,null,null,null,null,null,null,null,null,null,null,null,null,null,null,null,null,null,null,"2015-05-01"]
[null,null,null,null,null,{"$f":"IFERROR(INDEX(Dados!$A$2:$A$1000,MATCH(ROW(A4),Dados!$X$2:$X$1000,0)),\"\")","v":"2015-06-05"},"  **PARA TESTAR SELECIONE OUTRO MÊS OU OUTRO ANO, OU OS DOIS",null,null,null,null,null,null,null,null,null,null,null,null,null,null,null,null,null,null,null,null,null,"2015-06-01"]
[null,null,null,null,null,{"$f":"IFERROR(INDEX(Dados!$A$2:$A$1000,MATCH(ROW(A5),Dados!$X$2:$X$1000,0)),\"\")","v":"2015-06-06"},null,null,null,null,null,null,null,null,null,null,null,null,null,null,null,null,null,null,null,null,null,null,"2015-07-01"]
[null,null,null,null,null,{"$f":"IFERROR(INDEX(Dados!$A$2:$A$1000,MATCH(ROW(A6),Dados!$X$2:$X$1000,0)),\"\")","v":"2015-06-07"},null,null,null,null,null,null,null,null,null,null,null,null,null,null,null,null,null,null,null,null,null,null,"2015-08-01"]
[null,null,null,null,null,{"$f":"IFERROR(INDEX(Dados!$A$2:$A$1000,MATCH(ROW(A7),Dados!$X$2:$X$1000,0)),\"\")","v":"2015-06-08"},null,null,null,null,null,null,null,null,null,null,null,null,null,null,null,null,null,null,null,null,null,null,"2015-09-01"]
[null,null,null,null,null,{"$f":"IFERROR(INDEX(Dados!$A$2:$A$1000,MATCH(ROW(A8),Dados!$X$2:$X$1000,0)),\"\")","v":"2015-06-09"},null,null,null,null,null,null,null,null,null,null,null,null,null,null,null,null,null,null,null,null,null,null,"2015-10-01"]
[null,null,null,null,null,{"$f":"IFERROR(INDEX(Dados!$A$2:$A$1000,MATCH(ROW(A9),Dados!$X$2:$X$1000,0)),\"\")","v":"2015-06-10"},null,null,null,null,null,null,null,null,null,null,null,null,null,null,null,null,null,null,null,null,null,null,"2015-11-01"]
[null,null,null,null,null,{"$f":"IFERROR(INDEX(Dados!$A$2:$A$1000,MATCH(ROW(A10),Dados!$X$2:$X$1000,0)),\"\")","v":"2015-06-11"},null,null,null,null,null,null,null,null,null,null,null,null,null,null,null,null,null,null,null,null,null,null,"2015-12-01"]
[null,null,null,null,null,{"$f":"IFERROR(INDEX(Dados!$A$2:$A$1000,MATCH(ROW(A11),Dados!$X$2:$X$1000,0)),\"\")","v":"2015-06-12"},null,null,null,null,null,null,null,null,null,null,null,null,null,null,null,null,null,null,null,null,null,null,"2016-01-01"]
[null,null,null,null,null,{"$f":"IFERROR(INDEX(Dados!$A$2:$A$1000,MATCH(ROW(A12),Dados!$X$2:$X$1000,0)),\"\")","v":"2015-06-13"},null,null,null,null,null,null,null,null,null,null,null,null,null,null,null,null,null,null,null,null,null,null,"2016-02-01"]
[null,null,null,null,null,{"$f":"IFERROR(INDEX(Dados!$A$2:$A$1000,MATCH(ROW(A13),Dados!$X$2:$X$1000,0)),\"\")","v":"2015-06-14"},null,null,null,null,null,null,null,null,null,null,null,null,null,null,null,null,null,null,null,null,null,null,"2016-03-01"]
[null,null,null,null,null,{"$f":"IFERROR(INDEX(Dados!$A$2:$A$1000,MATCH(ROW(A14),Dados!$X$2:$X$1000,0)),\"\")","v":"2015-06-15"},null,null,null,null,null,null,null,null,null,null,null,null,null,null,null,null,null,null,null,null,null,null,"2016-04-01"]
[null,null,null,null,null,{"$f":"IFERROR(INDEX(Dados!$A$2:$A$1000,MATCH(ROW(A15),Dados!$X$2:$X$1000,0)),\"\")","v":"2015-06-16"},null,null,null,null,null,null,null,null,null,null,null,null,null,null,null,null,null,null,null,null,null,null,"2016-05-01"]
[null,null,null,null,null,{"$f":"IFERROR(INDEX(Dados!$A$2:$A$1000,MATCH(ROW(A16),Dados!$X$2:$X$1000,0)),\"\")","v":"2015-06-17"},null,null,null,null,null,null,null,null,null,null,null,null,null,null,null,null,null,null,null,null,null,null,"2016-06-01"]
[null,null,null,null,null,{"$f":"IFERROR(INDEX(Dados!$A$2:$A$1000,MATCH(ROW(A17),Dados!$X$2:$X$1000,0)),\"\")","v":"2015-06-18"},null,null,null,null,null,null,null,null,null,null,null,null,null,null,null,null,null,null,null,null,null,null,"2016-07-01"]
[null,null,null,null,null,{"$f":"IFERROR(INDEX(Dados!$A$2:$A$1000,MATCH(ROW(A18),Dados!$X$2:$X$1000,0)),\"\")","v":"2015-06-19"},null,null,null,null,null,null,null,null,null,null,null,null,null,null,null,null,null,null,null,null,null,null,"2016-08-01"]
[null,null,null,null,null,{"$f":"IFERROR(INDEX(Dados!$A$2:$A$1000,MATCH(ROW(A19),Dados!$X$2:$X$1000,0)),\"\")","v":"2015-06-20"},null,null,null,null,null,null,null,null,null,null,null,null,null,null,null,null,null,null,null,null,null,null,"2016-09-01"]
[null,null,null,null,null,{"$f":"IFERROR(INDEX(Dados!$A$2:$A$1000,MATCH(ROW(A20),Dados!$X$2:$X$1000,0)),\"\")","v":"2015-06-21"},null,null,null,null,null,null,null,null,null,null,null,null,null,null,null,null,null,null,null,null,null,null,"2016-10-01"]
[null,null,null,null,null,{"$f":"IFERROR(INDEX(Dados!$A$2:$A$1000,MATCH(ROW(A21),Dados!$X$2:$X$1000,0)),\"\")","v":"2015-06-22"},null,null,null,null,null,null,null,null,null,null,null,null,null,null,null,null,null,null,null,null,null,null,"2016-11-01"]
[null,null,null,null,null,{"$f":"IFERROR(INDEX(Dados!$A$2:$A$1000,MATCH(ROW(A22),Dados!$X$2:$X$1000,0)),\"\")","v":"2015-06-23"},null,null,null,null,null,null,null,null,null,null,null,null,null,null,null,null,null,null,null,null,null,null,"2016-12-01"]
[null,null,null,null,null,{"$f":"IFERROR(INDEX(Dados!$A$2:$A$1000,MATCH(ROW(A23),Dados!$X$2:$X$1000,0)),\"\")","v":"2015-06-24"},null,null,null,null,null,null,null,null,null,null,null,null,null,null,null,null,null,null,null,null,null,null,"2017-01-01"]
[null,null,null,null,null,{"$f":"IFERROR(INDEX(Dados!$A$2:$A$1000,MATCH(ROW(A24),Dados!$X$2:$X$1000,0)),\"\")","v":"2015-06-25"},null,null,null,null,null,null,null,null,null,null,null,null,null,null,null,null,null,null,null,null,null,null,"2017-02-01"]
[null,null,null,null,null,{"$f":"IFERROR(INDEX(Dados!$A$2:$A$1000,MATCH(ROW(A25),Dados!$X$2:$X$1000,0)),\"\")","v":"2015-06-26"},null,null,null,null,null,null,null,null,null,null,null,null,null,null,null,null,null,null,null,null,null,null,"2017-03-01"]
[null,null,null,null,null,{"$f":"IFERROR(INDEX(Dados!$A$2:$A$1000,MATCH(ROW(A26),Dados!$X$2:$X$1000,0)),\"\")","v":"2015-06-27"},null,null,null,null,null,null,null,null,null,null,null,null,null,null,null,null,null,null,null,null,null,null,"2017-04-01"]
[null,null,null,null,null,{"$f":"IFERROR(INDEX(Dados!$A$2:$A$1000,MATCH(ROW(A27),Dados!$X$2:$X$1000,0)),\"\")","v":"2015-06-28"},null,null,null,null,null,null,null,null,null,null,null,null,null,null,null,null,null,null,null,null,null,null,"2017-05-01"]
[null,null,null,null,null,{"$f":"IFERROR(INDEX(Dados!$A$2:$A$1000,MATCH(ROW(A28),Dados!$X$2:$X$1000,0)),\"\")","v":"2015-06-29"},null,null,null,null,null,null,null,null,null,null,null,null,null,null,null,null,null,null,null,null,null,null,"2017-06-01"]
[null,null,null,null,null,{"$f":"IFERROR(INDEX(Dados!$A$2:$A$1000,MATCH(ROW(A29),Dados!$X$2:$X$1000,0)),\"\")","v":"2015-06-30"},null,null,null,null,null,null,null,null,null,null,null,null,null,null,null,null,null,null,null,null,null,null,"2017-07-01"]
[null,null,null,null,null,{"$f":"IFERROR(INDEX(Dados!$A$2:$A$1000,MATCH(ROW(A30),Dados!$X$2:$X$1000,0)),\"\")","v":""},null,null,null,null,null,null,null,null,null,null,null,null,null,null,null,null,null,null,null,null,null,null,"2017-08-01"]
[null,null,null,null,null,{"$f":"IFERROR(INDEX(Dados!$A$2:$A$1000,MATCH(ROW(A31),Dados!$X$2:$X$1000,0)),\"\")","v":""},null,null,null,null,null,null,null,null,null,null,null,null,null,null,null,null,null,null,null,null,null,null,"2017-09-01"]
[null,null,null,null,null,{"$f":"IFERROR(INDEX(Dados!$A$2:$A$1000,MATCH(ROW(A32),Dados!$X$2:$X$1000,0)),\"\")","v":""},null,null,null,null,null,null,null,null,null,null,null,null,null,null,null,null,null,null,null,null,null,null,"2017-10-01"]
[null,null,null,null,null,{"$f":"IFERROR(INDEX(Dados!$A$2:$A$1000,MATCH(ROW(A33),Dados!$X$2:$X$1000,0)),\"\")","v":""},null,null,null,null,null,null,null,null,null,null,null,null,null,null,null,null,null,null,null,null,null,null,"2017-11-01"]
[null,null,null,null,null,{"$f":"IFERROR(INDEX(Dados!$A$2:$A$1000,MATCH(ROW(A34),Dados!$X$2:$X$1000,0)),\"\")","v":""},null,null,null,null,null,null,null,null,null,null,null,null,null,null,null,null,null,null,null,null,null,null,"2017-12-01"]
[null,null,null,null,null,{"$f":"IFERROR(INDEX(Dados!$A$2:$A$1000,MATCH(ROW(A35),Dados!$X$2:$X$1000,0)),\"\")","v":""}]
[null,null,null,null,null,{"$f":"IFERROR(INDEX(Dados!$A$2:$A$1000,MATCH(ROW(A36),Dados!$X$2:$X$1000,0)),\"\")","v":""}]
[null,null,null,null,null,{"$f":"IFERROR(INDEX(Dados!$A$2:$A$1000,MATCH(ROW(A37),Dados!$X$2:$X$1000,0)),\"\")","v":""}]
[null,null,null,null,null,{"$f":"IFERROR(INDEX(Dados!$A$2:$A$1000,MATCH(ROW(A38),Dados!$X$2:$X$1000,0)),\"\")","v":""}]
{"$rows_left_out":161}
{"sheet":"Dados","index":1,"n_rows":1000,"n_cols":24,"rows_kept":1000,"cut":false,"hidden":false,"merged":[]}
["2015-06-01",1,null,null,null,null,null,null,null,null,null,null,null,null,null,null,null,null,null,null,null,null,null,"AUX."]
["2015-06-02",2,null,null,null,null,null,null,null,null,null,null,null,null,null,null,null,null,null,null,null,null,null,{"$f":"IF(AND(MONTH($A$1:$A$1000)=MONTH(Plan1!$H$3),YEAR($A$1:$A$1000)=Plan1!$J$3),MAX(X$1:X1)+1,\"\")","v":1}]
["2015-06-03",3,null,null,null,null,null,null,null,null,null,null,null,null,null,null,null,null,null,null,null,null,null,{"$f":"IF(AND(MONTH($A$1:$A$1000)=MONTH(Plan1!$H$3),YEAR($A$1:$A$1000)=Plan1!$J$3),MAX(X$1:X2)+1,\"\")","v":2}]
["2015-06-04",4,null,null,null,null,null,null,null,null,null,null,null,null,null,null,null,null,null,null,null,null,null,{"$f":"IF(AND(MONTH($A$1:$A$1000)=MONTH(Plan1!$H$3),YEAR($A$1:$A$1000)=Plan1!$J$3),MAX(X$1:X3)+1,\"\")","v":3}]
["2015-06-05",5,null,null,null,null,null,null,null,null,null,null,null,null,null,null,null,null,null,null,null,null,null,{"$f":"IF(AND(MONTH($A$1:$A$1000)=MONTH(Plan1!$H$3),YEAR($A$1:$A$1000)=Plan1!$J$3),MAX(X$1:X4)+1,\"\")","v":4}]
["2015-06-06",6,null,null,null,null,null,null,null,null,null,null,null,null,null,null,null,null,null,null,null,null,null,{"$f":"IF(AND(MONTH($A$1:$A$1000)=MONTH(Plan1!$H$3),YEAR($A$1:$A$1000)=Plan1!$J$3),MAX(X$1:X5)+1,\"\")","v":5}]
["2015-06-07",7,null,null,null,null,null,null,null,null,null,null,null,null,null,null,null,null,null,null,null,null,null,{"$f":"IF(AND(MONTH($A$1:$A$1000)=MONTH(Plan1!$H$3),YEAR($A$1:$A$1000)=Plan1!$J$3),MAX(X$1:X6)+1,\"\")","v":6}]
["2015-06-08",8,null,null,null,null,null,null,null,null,null,null,null,null,null,null,null,null,null,null,null,null,null,{"$f":"IF(AND(MONTH($A$1:$A$1000)=MONTH(Plan1!$H$3),YEAR($A$1:$A$1000)=Plan1!$J$3),MAX(X$1:X7)+1,\"\")","v":7}]
["2015-06-09",9,null,null,null,null,null,null,null,null,null,null,null,null,null,null,null,null,null,null,null,null,null,{"$f":"IF(AND(MONTH($A$1:$A$1000)=MONTH(Plan1!$H$3),YEAR($A$1:$A$1000)=Plan1!$J$3),MAX(X$1:X8)+1,\"\")","v":8}]
["2015-06-10",10,null,null,null,null,null,null,null,null,null,null,null,null,null,null,null,null,null,null,null,null,null,{"$f":"IF(AND(MONTH($A$1:$A$1000)=MONTH(Plan1!$H$3),YEAR($A$1:$A$1000)=Plan1!$J$3),MAX(X$1:X9)+1,\"\")","v":9}]
["2015-06-11",1,null,null,null,null,null,null,null,null,null,null,null,null,null,null,null,null,null,null,null,null,null,{"$f":"IF(AND(MONTH($A$1:$A$1000)=MONTH(Plan1!$H$3),YEAR($A$1:$A$1000)=Plan1!$J$3),MAX(X$1:X10)+1,\"\")","v":10}]
["2015-06-12",2,null,null,null,null,null,null,null,null,null,null,null,null,null,null,null,null,null,null,null,null,null,{"$f":"IF(AND(MONTH($A$1:$A$1000)=MONTH(Plan1!$H$3),YEAR($A$1:$A$1000)=Plan1!$J$3),MAX(X$1:X11)+1,\"\")","v":11}]
["2015-06-13",3,null,null,null,null,null,null,null,null,null,null,null,null,null,null,null,null,null,null,null,null,null,{"$f":"IF(AND(MONTH($A$1:$A$1000)=MONTH(Plan1!$H$3),YEAR($A$1:$A$1000)=Plan1!$J$3),MAX(X$1:X12)+1,\"\")","v":12}]
["2015-06-14",4,null,null,null,null,null,null,null,null,null,null,null,null,null,null,null,null,null,null,null,null,null,{"$f":"IF(AND(MONTH($A$1:$A$1000)=MONTH(Plan1!$H$3),YEAR($A$1:$A$1000)=Plan1!$J$3),MAX(X$1:X13)+1,\"\")","v":13}]
["2015-06-15",5,null,null,null,null,null,null,null,null,null,null,null,null,null,null,null,null,null,null,null,null,null,{"$f":"IF(AND(MONTH($A$1:$A$1000)=MONTH(Plan1!$H$3),YEAR($A$1:$A$1000)=Plan1!$J$3),MAX(X$1:X14)+1,\"\")","v":14}]
["2015-06-16",6,null,null,null,null,null,null,null,null,null,null,null,null,null,null,null,null,null,null,null,null,null,{"$f":"IF(AND(MONTH($A$1:$A$1000)=MONTH(Plan1!$H$3),YEAR($A$1:$A$1000)=Plan1!$J$3),MAX(X$1:X15)+1,\"\")","v":15}]
["2015-06-17",7,null,null,null,null,null,null,null,null,null,null,null,null,null,null,null,null,null,null,null,null,null,{"$f":"IF(AND(MONTH($A$1:$A$1000)=MONTH(Plan1!$H$3),YEAR($A$1:$A$1000)=Plan1!$J$3),MAX(X$1:X16)+1,\"\")","v":16}]
["2015-06-18",8,null,null,null,null,null,null,null,null,null,null,null,null,null,null,null,null,null,null,null,null,null,{"$f":"IF(AND(MONTH($A$1:$A$1000)=MONTH(Plan1!$H$3),YEAR($A$1:$A$1000)=Plan1!$J$3),MAX(X$1:X17)+1,\"\")","v":17}]
["2015-06-19",9,null,null,null,null,null,null,null,null,null,null,null,null,null,null,null,null,null,null,null,null,null,{"$f":"IF(AND(MONTH($A$1:$A$1000)=MONTH(Plan1!$H$3),YEAR($A$1:$A$1000)=Plan1!$J$3),MAX(X$1:X18)+1,\"\")","v":18}]
["2015-06-20",10,null,null,null,null,null,null,null,null,null,null,null,null,null,null,null,null,null,null,null,null,null,{"$f":"IF(AND(MONTH($A$1:$A$1000)=MONTH(Plan1!$H$3),YEAR($A$1:$A$1000)=Plan1!$J$3),MAX(X$1:X19)+1,\"\")","v":19}]
["2015-06-21",11,null,null,null,null,null,null,null,null,null,null,null,null,null,null,null,null,null,null,null,null,null,{"$f":"IF(AND(MONTH($A$1:$A$1000)=MONTH(Plan1!$H$3),YEAR($A$1:$A$1000)=Plan1!$J$3),MAX(X$1:X20)+1,\"\")","v":20}]
["2015-06-22",12,null,null,null,null,null,null,null,null,null,null,null,null,null,null,null,null,null,null,null,null,null,{"$f":"IF(AND(MONTH($A$1:$A$1000)=MONTH(Plan1!$H$3),YEAR($A$1:$A$1000)=Plan1!$J$3),MAX(X$1:X21)+1,\"\")","v":21}]
["2015-06-23",13,null,null,null,null,null,null,null,null,null,null,null,null,null,null,null,null,null,null,null,null,null,{"$f":"IF(AND(MONTH($A$1:$A$1000)=MONTH(Plan1!$H$3),YEAR($A$1:$A$1000)=Plan1!$J$3),MAX(X$1:X22)+1,\"\")","v":22}]
["2015-06-24",1,null,null,null,null,null,null,null,null,null,null,null,null,null,null,null,null,null,null,null,null,null,{"$f":"IF(AND(MONTH($A$1:$A$1000)=MONTH(Plan1!$H$3),YEAR($A$1:$A$1000)=Plan1!$J$3),MAX(X$1:X23)+1,\"\")","v":23}]
["2015-06-25",2,null,null,null,null,null,null,null,null,null,null,null,null,null,null,null,null,null,null,null,null,null,{"$f":"IF(AND(MONTH($A$1:$A$1000)=MONTH(Plan1!$H$3),YEAR($A$1:$A$1000)=Plan1!$J$3),MAX(X$1:X24)+1,\"\")","v":24}]
["2015-06-26",3,null,null,null,null,null,null,null,null,null,null,null,null,null,null,null,null,null,null,null,null,null,{"$f":"IF(AND(MONTH($A$1:$A$1000)=MONTH(Plan1!$H$3),YEAR($A$1:$A$1000)=Plan1!$J$3),MAX(X$1:X25)+1,\"\")","v":25}]
["2015-06-27",4,null,null,null,null,null,null,null,null,null,null,null,null,null,null,null,null,null,null,null,null,null,{"$f":"IF(AND(MONTH($A$1:$A$1000)=MONTH(Plan1!$H$3),YEAR($A$1:$A$1000)=Plan1!$J$3),MAX(X$1:X26)+1,\"\")","v":26}]
["2015-06-28",5,null,null,null,null,null,null,null,null,null,null,null,null,null,null,null,null,null,null,null,null,null,{"$f":"IF(AND(MONTH($A$1:$A$1000)=MONTH(Plan1!$H$3),YEAR($A$1:$A$1000)=Plan1!$J$3),MAX(X$1:X27)+1,\"\")","v":27}]
["2015-06-29",6,null,null,null,null,null,null,null,null,null,null,null,null,null,null,null,null,null,null,null,null,null,{"$f":"IF(AND(MONTH($A$1:$A$1000)=MONTH(Plan1!$H$3),YEAR($A$1:$A$1000)=Plan1!$J$3),MAX(X$1:X28)+1,\"\")","v":28}]
["2015-06-30",7,null,null,null,null,null,null,null,null,null,null,null,null,null,null,null,null,null,null,null,null,null,{"$f":"IF(AND(MONTH($A$1:$A$1000)=MONTH(Plan1!$H$3),YEAR($A$1:$A$1000)=Plan1!$J$3),MAX(X$1:X29)+1,\"\")","v":29}]
["2015-07-01",8,null,null,null,null,null,null,null,null,null,null,null,null,null,null,null,null,null,null,null,null,null,{"$f":"IF(AND(MONTH($A$1:$A$1000)=MONTH(Plan1!$H$3),YEAR($A$1:$A$1000)=Plan1!$J$3),MAX(X$1:X30)+1,\"\")","v":""}]
["2015-07-02",9,null,null,null,null,null,null,null,null,null,null,null,null,null,null,null,null,null,null,null,null,null,{"$f":"IF(AND(MONTH($A$1:$A$1000)=MONTH(Plan1!$H$3),YEAR($A$1:$A$1000)=Plan1!$J$3),MAX(X$1:X31)+1,\"\")","v":""}]
["2015-07-03",10,null,null,null,null,null,null,null,null,null,null,null,null,null,null,null,null,null,null,null,null,null,{"$f":"IF(AND(MONTH($A$1:$A$1000)=MONTH(Plan1!$H$3),YEAR($A$1:$A$1000)=Plan1!$J$3),MAX(X$1:X32)+1,\"\")","v":""}]
["2015-07-04",11,null,null,null,null,null,null,null,null,null,null,null,null,null,null,null,null,null,null,null,null,null,{"$f":"IF(AND(MONTH($A$1:$A$1000)=MONTH(Plan1!$H$3),YEAR($A$1:$A$1000)=Plan1!$J$3),MAX(X$1:X33)+1,\"\")","v":""}]
["2015-07-05",12,null,null,null,null,null,null,null,null,null,null,null,null,null,null,null,null,null,null,null,null,null,{"$f":"IF(AND(MONTH($A$1:$A$1000)=MONTH(Plan1!$H$3),YEAR($A$1:$A$1000)=Plan1!$J$3),MAX(X$1:X34)+1,\"\")","v":""}]
["2015-07-06",13,null,null,null,null,null,null,null,null,null,null,null,null,null,null,null,null,null,null,null,null,null,{"$f":"IF(AND(MONTH($A$1:$A$1000)=MONTH(Plan1!$H$3),YEAR($A$1:$A$1000)=Plan1!$J$3),MAX(X$1:X35)+1,\"\")","v":""}]
["2015-07-07",14,null,null,null,null,null,null,null,null,null,null,null,null,null,null,null,null,null,null,null,null,null,{"$f":"IF(AND(MONTH($A$1:$A$1000)=MONTH(Plan1!$H$3),YEAR($A$1:$A$1000)=Plan1!$J$3),MAX(X$1:X36)+1,\"\")","v":""}]
["2015-07-08",15,null,null,null,null,null,null,null,null,null,null,null,null,null,null,null,null,null,null,null,null,null,{"$f":"IF(AND(MONTH($A$1:$A$1000)=MONTH(Plan1!$H$3),YEAR($A$1:$A$1000)=Plan1!$J$3),MAX(X$1:X37)+1,\"\")","v":""}]
["2015-07-09",16,null,null,null,null,null,null,null,null,null,null,null,null,null,null,null,null,null,null,null,null,null,{"$f":"IF(AND(MONTH($A$1:$A$1000)=MONTH(Plan1!$H$3),YEAR($A$1:$A$1000)=Plan1!$J$3),MAX(X$1:X38)+1,\"\")","v":""}]
["2015-07-10",17,null,null,null,null,null,null,null,null,null,null,null,null,null,null,null,null,null,null,null,null,null,{"$f":"IF(AND(MONTH($A$1:$A$1000)=MONTH(Plan1!$H$3),YEAR($A$1:$A$1000)=Plan1!$J$3),MAX(X$1:X39)+1,\"\")","v":""}]
{"$rows_left_out":960}