{"text_format":"1","workbook":"xlsx","n_sheets":3,"sheets":["Plan1","Plan2","Plan3"],"not_rendered":{"charts":0,"images":0,"macros":0,"external_links":1,"defined_names":0,"comments":0,"pivot_tables":0},"unopened":[],"bounds":{"document_bytes":16777216,"sheet_cells":100000,"rows_first":2000,"rows_last":500,"rows_between":2000,"halvings":0,"cell_chars":16384,"cell_head_chars":4096},"cells_cut":0,"cells_raw":0,"read":"whole","date_system":"1900"}

{"sheet":"Plan1","index":0,"n_rows":35,"n_cols":18,"rows_kept":35,"cut":false,"hidden":false,"merged":[]}
[{"$f":"TODAY()","v":"2016-05-31"},"Vendedor","Valor Vd","Venda","Pesq","Art","C/T","Preço","Troca","Res","Cred","Atend","Itens","IA","VM","PM","TC","Cad"]
[{"$f":"TODAY()","v":"2016-05-31"},"João",1000,3,1,2,2,1,2,1,1,{"$f":"SUM(D2:K2)","v":13},3,{"$f":"IFERROR(M2/D2,\"\")","v":1},{"$f":"IFERROR(C2/D2,\"\")","v":333.33333333333331},{"$f":"IFERROR(C2/M2,\"\")","v":333.33333333333331},{"$f":"IFERROR(D2/L2,\"\")","v":0.23076923076923078},2]
["2016-05-31","Mário",200,1,1,1,1,3,1,2,1,{"$f":"SUM(D3:K3)","v":11},1,{"$f":"IFERROR(M3/D3,\"\")","v":1},{"$f":"IFERROR(C3/D3,\"\")","v":200},{"$f":"IFERROR(C3/M3,\"\")","v":200},{"$f":"IFERROR(D3/L3,\"\")","v":9.0909090909090912E-2},1]
[null,{"$f":"IFERROR(INDEX('[1]Lista de Vez'!$D$20:'[1]Lista de Vez'!$D$117, MATCH(0, COUNTIF(B3:$CJ$5, '[1]Lista de Vez'!$D$20:'[1]Lista de Vez'!$D$117), 0)),\"\")","v":""},{"$f":"SUMIFS('[1]Lista de Vez'!$L$20:'[1]Lista de Vez'!$L$118,'[1]Lista de Vez'!$D$20:'[1]Lista de Vez'!$D$118,B4,'[1]Lista de Vez'!$F$20:'[1]Lista de Vez'!$F$118,\"Venda\")","v":0},{"$f":"COUNTIFS('[1]Lista de Vez'!$D$20:$D$117,B4,'[1]Lista de Vez'!$F$20:$F$117,\"Venda\")","v":0},{"$f":"COUNTIFS('[1]Lista de Vez'!$D$20:$D$117,B4,'[1]Lista de Vez'!$F$20:$F$117,\"Pesquisa\")","v":0},{"$f":"COUNTIFS('[1]Lista de Vez'!$D$20:$D$117,B4,'[1]Lista de Vez'!$F$20:$F$117,\"Artigo\")","v":0},{"$f":"COUNTIFS('[1]Lista de Vez'!$D$20:$D$117,B4,'[1]Lista de Vez'!$F$20:$F$117,\"Cor/Tam\")","v":0},{"$f":"COUNTIFS('[1]Lista de Vez'!$D$20:$D$117,B4,'[1]Lista de Vez'!$F$20:$F$117,\"Preço\")","v":0},{"$f":"COUNTIFS('[1]Lista de Vez'!$D$20:$D$117,B4,'[1]Lista de Vez'!$F$20:$F$117,\"Troca\")","v":0},{"$f":"COUNTIFS('[1]Lista de Vez'!$D$20:$D$117,B4,'[1]Lista de Vez'!$F$20:$F$117,\"Reserva\")","v":0},{"$f":"COUNTIFS('[1]Lista de Vez'!$D$20:$D$117,B4,'[1]Lista de Vez'!$F$20:$F$117,\"Credito\")","v":0},0,{"$f":"SUMIFS('[1]Lista de Vez'!$N$20:'[1]Lista de Vez'!$N$117,'[1]Lista de Vez'!$D$20:'[1]Lista de Vez'!$D$117,B4,'[1]Lista de Vez'!$F$20:'[1]Lista de Vez'!$F$117,\"Venda\")","v":0},"","","","",{"$f":"COUNTIFS('[1]Lista de Vez'!$D$20:$D$117,B4,'[1]Lista de Vez'!$Y$20:$Y$117,\"S\")","v":0}]
[null,{"$f":"IFERROR(INDEX('[1]Lista de Vez'!$D$20:'[1]Lista de Vez'!$D$117, MATCH(0, COUNTIF(B4:$CJ$5, '[1]Lista de Vez'!$D$20:'[1]Lista de Vez'!$D$117), 0)),\"\")","v":""},{"$f":"SUMIFS('[1]Lista de Vez'!$L$20:'[1]Lista de Vez'!$L$118,'[1]Lista de Vez'!$D$20:'[1]Lista de Vez'!$D$118,B5,'[1]Lista de Vez'!$F$20:'[1]Lista de Vez'!$F$118,\"Venda\")","v":0},{"$f":"COUNTIFS('[1]Lista de Vez'!$D$20:$D$117,B5,'[1]Lista de Vez'!$F$20:$F$117,\"Venda\")","v":0},{"$f":"COUNTIFS('[1]Lista de Vez'!$D$20:$D$117,B5,'[1]Lista de Vez'!$F$20:$F$117,\"Pesquisa\")","v":0},{"$f":"COUNTIFS('[1]Lista de Vez'!$D$20:$D$117,B5,'[1]Lista de Vez'!$F$20:$F$117,\"Artigo\")","v":0},{"$f":"COUNTIFS('[1]Lista de Vez'!$D$20:$D$117,B5,'[1]Lista de Vez'!$F$20:$F$117,\"Cor/Tam\")","v":0},{"$f":"COUNTIFS('[1]Lista de Vez'!$D$20:$D$117,B5,'[1]Lista de Vez'!$F$20:$F$117,\"Preço\")","v":0},{"$f":"COUNTIFS('[1]Lista de Vez'!$D$20:$D$117,B5,'[1]Lista de Vez'!$F$20:$F$117,\"Troca\")","v":0},{"$f":"COUNTIFS('[1]Lista de Vez'!$D$20:$D$117,B5,'[1]Lista de Vez'!$F$20:$F$117,\"Reserva\")","v":0},{"$f":"COUNTIFS('[1]Lista de Vez'!$D$20:$D$117,B5,'[1]Lista de Vez'!$F$20:$F$117,\"Credito\")","v":0},0,{"$f":"SUMIFS('[1]Lista de Vez'!$N$20:'[1]Lista de Vez'!$N$117,'[1]Lista de Vez'!$D$20:'[1]Lista de Vez'!$D$117,B5,'[1]Lista de Vez'!$F$20:'[1]Lista de Vez'!$F$117,\"Venda\")","v":0},"","","","",{"$f":"COUNTIFS('[1]Lista de Vez'!$D$20:$D$117,B5,'[1]Lista de Vez'!$Y$20:$Y$117,\"S\")","v":0}]
[null,{"$f":"IFERROR(INDEX('[1]Lista de Vez'!$D$20:'[1]Lista de Vez'!$D$117, MATCH(0, COUNTIF(B$5:$CJ5, '[1]Lista de Vez'!$D$20:'[1]Lista de Vez'!$D$117), 0)),\"\")","v":""},{"$f":"SUMIFS('[1]Lista de Vez'!$L$20:'[1]Lista de Vez'!$L$118,'[1]Lista de Vez'!$D$20:'[1]Lista de Vez'!$D$118,B6,'[1]Lista de Vez'!$F$20:'[1]Lista de Vez'!$F$118,\"Venda\")","v":0},{"$f":"COUNTIFS('[1]Lista de Vez'!$D$20:$D$117,B6,'[1]Lista de Vez'!$F$20:$F$117,\"Venda\")","v":0},{"$f":"COUNTIFS('[1]Lista de Vez'!$D$20:$D$117,B6,'[1]Lista de Vez'!$F$20:$F$117,\"Pesquisa\")","v":0},{"$f":"COUNTIFS('[1]Lista de Vez'!$D$20:$D$117,B6,'[1]Lista de Vez'!$F$20:$F$117,\"Artigo\")","v":0},{"$f":"COUNTIFS('[1]Lista de Vez'!$D$20:$D$117,B6,'[1]Lista de Vez'!$F$20:$F$117,\"Cor/Tam\")","v":0},{"$f":"COUNTIFS('[1]Lista de Vez'!$D$20:$D$117,B6,'[1]Lista de Vez'!$F$20:$F$117,\"Preço\")","v":0},{"$f":"COUNTIFS('[1]Lista de Vez'!$D$20:$D$117,B6,'[1]Lista de Vez'!$F$20:$F$117,\"Troca\")","v":0},{"$f":"COUNTIFS('[1]Lista de Vez'!$D$20:$D$117,B6,'[1]Lista de Vez'!$F$20:$F$117,\"Reserva\")","v":0},{"$f":"COUNTIFS('[1]Lista de Vez'!$D$20:$D$117,B6,'[1]Lista de Vez'!$F$20:$F$117,\"Credito\")","v":0},0,{"$f":"SUMIFS('[1]Lista de Vez'!$N$20:'[1]Lista de Vez'!$N$117,'[1]Lista de Vez'!$D$20:'[1]Lista de Vez'!$D$117,B6,'[1]Lista de Vez'!$F$20:'[1]Lista de Vez'!$F$117,\"Venda\")","v":0},"","","","",{"$f":"COUNTIFS('[1]Lista de Vez'!$D$20:$D$117,B6,'[1]Lista de Vez'!$Y$20:$Y$117,\"S\")","v":0}]
[null,{"$f":"IFERROR(INDEX('[1]Lista de Vez'!$D$20:'[1]Lista de Vez'!$D$117, MATCH(0, COUNTIF(B$5:$CJ6, '[1]Lista de Vez'!$D$20:'[1]Lista de Vez'!$D$117), 0)),\"\")","v":""},{"$f":"SUMIFS('[1]Lista de Vez'!$L$20:'[1]Lista de Vez'!$L$118,'[1]Lista de Vez'!$D$20:'[1]Lista de Vez'!$D$118,B7,'[1]Lista de Vez'!$F$20:'[1]Lista de Vez'!$F$118,\"Venda\")","v":0},{"$f":"COUNTIFS('[1]Lista de Vez'!$D$20:$D$117,B7,'[1]Lista de Vez'!$F$20:$F$117,\"Venda\")","v":0},{"$f":"COUNTIFS('[1]Lista de Vez'!$D$20:$D$117,B7,'[1]Lista de Vez'!$F$20:$F$117,\"Pesquisa\")","v":0},{"$f":"COUNTIFS('[1]Lista de Vez'!$D$20:$D$117,B7,'[1]Lista de Vez'!$F$20:$F$117,\"Artigo\")","v":0},{"$f":"COUNTIFS('[1]Lista de Vez'!$D$20:$D$117,B7,'[1]Lista de Vez'!$F$20:$F$117,\"Cor/Tam\")","v":0},{"$f":"COUNTIFS('[1]Lista de Vez'!$D$20:$D$117,B7,'[1]Lista de Vez'!$F$20:$F$117,\"Preço\")","v":0},{"$f":"COUNTIFS('[1]Lista de Vez'!$D$20:$D$117,B7,'[1]Lista de Vez'!$F$20:$F$117,\"Troca\")","v":0},{"$f":"COUNTIFS('[1]Lista de Vez'!$D$20:$D$117,B7,'[1]Lista de Vez'!$F$20:$F$117,\"Reserva\")","v":0},{"$f":"COUNTIFS('[1]Lista de Vez'!$D$20:$D$117,B7,'[1]Lista de Vez'!$F$20:$F$117,\"Credito\")","v":0},0,{"$f":"SUMIFS('[1]Lista de Vez'!$N$20:'[1]Lista de Vez'!$N$117,'[1]Lista de Vez'!$D$20:'[1]Lista de Vez'!$D$117,B7,'[1]Lista de Vez'!$F$20:'[1]Lista de Vez'!$F$117,\"Venda\")","v":0},"","","","",{"$f":"COUNTIFS('[1]Lista de Vez'!$D$20:$D$117,B7,'[1]Lista de Vez'!$Y$20:$Y$117,\"S\")","v":0}]
[null,{"$f":"IFERROR(INDEX('[1]Lista de Vez'!$D$20:'[1]Lista de Vez'!$D$117, MATCH(0, COUNTIF(B$5:$CJ7, '[1]Lista de Vez'!$D$20:'[1]Lista de Vez'!$D$117), 0)),\"\")","v":""},{"$f":"SUMIFS('[1]Lista de Vez'!$L$20:'[1]Lista de Vez'!$L$118,'[1]Lista de Vez'!$D$20:'[1]Lista de Vez'!$D$118,B8,'[1]Lista de Vez'!$F$20:'[1]Lista de Vez'!$F$118,\"Venda\")","v":0},{"$f":"COUNTIFS('[1]Lista de Vez'!$D$20:$D$117,B8,'[1]Lista de Vez'!$F$20:$F$117,\"Venda\")","v":0},{"$f":"COUNTIFS('[1]Lista de Vez'!$D$20:$D$117,B8,'[1]Lista de Vez'!$F$20:$F$117,\"Pesquisa\")","v":0},{"$f":"COUNTIFS('[1]Lista de Vez'!$D$20:$D$117,B8,'[1]Lista de Vez'!$F$20:$F$117,\"Artigo\")","v":0},{"$f":"COUNTIFS('[1]Lista de Vez'!$D$20:$D$117,B8,'[1]Lista de Vez'!$F$20:$F$117,\"Cor/Tam\")","v":0},{"$f":"COUNTIFS('[1]Lista de Vez'!$D$20:$D$117,B8,'[1]Lista de Vez'!$F$20:$F$117,\"Preço\")","v":0},{"$f":"COUNTIFS('[1]Lista de Vez'!$D$20:$D$117,B8,'[1]Lista de Vez'!$F$20:$F$117,\"Troca\")","v":0},{"$f":"COUNTIFS('[1]Lista de Vez'!$D$20:$D$117,B8,'[1]Lista de Vez'!$F$20:$F$117,\"Reserva\")","v":0},{"$f":"COUNTIFS('[1]Lista de Vez'!$D$20:$D$117,B8,'[1]Lista de Vez'!$F$20:$F$117,\"Credito\")","v":0},0,{"$f":"SUMIFS('[1]Lista de Vez'!$N$20:'[1]Lista de Vez'!$N$117,'[1]Lista de Vez'!$D$20:'[1]Lista de Vez'!$D$117,B8,'[1]Lista de Vez'!$F$20:'[1]Lista de Vez'!$F$117,\"Venda\")","v":0},"","","","",{"$f":"COUNTIFS('[1]Lista de Vez'!$D$20:$D$117,B8,'[1]Lista de Vez'!$Y$20:$Y$117,\"S\")","v":0}]
[null,{"$f":"IFERROR(INDEX('[1]Lista de Vez'!$D$20:'[1]Lista de Vez'!$D$117, MATCH(0, COUNTIF(B$5:$CJ8, '[1]Lista de Vez'!$D$20:'[1]Lista de Vez'!$D$117), 0)),\"\")","v":""},{"$f":"SUMIFS('[1]Lista de Vez'!$L$20:'[1]Lista de Vez'!$L$118,'[1]Lista de Vez'!$D$20:'[1]Lista de Vez'!$D$118,B9,'[1]Lista de Vez'!$F$20:'[1]Lista de Vez'!$F$118,\"Venda\")","v":0},{"$f":"COUNTIFS('[1]Lista de Vez'!$D$20:$D$117,B9,'[1]Lista de Vez'!$F$20:$F$117,\"Venda\")","v":0},{"$f":"COUNTIFS('[1]Lista de Vez'!$D$20:$D$117,B9,'[1]Lista de Vez'!$F$20:$F$117,\"Pesquisa\")","v":0},{"$f":"COUNTIFS('[1]Lista de Vez'!$D$20:$D$117,B9,'[1]Lista de Vez'!$F$20:$F$117,\"Artigo\")","v":0},{"$f":"COUNTIFS('[1]Lista de Vez'!$D$20:$D$117,B9,'[1]Lista de Vez'!$F$20:$F$117,\"Cor/Tam\")","v":0},{"$f":"COUNTIFS('[1]Lista de Vez'!$D$20:$D$117,B9,'[1]Lista de Vez'!$F$20:$F$117,\"Preço\")","v":0},{"$f":"COUNTIFS('[1]Lista de Vez'!$D$20:$D$117,B9,'[1]Lista de Vez'!$F$20:$F$117,\"Troca\")","v":0},{"$f":"COUNTIFS('[1]Lista de Vez'!$D$20:$D$117,B9,'[1]Lista de Vez'!$F$20:$F$117,\"Reserva\")","v":0},{"$f":"COUNTIFS('[1]Lista de Vez'!$D$20:$D$117,B9,'[1]Lista de Vez'!$F$20:$F$117,\"Credito\")","v":0},0,{"$f":"SUMIFS('[1]Lista de Vez'!$N$20:'[1]Lista de Vez'!$N$117,'[1]Lista de Vez'!$D$20:'[1]Lista de Vez'!$D$117,B9,'[1]Lista de Vez'!$F$20:'[1]Lista de Vez'!$F$117,\"Venda\")","v":0},"","","","",{"$f":"COUNTIFS('[1]Lista de Vez'!$D$20:$D$117,B9,'[1]Lista de Vez'!$Y$20:$Y$117,\"S\")","v":0}]
[null,{"$f":"IFERROR(INDEX('[1]Lista de Vez'!$D$20:'[1]Lista de Vez'!$D$117, MATCH(0, COUNTIF(B$5:$CJ9, '[1]Lista de Vez'!$D$20:'[1]Lista de Vez'!$D$117), 0)),\"\")","v":""},{"$f":"SUMIFS('[1]Lista de Vez'!$L$20:'[1]Lista de Vez'!$L$118,'[1]Lista de Vez'!$D$20:'[1]Lista de Vez'!$D$118,B10,'[1]Lista de Vez'!$F$20:'[1]Lista de Vez'!$F$118,\"Venda\")","v":0},{"$f":"COUNTIFS('[1]Lista de Vez'!$D$20:$D$117,B10,'[1]Lista de Vez'!$F$20:$F$117,\"Venda\")","v":0},{"$f":"COUNTIFS('[1]Lista de Vez'!$D$20:$D$117,B10,'[1]Lista de Vez'!$F$20:$F$117,\"Pesquisa\")","v":0},{"$f":"COUNTIFS('[1]Lista de Vez'!$D$20:$D$117,B10,'[1]Lista de Vez'!$F$20:$F$117,\"Artigo\")","v":0},{"$f":"COUNTIFS('[1]Lista de Vez'!$D$20:$D$117,B10,'[1]Lista de Vez'!$F$20:$F$117,\"Cor/Tam\")","v":0},{"$f":"COUNTIFS('[1]Lista de Vez'!$D$20:$D$117,B10,'[1]Lista de Vez'!$F$20:$F$117,\"Preço\")","v":0},{"$f":"COUNTIFS('[1]Lista de Vez'!$D$20:$D$117,B10,'[1]Lista de Vez'!$F$20:$F$117,\"Troca\")","v":0},{"$f":"COUNTIFS('[1]Lista de Vez'!$D$20:$D$117,B10,'[1]Lista de Vez'!$F$20:$F$117,\"Reserva\")","v":0},{"$f":"COUNTIFS('[1]Lista de Vez'!$D$20:$D$117,B10,'[1]Lista de Vez'!$F$20:$F$117,\"Credito\")","v":0},0,{"$f":"SUMIFS('[1]Lista de Vez'!$N$20:'[1]Lista de Vez'!$N$117,'[1]Lista de Vez'!$D$20:'[1]Lista de Vez'!$D$117,B10,'[1]Lista de Vez'!$F$20:'[1]Lista de Vez'!$F$117,\"Venda\")","v":0},"","","","",{"$f":"COUNTIFS('[1]Lista de Vez'!$D$20:$D$117,B10,'[1]Lista de Vez'!$Y$20:$Y$117,\"S\")","v":0}]
[{"$f":"IF(OR(B11 = 0,B11=\"\"),\"\",$CI$5)","v":""},{"$f":"IFERROR(INDEX('[1]Lista de Vez'!$D$20:'[1]Lista de Vez'!$D$117, MATCH(0, COUNTIF(B$5:$CJ10, '[1]Lista de Vez'!$D$20:'[1]Lista de Vez'!$D$117), 0)),\"\")","v":""},{"$f":"SUMIFS('[1]Lista de Vez'!$L$20:'[1]Lista de Vez'!$L$118,'[1]Lista de Vez'!$D$20:'[1]Lista de Vez'!$D$118,B11,'[1]Lista de Vez'!$F$20:'[1]Lista de Vez'!$F$118,\"Venda\")","v":0},{"$f":"COUNTIFS('[1]Lista de Vez'!$D$20:$D$117,B11,'[1]Lista de Vez'!$F$20:$F$117,\"Venda\")","v":0},{"$f":"COUNTIFS('[1]Lista de Vez'!$D$20:$D$117,B11,'[1]Lista de Vez'!$F$20:$F$117,\"Pesquisa\")","v":0},{"$f":"COUNTIFS('[1]Lista de Vez'!$D$20:$D$117,B11,'[1]Lista de Vez'!$F$20:$F$117,\"Artigo\")","v":0},{"$f":"COUNTIFS('[1]Lista de Vez'!$D$20:$D$117,B11,'[1]Lista de Vez'!$F$20:$F$117,\"Cor/Tam\")","v":0},{"$f":"COUNTIFS('[1]Lista de Vez'!$D$20:$D$117,B11,'[1]Lista de Vez'!$F$20:$F$117,\"Preço\")","v":0},{"$f":"COUNTIFS('[1]Lista de Vez'!$D$20:$D$117,B11,'[1]Lista de Vez'!$F$20:$F$117,\"Troca\")","v":0},{"$f":"COUNTIFS('[1]Lista de Vez'!$D$20:$D$117,B11,'[1]Lista de Vez'!$F$20:$F$117,\"Reserva\")","v":0},{"$f":"COUNTIFS('[1]Lista de Vez'!$D$20:$D$117,B11,'[1]Lista de Vez'!$F$20:$F$117,\"Credito\")","v":0},0,{"$f":"SUMIFS('[1]Lista de Vez'!$N$20:'[1]Lista de Vez'!$N$117,'[1]Lista de Vez'!$D$20:'[1]Lista de Vez'!$D$117,B11,'[1]Lista de Vez'!$F$20:'[1]Lista de Vez'!$F$117,\"Venda\")","v":0},"","","","",{"$f":"COUNTIFS('[1]Lista de Vez'!$D$20:$D$117,B11,'[1]Lista de Vez'!$Y$20:$Y$117,\"S\")","v":0}]
["",{"$f":"IFERROR(INDEX('[1]Lista de Vez'!$D$20:'[1]Lista de Vez'!$D$117, MATCH(0, COUNTIF(B$5:$CJ11, '[1]Lista de Vez'!$D$20:'[1]Lista de Vez'!$D$117), 0)),\"\")","v":""},{"$f":"SUMIFS('[1]Lista de Vez'!$L$20:'[1]Lista de Vez'!$L$118,'[1]Lista de Vez'!$D$20:'[1]Lista de Vez'!$D$118,B12,'[1]Lista de Vez'!$F$20:'[1]Lista de Vez'!$F$118,\"Venda\")","v":0},{"$f":"COUNTIFS('[1]Lista de Vez'!$D$20:$D$117,B12,'[1]Lista de Vez'!$F$20:$F$117,\"Venda\")","v":0},{"$f":"COUNTIFS('[1]Lista de Vez'!$D$20:$D$117,B12,'[1]Lista de Vez'!$F$20:$F$117,\"Pesquisa\")","v":0},{"$f":"COUNTIFS('[1]Lista de Vez'!$D$20:$D$117,B12,'[1]Lista de Vez'!$F$20:$F$117,\"Artigo\")","v":0},{"$f":"COUNTIFS('[1]Lista de Vez'!$D$20:$D$117,B12,'[1]Lista de Vez'!$F$20:$F$117,\"Cor/Tam\")","v":0},{"$f":"COUNTIFS('[1]Lista de Vez'!$D$20:$D$117,B12,'[1]Lista de Vez'!$F$20:$F$117,\"Preço\")","v":0},{"$f":"COUNTIFS('[1]Lista de Vez'!$D$20:$D$117,B12,'[1]Lista de Vez'!$F$20:$F$117,\"Troca\")","v":0},{"$f":"COUNTIFS('[1]Lista de Vez'!$D$20:$D$117,B12,'[1]Lista de Vez'!$F$20:$F$117,\"Reserva\")","v":0},{"$f":"COUNTIFS('[1]Lista de Vez'!$D$20:$D$117,B12,'[1]Lista de Vez'!$F$20:$F$117,\"Credito\")","v":0},0,{"$f":"SUMIFS('[1]Lista de Vez'!$N$20:'[1]Lista de Vez'!$N$117,'[1]Lista de Vez'!$D$20:'[1]Lista de Vez'!$D$117,B12,'[1]Lista de Vez'!$F$20:'[1]Lista de Vez'!$F$117,\"Venda\")","v":0},"","","","",{"$f":"COUNTIFS('[1]Lista de Vez'!$D$20:$D$117,B12,'[1]Lista de Vez'!$Y$20:$Y$117,\"S\")","v":0}]
["",{"$f":"IFERROR(INDEX('[1]Lista de Vez'!$D$20:'[1]Lista de Vez'!$D$117, MATCH(0, COUNTIF(B$5:$CJ12, '[1]Lista de Vez'!$D$20:'[1]Lista de Vez'!$D$117), 0)),\"\")","v":""},{"$f":"SUMIFS('[1]Lista de Vez'!$L$20:'[1]Lista de Vez'!$L$118,'[1]Lista de Vez'!$D$20:'[1]Lista de Vez'!$D$118,B13,'[1]Lista de Vez'!$F$20:'[1]Lista de Vez'!$F$118,\"Venda\")","v":0},{"$f":"COUNTIFS('[1]Lista de Vez'!$D$20:$D$117,B13,'[1]Lista de Vez'!$F$20:$F$117,\"Venda\")","v":0},{"$f":"COUNTIFS('[1]Lista de Vez'!$D$20:$D$117,B13,'[1]Lista de Vez'!$F$20:$F$117,\"Pesquisa\")","v":0},{"$f":"COUNTIFS('[1]Lista de Vez'!$D$20:$D$117,B13,'[1]Lista de Vez'!$F$20:$F$117,\"Artigo\")","v":0},{"$f":"COUNTIFS('[1]Lista de Vez'!$D$20:$D$117,B13,'[1]Lista de Vez'!$F$20:$F$117,\"Cor/Tam\")","v":0},{"$f":"COUNTIFS('[1]Lista de Vez'!$D$20:$D$117,B13,'[1]Lista de Vez'!$F$20:$F$117,\"Preço\")","v":0},{"$f":"COUNTIFS('[1]Lista de Vez'!$D$20:$D$117,B13,'[1]Lista de Vez'!$F$20:$F$117,\"Troca\")","v":0},{"$f":"COUNTIFS('[1]Lista de Vez'!$D$20:$D$117,B13,'[1]Lista de Vez'!$F$20:$F$117,\"Reserva\")","v":0},{"$f":"COUNTIFS('[1]Lista de Vez'!$D$20:$D$117,B13,'[1]Lista de Vez'!$F$20:$F$117,\"Credito\")","v":0},0,{"$f":"SUMIFS('[1]Lista de Vez'!$N$20:'[1]Lista de Vez'!$N$117,'[1]Lista de Vez'!$D$20:'[1]Lista de Vez'!$D$117,B13,'[1]Lista de Vez'!$F$20:'[1]Lista de Vez'!$F$117,\"Venda\")","v":0},"","","","",{"$f":"COUNTIFS('[1]Lista de Vez'!$D$20:$D$117,B13,'[1]Lista de Vez'!$Y$20:$Y$117,\"S\")","v":0}]
["",{"$f":"IFERROR(INDEX('[1]Lista de Vez'!$D$20:'[1]Lista de Vez'!$D$117, MATCH(0, COUNTIF(B$5:$CJ13, '[1]Lista de Vez'!$D$20:'[1]Lista de Vez'!$D$117), 0)),\"\")","v":""},{"$f":"SUMIFS('[1]Lista de Vez'!$L$20:'[1]Lista de Vez'!$L$118,'[1]Lista de Vez'!$D$20:'[1]Lista de Vez'!$D$118,B14,'[1]Lista de Vez'!$F$20:'[1]Lista de Vez'!$F$118,\"Venda\")","v":0},{"$f":"COUNTIFS('[1]Lista de Vez'!$D$20:$D$117,B14,'[1]Lista de Vez'!$F$20:$F$117,\"Venda\")","v":0},{"$f":"COUNTIFS('[1]Lista de Vez'!$D$20:$D$117,B14,'[1]Lista de Vez'!$F$20:$F$117,\"Pesquisa\")","v":0},{"$f":"COUNTIFS('[1]Lista de Vez'!$D$20:$D$117,B14,'[1]Lista de Vez'!$F$20:$F$117,\"Artigo\")","v":0},{"$f":"COUNTIFS('[1]Lista de Vez'!$D$20:$D$117,B14,'[1]Lista de Vez'!$F$20:$F$117,\"Cor/Tam\")","v":0},{"$f":"COUNTIFS('[1]Lista de Vez'!$D$20:$D$117,B14,'[1]Lista de Vez'!$F$20:$F$117,\"Preço\")","v":0},{"$f":"COUNTIFS('[1]Lista de Vez'!$D$20:$D$117,B14,'[1]Lista de Vez'!$F$20:$F$117,\"Troca\")","v":0},{"$f":"COUNTIFS('[1]Lista de Vez'!$D$20:$D$117,B14,'[1]Lista de Vez'!$F$20:$F$117,\"Reserva\")","v":0},{"$f":"COUNTIFS('[1]Lista de Vez'!$D$20:$D$117,B14,'[1]Lista de Vez'!$F$20:$F$117,\"Credito\")","v":0},0,{"$f":"SUMIFS('[1]Lista de Vez'!$N$20:'[1]Lista de Vez'!$N$117,'[1]Lista de Vez'!$D$20:'[1]Lista de Vez'!$D$117,B14,'[1]Lista de Vez'!$F$20:'[1]Lista de Vez'!$F$117,\"Venda\")","v":0},"","","","",{"$f":"COUNTIFS('[1]Lista de Vez'!$D$20:$D$117,B14,'[1]Lista de Vez'!$Y$20:$Y$117,\"S\")","v":0}]
["",{"$f":"IFERROR(INDEX('[1]Lista de Vez'!$D$20:'[1]Lista de Vez'!$D$117, MATCH(0, COUNTIF(B$5:$CJ14, '[1]Lista de Vez'!$D$20:'[1]Lista de Vez'!$D$117), 0)),\"\")","v":""},{"$f":"SUMIFS('[1]Lista de Vez'!$L$20:'[1]Lista de Vez'!$L$118,'[1]Lista de Vez'!$D$20:'[1]Lista de Vez'!$D$118,B15,'[1]Lista de Vez'!$F$20:'[1]Lista de Vez'!$F$118,\"Venda\")","v":0},{"$f":"COUNTIFS('[1]Lista de Vez'!$D$20:$D$117,B15,'[1]Lista de Vez'!$F$20:$F$117,\"Venda\")","v":0},{"$f":"COUNTIFS('[1]Lista de Vez'!$D$20:$D$117,B15,'[1]Lista de Vez'!$F$20:$F$117,\"Pesquisa\")","v":0},{"$f":"COUNTIFS('[1]Lista de Vez'!$D$20:$D$117,B15,'[1]Lista de Vez'!$F$20:$F$117,\"Artigo\")","v":0},{"$f":"COUNTIFS('[1]Lista de Vez'!$D$20:$D$117,B15,'[1]Lista de Vez'!$F$20:$F$117,\"Cor/Tam\")","v":0},{"$f":"COUNTIFS('[1]Lista de Vez'!$D$20:$D$117,B15,'[1]Lista de Vez'!$F$20:$F$117,\"Preço\")","v":0},{"$f":"COUNTIFS('[1]Lista de Vez'!$D$20:$D$117,B15,'[1]Lista de Vez'!$F$20:$F$117,\"Troca\")","v":0},{"$f":"COUNTIFS('[1]Lista de Vez'!$D$20:$D$117,B15,'[1]Lista de Vez'!$F$20:$F$117,\"Reserva\")","v":0},{"$f":"COUNTIFS('[1]Lista de Vez'!$D$20:$D$117,B15,'[1]Lista de Vez'!$F$20:$F$117,\"Credito\")","v":0},0,{"$f":"SUMIFS('[1]Lista de Vez'!$N$20:'[1]Lista de Vez'!$N$117,'[1]Lista de Vez'!$D$20:'[1]Lista de Vez'!$D$117,B15,'[1]Lista de Vez'!$F$20:'[1]Lista de Vez'!$F$117,\"Venda\")","v":0},"","","","",{"$f":"COUNTIFS('[1]Lista de Vez'!$D$20:$D$117,B15,'[1]Lista de Vez'!$Y$20:$Y$117,\"S\")","v":0}]
{"$rows_left_out":21}
{"sheet":"Plan2","index":1,"n_rows":1,"n_cols":19,"rows_kept":1,"cut":false,"hidden":false,"merged":[]}
["Lçto","Data","Vendedor","Vlr Vdas"," Nº Vdas","Pesquisa","Artigo","Cor/Tam","Preço","Troca","Reserva","Crédito","Nº Atend","Itens","IA","VM","PM","TC","Cad"]

{"sheet":"Plan3","index":2,"n_rows":0,"n_cols":0,"rows_kept":0,"cut":false,"hidden":false,"merged":[]}