{"text_format":"1","workbook":"xlsx","n_sheets":3,"sheets":["Dados","Cadastro","Tabela Preço"],"not_rendered":{"charts":0,"images":1,"macros":1,"external_links":0,"defined_names":0,"comments":0,"pivot_tables":0},"unopened":[],"bounds":{"document_bytes":16777216,"sheet_cells":100000,"rows_first":2000,"rows_last":500,"rows_between":2000,"halvings":0,"cell_chars":16384,"cell_head_chars":4096},"cells_cut":0,"cells_raw":0,"read":"whole","date_system":"1900"}

{"sheet":"Dados","index":0,"n_rows":23,"n_cols":8,"rows_kept":23,"cut":false,"hidden":false,"merged":[]}
["Forma Pagamento","Quinzena","Mês","Local da pasta Jagar","Vendedor","Fone Vendedor","Frete","Coleção"]
["Boleto","Primeira","Janeiro","C:\\Users\\Guilherme\\Desktop\\Pedidos Jagar","Ernani",1,"CIF","Inverno 2016"]
["Cheque","Segunda","Fevereiro",null,"Ernani",2,"FOB","Verão 2016/17"]
["Depósito",null,"Março",null,"Ernani",3]
["Outro",null,"Abril",null,"Ernani",4]
[null,null,"Maio",null,"Ernani",5]
[null,null,"Junho",null,"Ernani",6]
[null,null,"Julho",null,"Ernani",7]
[null,null,"Agosto",null,"Ernani",8]
[null,null,"Setembro",null,"Ernani",9]
[null,null,"Outubro",null,"Ernani",0]
[null,null,"Novembro",null,"Ernani"]
[null,null,"Dezembro",null,"Ernani"]
[null,null,null,null,"Ernani"]
[null,null,null,null,"Ernani"]
{"$rows_left_out":9}
{"sheet":"Cadastro","index":1,"n_rows":164,"n_cols":67,"rows_kept":164,"cut":false,"hidden":false,"merged":[[163,33,163,34],[163,35,163,36],[163,37,163,38],[163,39,163,43],[163,44,163,50],[163,1,163,3],[163,4,163,6],[163,17,163,28],[163,29,163,30],[163,31,163,32],[162,31,162,32],[162,33,162,34],[162,35,162,36],[162,37,162,38],[162,39,162,43],[162,44,162,50],[161,33,161,34],[161,35,161,36],[161,37,161,38],[161,39,161,43],[161,44,161,50],[162,1,162,3],[162,4,162,6],[162,17,162,28],[162,29,162,30],[161,1,161,3],[161,4,161,6],[161,17,161,28],[161,29,161,30],[161,31,161,32],[160,31,160,32],[160,33,160,34],[160,35,160,36],[160,37,160,38],[160,39,160,43],[160,44,160,50],[159,33,159,34],[159,35,159,36],[159,37,159,38],[159,39,159,43],[159,44,159,50],[160,1,160,3],[160,4,160,6],[160,17,160,28],[160,29,160,30],[159,1,159,3],[159,4,159,6],[159,17,159,28],[159,29,159,30],[159,31,159,32],[158,31,158,32],[158,33,158,34],[158,35,158,36],[158,37,158,38],[158,39,158,43],[158,44,158,50],[157,33,157,34],[157,35,157,36],[157,37,157,38],[157,39,157,43],[157,44,157,50],[158,1,158,3],[158,4,158,6],[158,17,158,28],[158,29,158,30],[157,1,157,3],[157,4,157,6],[157,17,157,28],[157,29,157,30],[157,31,157,32],[156,31,156,32],[156,33,156,34],[156,35,156,36],[156,37,156,38],[156,39,156,43],[156,44,156,50],[155,33,155,34],[155,35,155,36],[155,37,155,38],[155,39,155,43],[155,44,155,50],[156,1,156,3],[156,4,156,6],[156,17,156,28],[156,29,156,30],[155,1,155,3],[155,4,155,6],[155,17,155,28],[155,29,155,30],[155,31,155,32],[154,31,154,32],[154,33,154,34],[154,35,154,36],[154,37,154,38],[154,39,154,43],[154,44,154,50],[153,33,153,34],[153,35,153,36],[153,37,153,38],[153,39,153,43],[153,44,153,50],[154,1,154,3],[154,4,154,6],[154,17,154,28],[154,29,154,30],[153,1,153,3],[153,4,153,6],[153,17,153,28],[153,29,153,30],[153,31,153,32],[152,31,152,32],[152,33,152,34],[152,35,152,36],[152,37,152,38],[152,39,152,43],[152,44,152,50],[151,33,151,34],[151,35,151,36],[151,37,151,38],[151,39,151,43],[151,44,151,50],[152,1,152,3],[152,4,152,6],[152,17,152,28],[152,29,152,30],[151,1,151,3],[151,4,151,6],[151,17,151,28],[151,29,151,30],[151,31,151,32],[150,31,150,32],[150,33,150,34],[150,35,150,36],[150,37,150,38],[150,39,150,43],[150,44,150,50],[149,33,149,34],[149,35,149,36],[149,37,149,38],[149,39,149,43],[149,44,149,50],[150,1,150,3],[150,4,150,6],[150,17,150,28],[150,29,150,30],[149,1,149,3],[149,4,149,6],[149,17,149,28],[149,29,149,30],[149,31,149,32],[148,31,148,32],[148,33,148,34],[148,35,148,36],[148,37,148,38],[148,39,148,43],[148,44,148,50],[147,33,147,34],[147,35,147,36],[147,37,147,38],[147,39,147,43],[147,44,147,50],[148,1,148,3],[148,4,148,6],[148,17,148,28],[148,29,148,30],[147,1,147,3],[147,4,147,6],[147,17,147,28],[147,29,147,30],[147,31,147,32],[146,31,146,32],[146,33,146,34],[146,35,146,36],[146,37,146,38],[146,39,146,43],[146,44,146,50],[145,33,145,34],[145,35,145,36],[145,37,145,38],[145,39,145,43],[145,44,145,50],[146,1,146,3],[146,4,146,6],[146,17,146,28],[146,29,146,30],[145,1,145,3],[145,4,145,6],[145,17,145,28],[145,29,145,30],[145,31,145,32],[144,31,144,32],[144,33,144,34],[144,35,144,36],[144,37,144,38],[144,39,144,43],[144,44,144,50],[143,33,143,34],[143,35,143,36],[143,37,143,38],[143,39,143,43],[143,44,143,50],[144,1,144,3],[144,4,144,6],[144,17,144,28],[144,29,144,30],[143,1,143,3],[143,4,143,6],[143,17,143,28],[143,29,143,30],[143,31,143,32],[142,31,142,32],[142,33,142,34],[142,35,142,36],[142,37,142,38],[142,39,142,43],[142,44,142,50],[141,33,141,34],[141,35,141,36],[141,37,141,38],[141,39,141,43],[141,44,141,50],[142,1,142,3],[142,4,142,6],[142,17,142,28],[142,29,142,30],[141,1,141,3],[141,4,141,6],[141,17,141,28],[141,29,141,30],[141,31,141,32],[140,31,140,32],[140,33,140,34],[140,35,140,36],[140,37,140,38],[140,39,140,43],[140,44,140,50],[139,33,139,34],[139,35,139,36],[139,37,139,38],[139,39,139,43],[139,44,139,50],[140,1,140,3],[140,4,140,6],[140,17,140,28],[140,29,140,30],[139,1,139,3],[139,4,139,6],[139,17,139,28],[139,29,139,30],[139,31,139,32],[138,31,138,32],[138,33,138,34],[138,35,138,36],[138,37,138,38],[138,39,138,43],[138,44,138,50],[137,33,137,34],[137,35,137,36],[137,37,137,38],[137,39,137,43],[137,44,137,50],[138,1,138,3],[138,4,138,6],[138,17,138,28],[138,29,138,30],[137,1,137,3],[137,4,137,6],[137,17,137,28],[137,29,137,30],[137,31,137,32],[136,31,136,32],[136,33,136,34],[136,35,136,36],[136,37,136,38],[136,39,136,43],[136,44,136,50],[135,33,135,34],[135,35,135,36],[135,37,135,38],[135,39,135,43],[135,44,135,50],[136,1,136,3],[136,4,136,6],[136,17,136,28],[136,29,136,30],[135,1,135,3],[135,4,135,6],[135,17,135,28],[135,29,135,30],[135,31,135,32],[134,31,134,32],[134,33,134,34],[134,35,134,36],[134,37,134,38],[134,39,134,43],[134,44,134,50],[133,33,133,34],[133,35,133,36],[133,37,133,38],[133,39,133,43],[133,44,133,50],[134,1,134,3],[134,4,134,6],[134,17,134,28],[134,29,134,30],[133,1,133,3],[133,4,133,6],[133,17,133,28],[133,29,133,30],[133,31,133,32],[132,31,132,32],[132,33,132,34],[132,35,132,36],[132,37,132,38],[132,39,132,43],[132,44,132,50],[131,33,131,34],[131,35,131,36],[131,37,131,38],[131,39,131,43],[131,44,131,50],[132,1,132,3],[132,4,132,6],[132,17,132,28],[132,29,132,30],[131,1,131,3],[131,4,131,6],[131,17,131,28],[131,29,131,30],[131,31,131,32],[130,31,130,32],[130,33,130,34],[130,35,130,36],[130,37,130,38],[130,39,130,43],[130,44,130,50],[129,33,129,34],[129,35,129,36],[129,37,129,38],[129,39,129,43],[129,44,129,50],[130,1,130,3],[130,4,130,6],[130,17,130,28],[130,29,130,30],[129,1,129,3],[129,4,129,6],[129,17,129,28],[129,29,129,30],[129,31,129,32],[128,31,128,32],[128,33,128,34],[128,35,128,36],[128,37,128,38],[128,39,128,43],[128,44,128,50],[127,33,127,34],[127,35,127,36],[127,37,127,38],[127,39,127,43],[127,44,127,50],[128,1,128,3],[128,4,128,6],[128,17,128,28],[128,29,128,30],[127,1,127,3],[127,4,127,6],[127,17,127,28],[127,29,127,30],[127,31,127,32],[126,31,126,32],[126,33,126,34],[126,35,126,36],[126,37,126,38],[126,39,126,43],[126,44,126,50],[125,33,125,34],[125,35,125,36],[125,37,125,38],[125,39,125,43],[125,44,125,50],[126,1,126,3],[126,4,126,6],[126,17,126,28],[126,29,126,30],[125,1,125,3],[125,4,125,6],[125,17,125,28],[125,29,125,30],[125,31,125,32],[124,31,124,32],[124,33,124,34],[124,35,124,36],[124,37,124,38],[124,39,124,43],[124,44,124,50],[123,33,123,34],[123,35,123,36],[123,37,123,38],[123,39,123,43],[123,44,123,50],[124,1,124,3],[124,4,124,6],[124,17,124,28],[124,29,124,30],[123,1,123,3],[123,4,123,6],[123,17,123,28],[123,29,123,30],[123,31,123,32],[122,31,122,32],[122,33,122,34],[122,35,122,36],[122,37,122,38],[122,39,122,43],[122,44,122,50],[121,33,121,34],[121,35,121,36],[121,37,121,38],[121,39,121,43],[121,44,121,50],[122,1,122,3],[122,4,122,6],[122,17,122,28],[122,29,122,30],[121,1,121,3],[121,4,121,6],[121,17,121,28],[121,29,121,30],[121,31,121,32],[120,31,120,32],[120,33,120,34],[120,35,120,36],[120,37,120,38],[120,39,120,43],[120,44,120,50],[119,33,119,34],[119,35,119,36],[119,37,119,38],[119,39,119,43],[119,44,119,50],[120,1,120,3],[120,4,120,6],[120,17,120,28],[120,29,120,30],[119,1,119,3],[119,4,119,6],[119,17,119,28],[119,29,119,30],[119,31,119,32],[118,31,118,32],[118,33,118,34],[118,35,118,36],[118,37,118,38],[118,39,118,43],[118,44,118,50],[117,33,117,34],[117,35,117,36],[117,37,117,38],[117,39,117,43],[117,44,117,50],[118,1,118,3],[118,4,118,6],[118,17,118,28],[118,29,118,30],[117,1,117,3],[117,4,117,6],[117,17,117,28],[117,29,117,30],[117,31,117,32],[116,31,116,32],[116,33,116,34],[116,35,116,36],[116,37,116,38],[116,39,116,43],[116,44,116,50],[115,33,115,34],[115,35,115,36],[115,37,115,38],[115,39,115,43],[115,44,115,50],[116,1,116,3],[116,4,116,6],[116,17,116,28],[116,29,116,30],[115,1,115,3],[115,4,115,6],[115,17,115,28],[115,29,115,30],[115,31,115,32],[114,31,114,32],[114,33,114,34],[114,35,114,36],[114,37,114,38],[114,39,114,43],[114,44,114,50],[113,33,113,34],[113,35,113,36],[113,37,113,38],[113,39,113,43],[113,44,113,50],[114,1,114,3],[114,4,114,6],[114,17,114,28],[114,29,114,30],[113,1,113,3],[113,4,113,6],[113,17,113,28],[113,29,113,30],[113,31,113,32],[112,31,112,32],[112,33,112,34],[112,35,112,36],[112,37,112,38],[112,39,112,43],[112,44,112,50],[111,33,111,34],[111,35,111,36],[111,37,111,38],[111,39,111,43],[111,44,111,50],[112,1,112,3],[112,4,112,6],[112,17,112,28],[112,29,112,30],[111,1,111,3],[111,4,111,6],[111,17,111,28],[111,29,111,30],[111,31,111,32],[110,31,110,32],[110,33,110,34],[110,35,110,36],[110,37,110,38],[110,39,110,43],[110,44,110,50],[109,33,109,34],[109,35,109,36],[109,37,109,38],[109,39,109,43],[109,44,109,50],[110,1,110,3],[110,4,110,6],[110,17,110,28],[110,29,110,30],[109,1,109,3],[109,4,109,6],[109,17,109,28],[109,29,109,30],[109,31,109,32],[108,31,108,32],[108,33,108,34],[108,35,108,36],[108,37,108,38],[108,39,108,43],[108,44,108,50],[107,33,107,34],[107,35,107,36],[107,37,107,38],[107,39,107,43],[107,44,107,50],[108,1,108,3],[108,4,108,6],[108,17,108,28],[108,29,108,30],[107,1,107,3],[107,4,107,6],[107,17,107,28],[107,29,107,30],[107,31,107,32],[106,31,106,32],[106,33,106,34],[106,35,106,36],[106,37,106,38],[106,39,106,43],[106,44,106,50],[105,33,105,34],[105,35,105,36],[105,37,105,38],[105,39,105,43],[105,44,105,50],[106,1,106,3],[106,4,106,6],[106,17,106,28],[106,29,106,30],[105,1,105,3],[105,4,105,6],[105,17,105,28],[105,29,105,30],[105,31,105,32],[104,31,104,32],[104,33,104,34],[104,35,104,36],[104,37,104,38],[104,39,104,43],[104,44,104,50],[103,33,103,34],[103,35,103,36],[103,37,103,38],[103,39,103,43],[103,44,103,50],[104,1,104,3],[104,4,104,6],[104,17,104,28],[104,29,104,30],[103,1,103,3],[103,4,103,6],[103,17,103,28],[103,29,103,30],[103,31,103,32],[102,31,102,32],[102,33,102,34],[102,35,102,36],[102,37,102,38],[102,39,102,43],[102,44,102,50],[101,33,101,34],[101,35,101,36],[101,37,101,38],[101,39,101,43],[101,44,101,50],[102,1,102,3],[102,4,102,6],[102,17,102,28],[102,29,102,30],[101,1,101,3],[101,4,101,6],[101,17,101,28],[101,29,101,30],[101,31,101,32],[100,31,100,32],[100,33,100,34],[100,35,100,36],[100,37,100,38],[100,39,100,43],[100,44,100,50],[99,33,99,34],[99,35,99,36],[99,37,99,38],[99,39,99,43],[99,44,99,50],[100,1,100,3],[100,4,100,6],[100,17,100,28],[100,29,100,30],[99,1,99,3],[99,4,99,6],[99,17,99,28],[99,29,99,30],[99,31,99,32],[98,31,98,32],[98,33,98,34],[98,35,98,36],[98,37,98,38],[98,39,98,43],[98,44,98,50],[97,33,97,34],[97,35,97,36],[97,37,97,38],[97,39,97,43],[97,44,97,50],[98,1,98,3],[98,4,98,6],[98,17,98,28],[98,29,98,30],[97,1,97,3],[97,4,97,6],[97,17,97,28],[97,29,97,30],[97,31,97,32],[96,31,96,32],[96,33,96,34],[96,35,96,36],[96,37,96,38],[96,39,96,43],[96,44,96,50],[95,33,95,34],[95,35,95,36],[95,37,95,38],[95,39,95,43],[95,44,95,50],[96,1,96,3],[96,4,96,6],[96,17,96,28],[96,29,96,30],[95,1,95,3],[95,4,95,6],[95,17,95,28],[95,29,95,30],[95,31,95,32],[94,31,94,32],[94,33,94,34],[94,35,94,36],[94,37,94,38],[94,39,94,43],[94,44,94,50],[93,33,93,34],[93,35,93,36],[93,37,93,38],[93,39,93,43],[93,44,93,50],[94,1,94,3],[94,4,94,6],[94,17,94,28],[94,29,94,30],[93,1,93,3],[93,4,93,6],[93,17,93,28],[93,29,93,30],[93,31,93,32],[92,31,92,32],[92,33,92,34],[92,35,92,36],[92,37,92,38],[92,39,92,43],[92,44,92,50],[91,33,91,34],[91,35,91,36],[91,37,91,38],[91,39,91,43],[91,44,91,50],[92,1,92,3],[92,4,92,6],[92,17,92,28],[92,29,92,30],[91,1,91,3],[91,4,91,6],[91,17,91,28],[91,29,91,30],[91,31,91,32],[90,31,90,32],[90,33,90,34],[90,35,90,36],[90,37,90,38],[90,39,90,43],[90,44,90,50],[89,33,89,34],[89,35,89,36],[89,37,89,38],[89,39,89,43],[89,44,89,50],[90,1,90,3],[90,4,90,6],[90,17,90,28],[90,29,90,30],[89,1,89,3],[89,4,89,6],[89,17,89,28],[89,29,89,30],[89,31,89,32],[88,31,88,32],[88,33,88,34],[88,35,88,36],[88,37,88,38],[88,39,88,43],[88,44,88,50],[87,33,87,34],[87,35,87,36],[87,37,87,38],[87,39,87,43],[87,44,87,50],[88,1,88,3],[88,4,88,6],[88,17,88,28],[88,29,88,30],[87,1,87,3],[87,4,87,6],[87,17,87,28],[87,29,87,30],[87,31,87,32],[86,31,86,32],[86,33,86,34],[86,35,86,36],[86,37,86,38],[86,39,86,43],[86,44,86,50],[85,33,85,34],[85,35,85,36],[85,37,85,38],[85,39,85,43],[85,44,85,50],[86,1,86,3],[86,4,86,6],[86,17,86,28],[86,29,86,30],[85,1,85,3],[85,4,85,6],[85,17,85,28],[85,29,85,30],[85,31,85,32],[84,31,84,32],[84,33,84,34],[84,35,84,36],[84,37,84,38],[84,39,84,43],[84,44,84,50],[83,33,83,34],[83,35,83,36],[83,37,83,38],[83,39,83,43],[83,44,83,50],[84,1,84,3],[84,4,84,6],[84,17,84,28],[84,29,84,30],[83,1,83,3],[83,4,83,6],[83,17,83,28],[83,29,83,30],[83,31,83,32],[82,31,82,32],[82,33,82,34],[82,35,82,36],[82,37,82,38],[82,39,82,43],[82,44,82,50],[81,33,81,34],[81,35,81,36],[81,37,81,38],[81,39,81,43],[81,44,81,50],[82,1,82,3],[82,4,82,6],[82,17,82,28],[82,29,82,30],[81,1,81,3],[81,4,81,6],[81,17,81,28],[81,29,81,30],[81,31,81,32],[80,31,80,32],[80,33,80,34],[80,35,80,36],[80,37,80,38],[80,39,80,43],[80,44,80,50],[79,33,79,34],[79,35,79,36],[79,37,79,38],[79,39,79,43],[79,44,79,50],[80,1,80,3],[80,4,80,6],[80,17,80,28],[80,29,80,30],[79,1,79,3],[79,4,79,6],[79,17,79,28],[79,29,79,30],[79,31,79,32],[78,31,78,32],[78,33,78,34],[78,35,78,36],[78,37,78,38],[78,39,78,43],[78,44,78,50],[77,33,77,34],[77,35,77,36],[77,37,77,38],[77,39,77,43],[77,44,77,50],[78,1,78,3],[78,4,78,6],[78,17,78,28],[78,29,78,30],[77,1,77,3],[77,4,77,6],[77,17,77,28],[77,29,77,30],[77,31,77,32],[76,31,76,32],[76,33,76,34],[76,35,76,36],[76,37,76,38],[76,39,76,43],[76,44,76,50],[75,33,75,34],[75,35,75,36],[75,37,75,38],[75,39,75,43],[75,44,75,50],[76,1,76,3],[76,4,76,6],[76,17,76,28],[76,29,76,30],[75,1,75,3],[75,4,75,6],[75,17,75,28],[75,29,75,30],[75,31,75,32],[74,31,74,32],[74,33,74,34],[74,35,74,36],[74,37,74,38],[74,39,74,43],[74,44,74,50],[73,33,73,34],[73,35,73,36],[73,37,73,38],[73,39,73,43],[73,44,73,50],[74,1,74,3],[74,4,74,6],[74,17,74,28],[74,29,74,30],[73,1,73,3],[73,4,73,6],[73,17,73,28],[73,29,73,30],[73,31,73,32],[72,31,72,32],[72,33,72,34],[72,35,72,36],[72,37,72,38],[72,39,72,43],[72,44,72,50],[71,33,71,34],[71,35,71,36],[71,37,71,38],[71,39,71,43],[71,44,71,50],[72,1,72,3],[72,4,72,6],[72,17,72,28],[72,29,72,30],[71,1,71,3],[71,4,71,6],[71,17,71,28],[71,29,71,30],[71,31,71,32],[70,31,70,32],[70,33,70,34],[70,35,70,36],[70,37,70,38],[70,39,70,43],[70,44,70,50],[69,33,69,34],[69,35,69,36],[69,37,69,38],[69,39,69,43],[69,44,69,50],[70,1,70,3],[70,4,70,6],[70,17,70,28],[70,29,70,30],[69,1,69,3],[69,4,69,6],[69,17,69,28],[69,29,69,30],[69,31,69,32],[68,31,68,32],[68,33,68,34],[68,35,68,36],[68,37,68,38],[68,39,68,43],[68,44,68,50],[67,33,67,34],[67,35,67,36],[67,37,67,38],[67,39,67,43],[67,44,67,50],[68,1,68,3],[68,4,68,6],[68,17,68,28],[68,29,68,30],[67,1,67,3],[67,4,67,6],[67,17,67,28],[67,29,67,30],[67,31,67,32],[66,31,66,32],[66,33,66,34],[66,35,66,36],[66,37,66,38],[66,39,66,43],[66,44,66,50],[65,33,65,34],[65,35,65,36],[65,37,65,38],[65,39,65,43],[65,44,65,50],[66,1,66,3],[66,4,66,6],[66,17,66,28],[66,29,66,30],[65,1,65,3],[65,4,65,6],[65,17,65,28],[65,29,65,30],[65,31,65,32],[64,31,64,32],[64,33,64,34],[64,35,64,36],[64,37,64,38],[64,39,64,43],[64,44,64,50],[63,33,63,34],[63,35,63,36],[63,37,63,38],[63,39,63,43]],"merged_total":1599,"flags":["merged_cut"]}
[30,60,90,null,null,null,null,null,null,null,null,null,"Rua Exp. Carlos Fischer, 342 H.  Bairro Imigrantes",null,null,null,null,null,null,null,null,null,null,null,null,null,null,null,null,null,null,null,null,null,{"$f":"Dados!D2 &\"\\PDF\\\"","v":"C:\\Users\\Guilherme\\Desktop\\Pedidos Jagar\\PDF\\"},"Num. Pedido",null,null,null,"Num Ped. Fabrica",null,null,null,"Data Cad. Pedido",null,null,null,null,null,null,null,null,null,null,null,null,null,null,null,null,null,null,null,null,null,null,"30/60/90"]
[null,null,null,null,null,null,null,null,null,null,{"$f":"IF(A1=\"\",\"\",AVERAGE(A1:L1))","v":60},{"$f":"IF(A1=\"\",\"\",COUNTA(A1:L1))","v":3},"Guabiruba - SC. CEP: 88360-000 Fone 47 3354-0011",null,null,null,null,null,null,null,null,null,null,null,null,null,null,null,null,null,null,null,null,null,null,25555,null,null,null,1235,null,null,null,"2016-04-18"]
[null,null,null,null,null,null,null,null,null,null,null,null,"www.jagarmalhas.com.br/jaga@jagarmalhas.com.br",null,null,null,null,null,null,null,null,null,null,null,null,null,null,null,null,null,null,null,null,null,{"$f":"E4 & TEXT(AR2,\" - DD.MM.AAAA\")","v":"Malhas Jagar Ind. E Com. Ltda - 18.04.2016"},"Tabela",null,null,null,null,null,null,null,"Vendedor"]
["Cliente:",null,null,null,"Malhas Jagar Ind. E Com. Ltda",null,null,null,null,null,null,null,null,null,null,null,null,null,null,null,null,null,null,null,null,null,null,null,null,null,null,null,null,null,null,"Tabela 1",null,null,null,null,null,null,null,"Ernani"]
["Endereço:",null,null,null,null,"Rua Exp. Carlos Fischer",null,null,null,null,null,null,null,null,null,null,null,null,null,null,null,null,null,null,null,null,null,null,null,"Nº:",null,"342 H",null,null,null,"Faturamento:",null,null,null,null,null,null,null,"Fone Vendedor"]
["Cidade:",null,null,null,"Guabiruba",null,null,null,null,null,null,null,null,null,null,null,"Bairro:",null,null,null,"Imigrantes",null,null,null,null,null,null,null,null,null,null,"UF:",null,"SC",null,"a faturar",null,null,null,null,null,null,null,{"$f":"IF(AR4=\"\",\"\",VLOOKUP(AR4,Dados!E1:F50,2,FALSE))","v":1}]
["CEP:",null,null,"88360-000",null,null,null,null,"E-mail:",null,null,null,"jagar@jagarmalhas.com.br",null,null,null,null,null,null,null,null,null,null,null,null,"Contato:",null,null,null,"Guilherme",null,null,null,null,null,"Coleção:",null,null,null,null,null,null,null,"Código Cliente"]
["Fone 1:",null,null,null,"47 3354 0011",null,null,null,null,null,null,"Fone 2:",null,null,null,"47 3354 0011",null,null,null,null,null,null,"Whatsapp:",null,null,null,null,null,"47 3354 0011",null,null,null,null,null,null,"Verão 2016/17",null,null,null,null,null,null,null,1200]
["CNPJ:",null,null,"85.302.313/0001-57",null,null,null,null,null,null,null,null,"Insc.Est.:",null,null,null,null,252461606,null,null,null,null,null,null,null,null,null,"Frete:",null,null,null,"CIF",null,null,null,"Nota Fiscal",null,null,100,null,null,null,"Entrega","Quinz",null,null,"Primeira"]
["Cond. Pagto:",null,null,null,null,null,null,"30/60/90",null,null,null,null,null,null,null,null,null,null,null,null,null,null,null,null,"Forma Pgto:",null,null,null,null,null,"Boleto",null,null,null,null,null,null,null,null,null,null,null,null,"Mês",null,"Setembro"]
["Parcelas",null,null,null,null,{"$f":"IF(L2=\"\",\"\",L2)","v":3},null,"Valor Parcela",null,null,null,null,null,null,{"$f":"IF(F11=\"\",\"\",AQ11/F11)","v":267.45166666666626},null,null,null,null,null,null,"R$ Frete",null,null,null,50,null,null,null,"TOTAL","BRUTO",{"$f":"SUM(AS15:AY164)","v":835.94999999999868},null,null,null,null,null,null,null,null,"TOTAL","LIQUI",{"$f":"IF(AF11=\"\",\"\",(-(AF11*T12-AF11-Z11)))","v":802.35499999999877}]
["Prazo médio:",null,null,null,null,null,null,{"$f":"IF(K2=\"\",\"\",K2)","v":60},null,null,"Desconto Pedido:",null,null,null,null,null,null,null,null,0.1,null,"% / R$ Comissão"]
["Tot Peças",null,null,null,null,{"$f":"IF(B15=\"\",\"\",SUM(B15:D164))","v":80},null,null,"Média R$/Peça:",null,null,null,null,null,null,null,{"$f":"IF(F13=\"\",\"\",AQ11/F13)","v":10.029437499999984},null,null,null,null,0.1,null,{"$f":"IF(V13=\"\",\"\",AQ11*V13)","v":80.235499999999888},null,null,null,null,null,"G2",null,"G3",null,"G4",null,null,null,null,null,"Preço Unitário",null,null,null,null,"Valor Total"]
["Qtd TOT",null,null,null,"Ref.",null,null,"Descrição",null,null,null,null,null,null,null,null,null,"Observação",null,null,null,null,null,null,null,null,null,null,null,"P",null,"M",null,"G",null,"GG",null,"EX"]
[1,{"$f":"IF(E15=\"\",\"\",SUM(AD15:AL15))","v":5},null,null,4009,null,null,{"$f":"IF(E15=\"\",\"  \",VLOOKUP(E15,'Tabela Preço'!$A$2:$C$600,2,FALSE))","v":"Shorts Ad. Fem. Liganete Com Bolsos"},null,null,null,null,null,null,null,null,{"$f":"IF(E15=\"\",\"  \",VLOOKUP(E15,'Tabela Preço'!$A$2:$D$600,18))","v":{"$error":"#REF!"}},"estampas sortidas",null,null,null,null,null,null,null,null,null,null,null,1,null,1,null,1,null,1,null,1,null,{"$f":"IF(E15=\"\",\"  \",IF($AJ$4=\"Tabela 1\",VLOOKUP(E15,Tabelapreço[],4),IF($AJ$4=\"Prazo\",VLOOKUP(E15,Tabelapreço[],5),IF($AJ$4=\"A vista\",VLOOKUP(E15,Tabelapreço[],6),IF($AJ$4=\"Varejo\",VLOOKUP(E15,Tabelapreço[],7),IF($AJ$4=\"Tabela 6\",VLOOKUP(E15,Tabelapreço[],8),IF($AJ$4=\"Tabela 8\",VLOOKUP(E15,Tabelapreço[],9),IF($AJ$4=\"L. Fernando\",VLOOKUP(E15,Tabelapreço[],10),IF($AJ$4=\"Promoção\",VLOOKUP(E15,Tabelapreço[],11),IF($AJ$4=\"Facção\",VLOOKUP(E15,Tabelapreço[],12)))))))))))","v":5.5499999999999803},null,null,null,null,{"$f":"IF(E15=\"\",\"\",AN15*B15)","v":27.749999999999901}]
{"$rows_left_out":150}
{"sheet":"Tabela Preço","index":2,"n_rows":430,"n_cols":4,"rows_kept":430,"cut":false,"hidden":false,"merged":[]}
["Ref.","Descrição","Tamanho","Tabela 1"]
[1001,"Calçola Ad. 100% Algodão Estampada","P-M-G-GG",1.1000000000000001]
[1002,"Calçola Ad. 96% Poliester 4% Elastano","P-M-G-GG",1.1499999999999999]
[1003,"Calçola Ad. 100% Algodão Tam. Nobre","G2-G3-G4",1.2]
[2019,"Gola Polo Masc.Com Bolso Piquet","P-M-G-GG",1.25]
[2020,"Gola Polo Masculina Manga Curta","P-M-G-GG",1.3]
[2021,"Regata Ad. Fem. Listrada 50% Alg. E 50% Poliester","P-M-G-GG-EX",1.35]
[2030,"Bermuda Ad. Gorgurão","P-M-G-GG-EX",1.4]
[2031,"Bermuda Ad. Senhora Elanca Canelada  100% Poliester","P-M-G-GG-EX",1.45]
[2032,"Bermuda Ad. Cotton Liso 8% Com Cós Estampado","P-M-G-GG-EX",1.5]
[2034,"Capri Ad. Senhora Elanca Canelada  100% Poliester","P-M-G-GG-EX",1.55]
[2035,"Calça Ad. Senhora Elanca  Canelada  100% Poliester","P-M-G-GG-EX",1.6]
[2036,"Calça Ad. Senhora Elanca Lisa  100% Poliester","P-M-G-GG-EX",1.65]
[2037,"Capri Senhora Ad.Gorgurão Poliester","P-M-G-GG-EX",1.7]
[2048,"Capri  Senhora Ad. Elanca Lisa  100% Poliester","P-M-G-GG-EX",1.75]
{"$rows_left_out":415}