{"text_format":"1","workbook":"xlsx","n_sheets":2,"sheets":["Plan1","BD"],"not_rendered":{"charts":0,"images":0,"macros":1,"external_links":0,"defined_names":2,"comments":0,"pivot_tables":0},"unopened":[],"bounds":{"document_bytes":16777216,"sheet_cells":100000,"rows_first":2000,"rows_last":500,"rows_between":2000,"halvings":0,"cell_chars":16384,"cell_head_chars":4096},"cells_cut":0,"cells_raw":0,"read":"whole","date_system":"1900"}

{"sheet":"Plan1","index":0,"n_rows":13,"n_cols":8,"rows_kept":13,"cut":false,"hidden":false,"merged":[[0,0,0,5]]}
["TABELA PEDIDO",null,null,null,null,null,null,"Tipo de pagamento"]
["Item ","Código produto","Nome produto","Valor produto","Qtd","Valor total item",null,"Parcelado"]
[1,"X4","Caneta",5]
[2,"X5","Cx de som",100]
[3,"X1","Teclado",20,null,null,null,"Qtd parcelas"]
[4,"X3","Telefone",50]
[]
[null,null,null,null,null,{"$f":"IFERROR(E8*D8,\"\")","v":0}]
[{"$f":"IF(B9<>\"\",A8+1,\"\")","v":""},null,{"$f":"IFERROR(VLOOKUP(B9,BD!$A$2:$C$6,2,FALSE),\"\")","v":""},{"$f":"IFERROR(VLOOKUP(B9,BD!$A$2:$C$6,3,FALSE),\"\")","v":""},null,""]
["",null,{"$f":"IFERROR(VLOOKUP(B10,BD!$A$2:$C$6,2,FALSE),\"\")","v":""},{"$f":"IFERROR(VLOOKUP(B10,BD!$A$2:$C$6,3,FALSE),\"\")","v":""},null,""]
["",null,{"$f":"IFERROR(VLOOKUP(B11,BD!$A$2:$C$6,2,FALSE),\"\")","v":""},{"$f":"IFERROR(VLOOKUP(B11,BD!$A$2:$C$6,3,FALSE),\"\")","v":""},null,""]
["",null,{"$f":"IFERROR(VLOOKUP(B12,BD!$A$2:$C$6,2,FALSE),\"\")","v":""},{"$f":"IFERROR(VLOOKUP(B12,BD!$A$2:$C$6,3,FALSE),\"\")","v":""},null,""]
[null,null,null,null,null,0]

{"sheet":"BD","index":1,"n_rows":7,"n_cols":7,"rows_kept":7,"cut":false,"hidden":false,"merged":[]}
["Código produto","Nome produto","Valor",null,null,null,"Tipo pagameto"]
["X1","Teclado",20,null,null,null,"À vista"]
["X2","Mouse",15,null,null,null,"30 dias"]
["X3","Telefone",50,null,null,null,"Parcelado"]
["X4","Caneta",5]
["X5","Cx de som",100]
["Personalizado"]