{"text_format":"1","workbook":"xlsx","n_sheets":4,"sheets":["Inicial","bd_sd","bd_clientes","bd_cnae"],"not_rendered":{"charts":0,"images":0,"macros":1,"external_links":0,"defined_names":0,"comments":1,"pivot_tables":0},"unopened":[],"bounds":{"document_bytes":16777216,"sheet_cells":100000,"rows_first":2000,"rows_last":500,"rows_between":2000,"halvings":0,"cell_chars":16384,"cell_head_chars":4096},"cells_cut":0,"cells_raw":0,"read":"whole","date_system":"1900"}

{"sheet":"Inicial","index":0,"n_rows":12,"n_cols":2,"rows_kept":12,"cut":false,"hidden":false,"merged":[]}
["Cliente",9999]
["Nome Fantasia",{"$f":"IF(B1=\"\",\"\",VLOOKUP($B$1,bd_clientes!$A$2:$F$209,2,1))","v":"EMPRESA EXEMPLO"}]
["Nome",{"$f":"IF(B1=\"\",\"\",VLOOKUP($B$1,bd_clientes!$A$2:$F$209,3,1))","v":"ILZA DONALD OLIVEIRA"}]
["Cnpj",{"$f":"IF(B1=\"\",\"\",VLOOKUP($B$1,bd_clientes!$A$2:$F$209,4,1))","v":"116.337.195-53"}]
["Inscrição estadual",{"$f":"IF(B1=\"\",\"\",VLOOKUP($B$1,bd_clientes!$A$2:$F$209,5,1))","v":""}]
["Cnae ",{"$f":"IF(B1=\"\",\"\",VLOOKUP($B$1,bd_clientes!$A$2:$F$209,6,1))","v":"9609-2/99"}]
["Cnae descrição",{"$f":"IF(B1=\"\",\"\",VLOOKUP(B6,bd_cnae!A1:B705,2,1))","v":"Representantes comerciais e agentes do comércio de produtos alimentícios, bebidas e fumo "}]
[]
[]
["Solicitações existentes"]
[]
[{"$f":"IF($B$1=\"\",\"\",VLOOKUP($B$1,bd_sd!$B$2:$E$1048576,3,1))","v":{"$error":"#N/A"}},{"$f":"IF(B1=\"\",\"\",VLOOKUP($B$1,bd_sd!$B$2:$E$1048576,2,1))","v":{"$error":"#N/A"}}]

{"sheet":"bd_sd","index":1,"n_rows":100,"n_cols":4,"rows_kept":100,"cut":false,"hidden":false,"merged":[]}
["Nome do cliente","Código do cliente","Solicitação de documento","Número da sd"]
[]
[]
[{"$f":"IF(B4=\"\",\"\",VLOOKUP(B4,bd_clientes!$A$2:$F$209,2,1))","v":""}]
[{"$f":"IF(B5=\"\",\"\",VLOOKUP(B5,bd_clientes!$A$2:$F$209,2,1))","v":""}]
[{"$f":"IF(B6=\"\",\"\",VLOOKUP(B6,bd_clientes!$A$2:$F$209,2,1))","v":""}]
[{"$f":"IF(B7=\"\",\"\",VLOOKUP(B7,bd_clientes!$A$2:$F$209,2,1))","v":""}]
[{"$f":"IF(B8=\"\",\"\",VLOOKUP(B8,bd_clientes!$A$2:$F$209,2,1))","v":""}]
[{"$f":"IF(B9=\"\",\"\",VLOOKUP(B9,bd_clientes!$A$2:$F$209,2,1))","v":""}]
[{"$f":"IF(B10=\"\",\"\",VLOOKUP(B10,bd_clientes!$A$2:$F$209,2,1))","v":""}]
[{"$f":"IF(B11=\"\",\"\",VLOOKUP(B11,bd_clientes!$A$2:$F$209,2,1))","v":""}]
[{"$f":"IF(B12=\"\",\"\",VLOOKUP(B12,bd_clientes!$A$2:$F$209,2,1))","v":""}]
[{"$f":"IF(B13=\"\",\"\",VLOOKUP(B13,bd_clientes!$A$2:$F$209,2,1))","v":""}]
[{"$f":"IF(B14=\"\",\"\",VLOOKUP(B14,bd_clientes!$A$2:$F$209,2,1))","v":""}]
[{"$f":"IF(B15=\"\",\"\",VLOOKUP(B15,bd_clientes!$A$2:$F$209,2,1))","v":""}]
[{"$f":"IF(B16=\"\",\"\",VLOOKUP(B16,bd_clientes!$A$2:$F$209,2,1))","v":""}]
[{"$f":"IF(B17=\"\",\"\",VLOOKUP(B17,bd_clientes!$A$2:$F$209,2,1))","v":""}]
[{"$f":"IF(B18=\"\",\"\",VLOOKUP(B18,bd_clientes!$A$2:$F$209,2,1))","v":""}]
[{"$f":"IF(B19=\"\",\"\",VLOOKUP(B19,bd_clientes!$A$2:$F$209,2,1))","v":""}]
[{"$f":"IF(B20=\"\",\"\",VLOOKUP(B20,bd_clientes!$A$2:$F$209,2,1))","v":""}]
[{"$f":"IF(B21=\"\",\"\",VLOOKUP(B21,bd_clientes!$A$2:$F$209,2,1))","v":""}]
[{"$f":"IF(B22=\"\",\"\",VLOOKUP(B22,bd_clientes!$A$2:$F$209,2,1))","v":""}]
[{"$f":"IF(B23=\"\",\"\",VLOOKUP(B23,bd_clientes!$A$2:$F$209,2,1))","v":""}]
[{"$f":"IF(B24=\"\",\"\",VLOOKUP(B24,bd_clientes!$A$2:$F$209,2,1))","v":""}]
[{"$f":"IF(B25=\"\",\"\",VLOOKUP(B25,bd_clientes!$A$2:$F$209,2,1))","v":""}]
[{"$f":"IF(B26=\"\",\"\",VLOOKUP(B26,bd_clientes!$A$2:$F$209,2,1))","v":""}]
[{"$f":"IF(B27=\"\",\"\",VLOOKUP(B27,bd_clientes!$A$2:$F$209,2,1))","v":""}]
[{"$f":"IF(B28=\"\",\"\",VLOOKUP(B28,bd_clientes!$A$2:$F$209,2,1))","v":""}]
[{"$f":"IF(B29=\"\",\"\",VLOOKUP(B29,bd_clientes!$A$2:$F$209,2,1))","v":""}]
[{"$f":"IF(B30=\"\",\"\",VLOOKUP(B30,bd_clientes!$A$2:$F$209,2,1))","v":""}]
[{"$f":"IF(B31=\"\",\"\",VLOOKUP(B31,bd_clientes!$A$2:$F$209,2,1))","v":""}]
[{"$f":"IF(B32=\"\",\"\",VLOOKUP(B32,bd_clientes!$A$2:$F$209,2,1))","v":""}]
[{"$f":"IF(B33=\"\",\"\",VLOOKUP(B33,bd_clientes!$A$2:$F$209,2,1))","v":""}]
[{"$f":"IF(B34=\"\",\"\",VLOOKUP(B34,bd_clientes!$A$2:$F$209,2,1))","v":""}]
[{"$f":"IF(B35=\"\",\"\",VLOOKUP(B35,bd_clientes!$A$2:$F$209,2,1))","v":""}]
[{"$f":"IF(B36=\"\",\"\",VLOOKUP(B36,bd_clientes!$A$2:$F$209,2,1))","v":""}]
[{"$f":"IF(B37=\"\",\"\",VLOOKUP(B37,bd_clientes!$A$2:$F$209,2,1))","v":""}]
[{"$f":"IF(B38=\"\",\"\",VLOOKUP(B38,bd_clientes!$A$2:$F$209,2,1))","v":""}]
[{"$f":"IF(B39=\"\",\"\",VLOOKUP(B39,bd_clientes!$A$2:$F$209,2,1))","v":""}]
[{"$f":"IF(B40=\"\",\"\",VLOOKUP(B40,bd_clientes!$A$2:$F$209,2,1))","v":""}]
[{"$f":"IF(B41=\"\",\"\",VLOOKUP(B41,bd_clientes!$A$2:$F$209,2,1))","v":""}]
[{"$f":"IF(B42=\"\",\"\",VLOOKUP(B42,bd_clientes!$A$2:$F$209,2,1))","v":""}]
[{"$f":"IF(B43=\"\",\"\",VLOOKUP(B43,bd_clientes!$A$2:$F$209,2,1))","v":""}]
[{"$f":"IF(B44=\"\",\"\",VLOOKUP(B44,bd_clientes!$A$2:$F$209,2,1))","v":""}]
[{"$f":"IF(B45=\"\",\"\",VLOOKUP(B45,bd_clientes!$A$2:$F$209,2,1))","v":""}]
[{"$f":"IF(B46=\"\",\"\",VLOOKUP(B46,bd_clientes!$A$2:$F$209,2,1))","v":""}]
[{"$f":"IF(B47=\"\",\"\",VLOOKUP(B47,bd_clientes!$A$2:$F$209,2,1))","v":""}]
[{"$f":"IF(B48=\"\",\"\",VLOOKUP(B48,bd_clientes!$A$2:$F$209,2,1))","v":""}]
[{"$f":"IF(B49=\"\",\"\",VLOOKUP(B49,bd_clientes!$A$2:$F$209,2,1))","v":""}]
[{"$f":"IF(B50=\"\",\"\",VLOOKUP(B50,bd_clientes!$A$2:$F$209,2,1))","v":""}]
[{"$f":"IF(B51=\"\",\"\",VLOOKUP(B51,bd_clientes!$A$2:$F$209,2,1))","v":""}]
[{"$f":"IF(B52=\"\",\"\",VLOOKUP(B52,bd_clientes!$A$2:$F$209,2,1))","v":""}]
[{"$f":"IF(B53=\"\",\"\",VLOOKUP(B53,bd_clientes!$A$2:$F$209,2,1))","v":""}]
[{"$f":"IF(B54=\"\",\"\",VLOOKUP(B54,bd_clientes!$A$2:$F$209,2,1))","v":""}]
[{"$f":"IF(B55=\"\",\"\",VLOOKUP(B55,bd_clientes!$A$2:$F$209,2,1))","v":""}]
[{"$f":"IF(B56=\"\",\"\",VLOOKUP(B56,bd_clientes!$A$2:$F$209,2,1))","v":""}]
[{"$f":"IF(B57=\"\",\"\",VLOOKUP(B57,bd_clientes!$A$2:$F$209,2,1))","v":""}]
[{"$f":"IF(B58=\"\",\"\",VLOOKUP(B58,bd_clientes!$A$2:$F$209,2,1))","v":""}]
[{"$f":"IF(B59=\"\",\"\",VLOOKUP(B59,bd_clientes!$A$2:$F$209,2,1))","v":""}]
[{"$f":"IF(B60=\"\",\"\",VLOOKUP(B60,bd_clientes!$A$2:$F$209,2,1))","v":""}]
[{"$f":"IF(B61=\"\",\"\",VLOOKUP(B61,bd_clientes!$A$2:$F$209,2,1))","v":""}]
[{"$f":"IF(B62=\"\",\"\",VLOOKUP(B62,bd_clientes!$A$2:$F$209,2,1))","v":""}]
[{"$f":"IF(B63=\"\",\"\",VLOOKUP(B63,bd_clientes!$A$2:$F$209,2,1))","v":""}]
[{"$f":"IF(B64=\"\",\"\",VLOOKUP(B64,bd_clientes!$A$2:$F$209,2,1))","v":""}]
[{"$f":"IF(B65=\"\",\"\",VLOOKUP(B65,bd_clientes!$A$2:$F$209,2,1))","v":""}]
[{"$f":"IF(B66=\"\",\"\",VLOOKUP(B66,bd_clientes!$A$2:$F$209,2,1))","v":""}]
[{"$f":"IF(B67=\"\",\"\",VLOOKUP(B67,bd_clientes!$A$2:$F$209,2,1))","v":""}]
[{"$f":"IF(B68=\"\",\"\",VLOOKUP(B68,bd_clientes!$A$2:$F$209,2,1))","v":""}]
[{"$f":"IF(B69=\"\",\"\",VLOOKUP(B69,bd_clientes!$A$2:$F$209,2,1))","v":""}]
[{"$f":"IF(B70=\"\",\"\",VLOOKUP(B70,bd_clientes!$A$2:$F$209,2,1))","v":""}]
[{"$f":"IF(B71=\"\",\"\",VLOOKUP(B71,bd_clientes!$A$2:$F$209,2,1))","v":""}]
[{"$f":"IF(B72=\"\",\"\",VLOOKUP(B72,bd_clientes!$A$2:$F$209,2,1))","v":""}]
[{"$f":"IF(B73=\"\",\"\",VLOOKUP(B73,bd_clientes!$A$2:$F$209,2,1))","v":""}]
[{"$f":"IF(B74=\"\",\"\",VLOOKUP(B74,bd_clientes!$A$2:$F$209,2,1))","v":""}]
[{"$f":"IF(B75=\"\",\"\",VLOOKUP(B75,bd_clientes!$A$2:$F$209,2,1))","v":""}]
[{"$f":"IF(B76=\"\",\"\",VLOOKUP(B76,bd_clientes!$A$2:$F$209,2,1))","v":""}]
[{"$f":"IF(B77=\"\",\"\",VLOOKUP(B77,bd_clientes!$A$2:$F$209,2,1))","v":""}]
[{"$f":"IF(B78=\"\",\"\",VLOOKUP(B78,bd_clientes!$A$2:$F$209,2,1))","v":""}]
[{"$f":"IF(B79=\"\",\"\",VLOOKUP(B79,bd_clientes!$A$2:$F$209,2,1))","v":""}]
[{"$f":"IF(B80=\"\",\"\",VLOOKUP(B80,bd_clientes!$A$2:$F$209,2,1))","v":""}]
[{"$f":"IF(B81=\"\",\"\",VLOOKUP(B81,bd_clientes!$A$2:$F$209,2,1))","v":""}]
[{"$f":"IF(B82=\"\",\"\",VLOOKUP(B82,bd_clientes!$A$2:$F$209,2,1))","v":""}]
[{"$f":"IF(B83=\"\",\"\",VLOOKUP(B83,bd_clientes!$A$2:$F$209,2,1))","v":""}]
[{"$f":"IF(B84=\"\",\"\",VLOOKUP(B84,bd_clientes!$A$2:$F$209,2,1))","v":""}]
[{"$f":"IF(B85=\"\",\"\",VLOOKUP(B85,bd_clientes!$A$2:$F$209,2,1))","v":""}]
[{"$f":"IF(B86=\"\",\"\",VLOOKUP(B86,bd_clientes!$A$2:$F$209,2,1))","v":""}]
[{"$f":"IF(B87=\"\",\"\",VLOOKUP(B87,bd_clientes!$A$2:$F$209,2,1))","v":""}]
[{"$f":"IF(B88=\"\",\"\",VLOOKUP(B88,bd_clientes!$A$2:$F$209,2,1))","v":""}]
[{"$f":"IF(B89=\"\",\"\",VLOOKUP(B89,bd_clientes!$A$2:$F$209,2,1))","v":""}]
[{"$f":"IF(B90=\"\",\"\",VLOOKUP(B90,bd_clientes!$A$2:$F$209,2,1))","v":""}]
[{"$f":"IF(B91=\"\",\"\",VLOOKUP(B91,bd_clientes!$A$2:$F$209,2,1))","v":""}]
[{"$f":"IF(B92=\"\",\"\",VLOOKUP(B92,bd_clientes!$A$2:$F$209,2,1))","v":""}]
[{"$f":"IF(B93=\"\",\"\",VLOOKUP(B93,bd_clientes!$A$2:$F$209,2,1))","v":""}]
[{"$f":"IF(B94=\"\",\"\",VLOOKUP(B94,bd_clientes!$A$2:$F$209,2,1))","v":""}]
[{"$f":"IF(B95=\"\",\"\",VLOOKUP(B95,bd_clientes!$A$2:$F$209,2,1))","v":""}]
[{"$f":"IF(B96=\"\",\"\",VLOOKUP(B96,bd_clientes!$A$2:$F$209,2,1))","v":""}]
[{"$f":"IF(B97=\"\",\"\",VLOOKUP(B97,bd_clientes!$A$2:$F$209,2,1))","v":""}]
[{"$f":"IF(B98=\"\",\"\",VLOOKUP(B98,bd_clientes!$A$2:$F$209,2,1))","v":""}]
[{"$f":"IF(B99=\"\",\"\",VLOOKUP(B99,bd_clientes!$A$2:$F$209,2,1))","v":""}]
[{"$f":"IF(B100=\"\",\"\",VLOOKUP(B100,bd_clientes!$A$2:$F$209,2,1))","v":""}]

{"sheet":"bd_clientes","index":2,"n_rows":2,"n_cols":6,"rows_kept":2,"cut":false,"hidden":false,"merged":[]}
["código","Nome","Fantasia","CNPJ","Insc","cnae"]
[9999,"EMPRESA EXEMPLO","ILZA DONALD OLIVEIRA","116.337.195-53","","9609-2/99"]

{"sheet":"bd_cnae","index":3,"n_rows":1482,"n_cols":2,"rows_kept":1482,"cut":false,"hidden":false,"merged":[]}
[8157,"Formulação de combustíveis "]
[8158,"Rerrefino de óleos lubrificantes "]
[41365,"Fabricação de adubos e fertilizantes organo-minerais "]
[41366,"Fabricação de adubos e fertilizantes, exceto organo-minerais "]
[43525,"Elaboração de combustíveis nucleares "]
[70220,"Fabricação de pólvoras, explosivos e detonantes "]
[70221,"Fabricação de artigos pirotécnicos "]
[70222,"Fabricação de fósforos de segurança "]
[72686,"Fabricação de chapas, filmes, papéis e outros materiais e produtos químicos para fotografia "]
[80721,"Fabricação de medicamentos alopáticos para uso humano "]
[80722,"Fabricação de medicamentos homeopáticos para uso humano "]
[80723,"Fabricação de medicamentos fitoterápicos para uso humano "]
[120226,"Fabricação de artefatos de material plástico para uso pessoal e doméstico "]
[120227,"Fabricação de artefatos de material plástico para usos industriais "]
[120228,"Fabricação de artefatos de material plástico para uso na construção, exceto tubos e acessórios "]
[157115,"Fabricação de estruturas pré-moldadas de concreto armado, em série e sob encomenda "]
[157116,"Fabricação de artefatos de cimento para uso na construção "]
[157117,"Fabricação de artefatos de fibrocimento para uso na construção "]
[157118,"Fabricação de casas pré-moldadas de concreto "]
[157119,"Preparação de massa de concreto e argamassa para construção "]
[161620,"Fabricação de azulejos e pisos "]
[161621,"Fabricação de artefatos de cerâmica e barro cozido para uso na construção, exceto azulejos e pisos "]
[164086,"Fabricação de material sanitário de cerâmica "]
[179456,"Britamento de pedras, exceto associado à extração "]
[179457,"Aparelhamento de pedras para construção, exceto associado à extração "]
[179458,"Aparelhamento de placas e execução de trabalhos em mármore, granito, ardósia e outras pedras "]
[182258,"Decoração, lapidação, gravação, vitrificação e outros trabalhos em cerâmica, louça, vidro e cristal "]
[182259,"Fabricação de abrasivos "]
[190902,"Produção de laminados planos de aço ao carbono, revestidos ou  "]
[190903,"Produção de laminados planos de aços especiais "]
[191205,"Produção de tubos de aço sem costura "]
[191206,"Produção de laminados longos de aço, exceto tubos "]
[191510,"Produção de arames de aço "]
[191511,"Produção de relaminados, trefilados e perfilados de aço, exceto arames "]
[197719,"Produção de alumínio e suas ligas em formas primárias "]
[197720,"Produção de laminados de alumínio "]
[200521,"Produção de zinco em formas primárias "]
[200522,"Produção de laminados de zinco "]
[200523,"Fabricação de ânodos para galvanoplastia "]
[230560,"Produção de forjados de aço "]
[230561,"Produção de forjados de metais -ferrosos e suas ligas "]
[230866,"Produção de artefatos estampados de metal "]
[230867,"Metalurgia do pó "]
[237410,"Fabricação de equipamento bélico pesado, exceto veículos militares de combate "]
[237411,"Fabricação de armas de fogo, outras armas e munições "]
[252902,"Fabricação de produtos de trefilados de metal padronizados "]
[252903,"Fabricação de produtos de trefilados de metal, exceto padronizados "]
[255366,"Serviços de confecção de armações metálicas para a construção "]
[255367,"Serviço de corte e dobra de metais "]
[281239,"Fabricação de equipamentos e instrumentos ópticos, peças e acessórios "]
[281240,"Fabricação de aparelhos fotográficos e cinematográficos, peças e acessórios "]
[295938,"Fabricação de geradores de corrente contínua e alternada, peças e acessórios "]
[295939,"Fabricação de transformadores, indutores, conversores, sincronizadores e semelhantes, peças e"]
[295940,"Fabricação de motores elétricos, peças e acessórios "]
[300443,"Fabricação de baterias e acumuladores para veículos automotores "]
[300444,"Recondicionamento de baterias e acumuladores para veículos automotores "]
[306957,"Fabricação de lâmpadas "]
[306958,"Fabricação de luminárias e outros equipamentos de iluminação "]
[313926,"Fabricação de aparelhos elétricos de uso pessoal, peças e acessórios "]
[325099,"Fabricação de eletrodos, contatos e outros artigos de carvão e grafita para uso elétrico, eletroímãs e"]
[325100,"Fabricação de equipamentos para sinalização e alarme "]
[333893,"Fabricação de compressores para uso industrial, peças e acessórios "]
[333894,"Fabricação de compressores para uso  industrial, peças e acessórios "]
[334199,"Fabricação de rolamentos para fins industriais "]
[334200,"Fabricação de equipamentos de transmissão para fins industriais, exceto rolamentos "]
[336542,"Fabricação de fornos industriais, aparelhos e equipamentos -elétricos para instalações térmicas,"]
[336543,"Fabricação de estufas e fornos elétricos para fins industriais, peças e acessórios "]
[336846,"Fabricação de máquinas, equipamentos e aparelhos para transporte e elevação de pessoas, peças e"]
[336847,"Fabricação de máquinas, equipamentos e aparelhos para transporte e elevação de cargas, peças e"]
[337486,"Fabricação de aparelhos e equipamentos de ar condicionado para uso industrial "]
[337487,"Fabricação de aparelhos e equipamentos de ar condicionado para uso -industrial "]
[339313,"Fabricação de máquinas de escrever, calcular e outros equipamentos -eletrônicos para escritório,"]
[369078,"Fabricação de automóveis, camionetas e utilitários "]
[369079,"Fabricação de chassis com motor para automóveis, camionetas e utilitários "]
[369080,"Fabricação de motores para automóveis, camionetas e utilitários "]
[372640,"Fabricação de caminhões e ônibus "]
[372641,"Fabricação de motores para caminhões e ônibus "]
[376202,"Fabricação de cabines, carrocerias e reboques para caminhões "]
[376203,"Fabricação de carrocerias para ônibus "]
[376204,"Fabricação de cabines, carrocerias e reboques para outros veículos automotores, exceto caminhões e"]
[383173,"Fabricação de bancos e estofados para veículos automotores "]
[405845,"Construção de embarcações de grande porte "]
[405846,"Construção de embarcações para uso comercial e para usos especiais, exceto de grande porte "]
[435006,"Fabricação de motocicletas "]
[435007,"Fabricação de peças e acessórios para motocicletas "]
[478986,"Lapidação de gemas "]
[478987,"Fabricação de artefatos de joalheria e ourivesaria "]
[478988,"Cunhagem de moedas e medalhas "]
[493261,"Fabricação de instrumentos -eletrônicos e utensílios para uso médico, cirúrgico, odontológico e de"]
[493262,"Fabricação de mobiliário para uso médico, cirúrgico, odontológico e de laboratório "]
[493263,"Fabricação de aparelhos e utensílios para correção de defeitos físicos e aparelhos ortopédicos em"]
[493264,"Fabricação de aparelhos e utensílios para correção de defeitos físicos e aparelhos ortopédicos em"]
[493265,"Fabricação de materiais para medicina e odontologia "]
[493266,"Serviços de prótese dentária "]
[493267,"Fabricação de artigos ópticos "]
[493269,"Serviço de laboratório óptico "]
[508451,"Fabricação de roupas de proteção e segurança e resistentes a fogo "]
[508452,"Fabricação de equipamentos e acessórios para segurança pessoal e profissional "]
[515725,"Manutenção e reparação de aparelhos e instrumentos de medida, teste e controle /"]
[515726,"Manutenção e reparação de aparelhos eletromédicos e eletroterapêuticos e equipamentos de irradiação /"]
[515727,"Manutenção e reparação de equipamentos e instrumentos ópticos /"]
[516333,"Manutenção e reparação de geradores, transformadores e motores elétricos /"]
[516334,"Manutenção e reparação de baterias e acumuladores elétricos, exceto para veículos /"]
[516636,"Manutenção e reparação de máquinas motrizes -elétricas /"]
[516637,"Manutenção e reparação de equipamentos hidráulicos e pneumáticos, exceto válvulas /"]
[516638,"Manutenção e reparação de válvulas industriais /"]
[516639,"Manutenção e reparação de compressores /"]
[516640,"Manutenção e reparação de equipamentos de transmissão para fins industriais /"]
[516641,"Manutenção e reparação de máquinas, aparelhos e equipamentos para instalações térmicas /"]
[516642,"Manutenção e reparação de máquinas e aparelhos de refrigeração e ventilação para uso industrial e"]
[516643,"Manutenção e reparação de máquinas, equipamentos e aparelhos para transporte e elevação de"]
[516644,"Manutenção e reparação de máquinas de escrever, calcular e de outros equipamentos -eletrônicos"]
[516645,"Manutenção e reparação de máquinas e equipamentos para uso geral  especificados anteriormente /"]
[516646,"Manutenção e reparação de máquinas e equipamentos para agricultura e pecuária /"]
[516647,"Manutenção e reparação de tratores agrícolas /"]
[516648,"Manutenção e reparação de máquinas-ferramenta /"]
[516649,"Manutenção e reparação de máquinas e equipamentos para a prospecção e extração de petróleo /"]
[516650,"Manutenção e reparação de máquinas e equipamentos para uso na extração mineral, exceto na"]
[516651,"Manutenção e reparação de tratores, exceto agrícolas /"]
[516652,"Manutenção e reparação de máquinas e equipamentos de terraplenagem, pavimentação e construção,"]
[516653,"Manutenção e reparação de máquinas para a indústria metalúrgica, exceto máquinas-ferramenta /"]
[516654,"Manutenção e reparação de máquinas e equipamentos para as indústrias de alimentos, bebidas e fumo /"]
[516655,"Manutenção e reparação de máquinas e equipamentos para a indústria têxtil, do vestuário, do couro e"]
[516656,"Manutenção e reparação de máquinas e aparelhos para a indústria de celulose, papel e papelão e"]
[516657,"Manutenção e reparação de máquinas e aparelhos para a indústria do plástico /"]
[517245,"Manutenção e reparação de aeronaves, exceto a manutenção na pista /"]
[517246,"Manutenção de aeronaves na pista * /"]
[517551,"Manutenção e reparação de embarcações e estruturas flutuantes /"]
[517552,"Manutenção e reparação de embarcações para esportes e lazer /"]
[522054,"Serviços de montagem de móveis de qualquer material /"]
[588527,"Geração de energia elétrica "]
[588528,"Atividades de coordenação e controle da operação da geração e transmissão de energia elétrica "]
[591785,"Produção de gás; processamento de gás natural "]
[591786,"Distribuição de combustíveis gasosos por redes urbanas "]
[621066,"Captação, tratamento e distribuição de água "]
[621067,"Distribuição de água por caminhões "]
[705528,"Recuperação de sucatas de alumínio "]
[708297,"Usinas de compostagem "]
[844077,"Construção de rodovias e ferrovias "]
[844078,"Pintura para sinalização em pistas rodoviárias e aeroportos "]
[847973,"Construção de barragens e represas para geração de energia elétrica "]
[847974,"Construção de estações e redes de distribuição de energia elétrica "]
[847975,"Manutenção de redes de distribuição de energia elétrica /"]
[847976,"Construção de estações e redes de telecomunicações "]
[847977,"Manutenção de estações e redes de telecomunicações /"]
[848276,"Construção de redes de abastecimento de água, coleta de esgoto e construções correlatas, exceto"]
[848277,"Obras de irrigação "]
[873875,"Montagem de estruturas metálicas "]
[873876,"Obras de montagem industrial /"]
[876339,"Construção de instalações esportivas e recreativas "]
[880813,"Demolição de edifícios e outras estruturas "]
[880814,"Preparação de canteiro e limpeza de terreno "]
[884678,"Instalações hidráulicas, sanitárias e de gás "]
[884679,"Instalação e manutenção de sistemas centrais de ar condicionado, de ventilação e refrigeração /"]
[884680,"Instalações de sistema de prevenção contra incêndio /"]
[887176,"Instalação de painéis publicitários "]
[887177,"Instalação de equipamentos para orientação à navegação marítima, fluvial e lacustre /"]
[887178,"Instalação, manutenção e reparação de elevadores, escadas e esteiras rolantes /"]
[887179,"Montagem e instalação de sistemas e equipamentos de iluminação e sinalização em vias públicas,"]
[887180,"Tratamentos térmicos, acústicos ou de vibração "]
[887631,"Impermeabilização em obras de engenharia civil "]
[887632,"Instalação de portas, janelas, tetos, divisórias e armários embutidos de qualquer material "]
[887633,"Obras de acabamento em gesso e estuque "]
[887634,"Serviços de pintura de edifícios em geral "]
[887635,"Aplicação de revestimentos e de resinas em interiores e exteriores "]
[912743,"Administração de obras "]
[912744,"Montagem e desmontagem de andaimes e outras estruturas temporárias "]
[912745,"Obras de alvenaria "]
[912746,"Serviços de operação e fornecimento de equipamentos para transporte e elevação de cargas e"]
[912747,"Perfuração e construção de poços de água "]
[953650,"Comércio a varejo de automóveis, camionetas e utilitários novos "]
[953651,"Comércio a varejo de automóveis, camionetas e utilitários usados "]
[953652,"Comércio por atacado de automóveis, camionetas e utilitários novos e usados "]
[953653,"Comércio por atacado de caminhões novos e usados "]
[953654,"Comércio por atacado de reboques e semi-reboques novos e usados "]
[953655,"Comércio por atacado de ônibus e microônibus novos e usados "]
[954259,"Representantes comerciais e agentes do comércio de veículos automotores "]
[954260,"Comércio sob consignação de veículos automotores "]
[960771,"Comércio por atacado de peças e acessórios novos para veículos automotores "]
[960772,"Comércio por atacado de pneumáticos e câmaras-de-ar "]
[960773,"Comércio a varejo de peças e acessórios novos para veículos automotores "]
[960774,"Comércio a varejo de peças e acessórios usados para veículos automotores "]
[960775,"Comércio a varejo de pneumáticos e câmaras-de-ar "]
[960776,"Representantes comerciais e agentes do comércio de peças e acessórios novos e usados para veículos"]
[964639,"Comércio por atacado de motocicletas e motonetas "]
[964640,"Comércio por atacado de peças e acessórios para motocicletas e motonetas "]
[964641,"Comércio a varejo de motocicletas e motonetas novas "]
[964642,"Comércio a varejo de motocicletas e motonetas usadas "]
[964643,"Comércio a varejo de peças e acessórios para motocicletas e motonetas "]
[964973,"Representantes comerciais e agentes do comércio de motocicletas e motonetas, peças e acessórios "]
[964974,"Comércio sob consignação de motocicletas e motonetas "]
[992821,"Representantes comerciais e agentes do comércio de medicamentos, cosméticos e produtos de"]
[992822,"Representantes comerciais e agentes do comércio de instrumentos e materiais odonto-médicohospitalares"]
["0111-3/01","Cultivo de arroz "]
["0111-3/02","Cultivo de milho "]
["0111-3/03","Cultivo de trigo "]
["0111-3/99","Cultivo de outros cereais  especificados anteriormente "]
["0112-1/01","Cultivo de algodão herbáceo "]
["0112-1/02","Cultivo de juta "]
["0112-1/99","Cultivo de outras fibras de lavoura temporária  especificadas anteriormente "]
{"$rows_left_out":1282}