{"text_format":"1","workbook":"xlsx","n_sheets":14,"sheets":["BMVT","Recibo","Julho","Junho","Maio","Abril","Março","Fevereiro","Janeiro","Relatório","Rel_Gestao","Rotas","Usuários","Empresas"],"not_rendered":{"charts":12,"images":0,"macros":1,"external_links":10,"defined_names":27,"comments":8,"pivot_tables":0},"unopened":[],"bounds":{"document_bytes":16777216,"sheet_cells":100000,"rows_first":2000,"rows_last":500,"rows_between":2000,"halvings":0,"cell_chars":16384,"cell_head_chars":4096},"cells_cut":0,"cells_raw":0,"read":"whole","date_system":"1900"}

{"sheet":"BMVT","index":0,"n_rows":81,"n_cols":32,"rows_kept":81,"cut":false,"hidden":false,"merged":[[4,23,4,24],[4,27,4,29],[4,25,4,26],[76,0,76,2],[0,0,2,2],[1,3,2,3],[1,14,1,15],[2,14,2,15],[0,14,0,15]]}
["Boletim Mensal de Vales Transporte",null,null,"Competência:",null,"Dias Úteis (Mês):",{"$f":"VLOOKUP(INDEX($W$6:$AF$16,$W$5,1),$W$6:$AF$16,9,FALSE)","v":21},null,"SC (Empregado):",0,{"$f":"(SUMIFS(BMVT[Vlr. Total],BMVT[Vínculo],\"<>Aprendiz\",BMVT[Empresa], \"Salvador Card\"))-J1","v":1300.2},null,null,"Qtd Usuários",{"$f":"SUMPRODUCT(SUBTOTAL(3,OFFSET(BMVT[Matrícula],ROW(BMVT[Matrícula])-ROW(A6),0,1)),--(BMVT[Situação]=\"Regular\"))","v":24}]
[null,null,null,{"$f":"VLOOKUP(INDEX($W$6:$AF$16,$W$5,1),$W$6:$AF$16,1,FALSE)","v":"Julho"},null,"Compesações:",{"$f":"VLOOKUP(INDEX($W$6:$AF$16,$W$5,1),$W$6:$AF$16,10,FALSE)","v":0},null,"SC (Aprendiz):",0,{"$f":"(SUMIFS(BMVT[Vlr. Total],BMVT[Vínculo],\"Aprendiz\",BMVT[Empresa],\"Salvador Card\"))-J2","v":0},null,null,"Qtd VT :",{"$f":"SUMPRODUCT(SUBTOTAL(9,OFFSET(BMVT[Qtd. Solic.],ROW(BMVT[Qtd. Solic.])-ROW(O6),0,1)),--(BMVT[Situação]=\"Regular\"))","v":835}]
[null,null,null,null,null,"Desconto :",0,null,"Metropasse:",250.8,{"$f":"(SUMIF(BMVT[Empresa],\"Metropasse\",BMVT[Vlr. Total]))-J3","v":164.99999999999994},null,null,"Valor Total:",{"$f":"SUMPRODUCT(SUBTOTAL(9,OFFSET(BMVT[Vlr. Total],ROW(BMVT[Vlr. Total])-ROW(R6),0,1)),--(BMVT[Situação]=\"Regular\"))","v":5932.1600000000017}]
[null,null,null,null,null,null,null,null,null,null,null,null,null,null,null,null,null,null,null,null,null,null,{"$f":"D2","v":"Julho"}]
["Matrícula","Empregado","Vínculo","Lotação","Setor","Rota","Situação","Origem","Destino","Tipo","Empresa","Vales/Trecho","Chipagem","Quant. Apur.","Qtd. Solic.","Dias Lanc Sist.","Vlr. Unit.","Vlr. Total",null,null,"Trechos",null,7,"Período",null,"Feriados",null,"Compensações",null,null,"DU"]
["000.001",{"$f":"IF(ISERROR(VLOOKUP(BMVT[[#This Row],[Matrícula]],Usuarios[#All],2,FALSE)),\"\",VLOOKUP(BMVT[[#This Row],[Matrícula]],Usuarios[#All],2,FALSE))","v":"João"},{"$f":"IF(ISERROR(VLOOKUP(BMVT[[#This Row],[Matrícula]],Usuarios[#All],3,FALSE)),\"\",VLOOKUP(BMVT[[#This Row],[Matrícula]],Usuarios[#All],3,FALSE))","v":"Anistiado"},{"$f":"IF(ISERROR(VLOOKUP(BMVT[[#This Row],[Matrícula]],Usuarios[#All],4,FALSE)),\"\",VLOOKUP(BMVT[[#This Row],[Matrícula]],Usuarios[#All],4,FALSE))","v":"Salvador"},{"$f":"IF(ISERROR(VLOOKUP(BMVT[[#This Row],[Matrícula]],Usuarios[#All],5,FALSE)),\"\",VLOOKUP(BMVT[[#This Row],[Matrícula]],Usuarios[#All],5,FALSE))","v":"ADMINISTRATIVO"},"xxxxx-Y","Regular",{"$f":"IF(ISERROR(VLOOKUP(BMVT[[#This Row],[Rota]],Rotas[#All],3,FALSE)),\"\",VLOOKUP(BMVT[[#This Row],[Rota]],Rotas[#All],3,FALSE))","v":"Dias D'Ávila"},{"$f":"IF(ISERROR(VLOOKUP(BMVT[[#This Row],[Rota]],Rotas[#All],4,FALSE)),\"\",VLOOKUP(BMVT[[#This Row],[Rota]],Rotas[#All],4,FALSE))","v":"Camaçari"},{"$f":"IF(ISERROR(VLOOKUP(BMVT[[#This Row],[Rota]],Rotas[#All],5,FALSE)),\"\",VLOOKUP(BMVT[[#This Row],[Rota]],Rotas[#All],5,FALSE))","v":"Intermunicipal"},{"$f":"IF(ISERROR(VLOOKUP(BMVT[[#This Row],[Rota]],Rotas[#All],6,FALSE)),\"\",VLOOKUP(BMVT[[#This Row],[Rota]],Rotas[#All],6,FALSE))","v":"Cidade das Águas"},2,{"$f":"L6","v":2},{"$f":"L6*$G$1","v":42},{"$f":"BMVT[[#This Row],[Quant. Apur.]]","v":42},{"$f":"IF(ISERROR(O6/M6),0,O6/M6)","v":21},{"$f":"IF(ISERROR(VLOOKUP(BMVT[[#This Row],[Rota]],Rotas[#All],7,FALSE)),0,VLOOKUP(BMVT[[#This Row],[Rota]],Rotas[#All],7,FALSE))","v":2.8},{"$f":"O6*Q6","v":117.6},null,null,{"$f":"IF(ISERROR(BMVT[[#This Row],[Origem]]&\" - \"&BMVT[[#This Row],[Destino]]),\"\",BMVT[[#This Row],[Origem]]&\" - \"&BMVT[[#This Row],[Destino]])","v":"Dias D'Ávila - Camaçari"},null,"Janeiro","2016-01-01","2016-01-31","2016-01-01",null,null,null,null,{"$f":"NETWORKDAYS(X6,Y6,Z6:AD6)","v":20},{"$f":"COUNTA(AB6:AD6)","v":0}]
["000.002",{"$f":"IF(ISERROR(VLOOKUP(BMVT[[#This Row],[Matrícula]],Usuarios[#All],2,FALSE)),\"\",VLOOKUP(BMVT[[#This Row],[Matrícula]],Usuarios[#All],2,FALSE))","v":"Maria"},{"$f":"IF(ISERROR(VLOOKUP(BMVT[[#This Row],[Matrícula]],Usuarios[#All],3,FALSE)),\"\",VLOOKUP(BMVT[[#This Row],[Matrícula]],Usuarios[#All],3,FALSE))","v":"Anistiado"},{"$f":"IF(ISERROR(VLOOKUP(BMVT[[#This Row],[Matrícula]],Usuarios[#All],4,FALSE)),\"\",VLOOKUP(BMVT[[#This Row],[Matrícula]],Usuarios[#All],4,FALSE))","v":"Salvador"},{"$f":"IF(ISERROR(VLOOKUP(BMVT[[#This Row],[Matrícula]],Usuarios[#All],5,FALSE)),\"\",VLOOKUP(BMVT[[#This Row],[Matrícula]],Usuarios[#All],5,FALSE))","v":"ADMINISTRATIVO"},23196,"Regular",{"$f":"IF(ISERROR(VLOOKUP(BMVT[[#This Row],[Rota]],Rotas[#All],3,FALSE)),\"\",VLOOKUP(BMVT[[#This Row],[Rota]],Rotas[#All],3,FALSE))","v":"Alagoinhas"},{"$f":"IF(ISERROR(VLOOKUP(BMVT[[#This Row],[Rota]],Rotas[#All],4,FALSE)),\"\",VLOOKUP(BMVT[[#This Row],[Rota]],Rotas[#All],4,FALSE))","v":"Salvador"},{"$f":"IF(ISERROR(VLOOKUP(BMVT[[#This Row],[Rota]],Rotas[#All],5,FALSE)),\"\",VLOOKUP(BMVT[[#This Row],[Rota]],Rotas[#All],5,FALSE))","v":"Intermunicipal"},{"$f":"IF(ISERROR(VLOOKUP(BMVT[[#This Row],[Rota]],Rotas[#All],6,FALSE)),\"\",VLOOKUP(BMVT[[#This Row],[Rota]],Rotas[#All],6,FALSE))","v":"Cidade Sol"},2,2,42,{"$f":"BMVT[[#This Row],[Quant. Apur.]]","v":42},21,{"$f":"IF(ISERROR(VLOOKUP(BMVT[[#This Row],[Rota]],Rotas[#All],7,FALSE)),0,VLOOKUP(BMVT[[#This Row],[Rota]],Rotas[#All],7,FALSE))","v":28.35},1190.7,null,null,{"$f":"IF(ISERROR(BMVT[[#This Row],[Origem]]&\" - \"&BMVT[[#This Row],[Destino]]),\"\",BMVT[[#This Row],[Origem]]&\" - \"&BMVT[[#This Row],[Destino]])","v":"Alagoinhas - Salvador"},null,"Fevereiro","2016-02-01","2016-02-29","2016-02-08",null,"2016-02-09","2016-02-10",null,{"$f":"NETWORKDAYS(X7,Y7,Z7:AD7)","v":18},{"$f":"COUNTA(AB7:AD7)","v":2}]
["000.003",{"$f":"IF(ISERROR(VLOOKUP(BMVT[[#This Row],[Matrícula]],Usuarios[#All],2,FALSE)),\"\",VLOOKUP(BMVT[[#This Row],[Matrícula]],Usuarios[#All],2,FALSE))","v":"Francisco"},{"$f":"IF(ISERROR(VLOOKUP(BMVT[[#This Row],[Matrícula]],Usuarios[#All],3,FALSE)),\"\",VLOOKUP(BMVT[[#This Row],[Matrícula]],Usuarios[#All],3,FALSE))","v":"Anistiado"},{"$f":"IF(ISERROR(VLOOKUP(BMVT[[#This Row],[Matrícula]],Usuarios[#All],4,FALSE)),\"\",VLOOKUP(BMVT[[#This Row],[Matrícula]],Usuarios[#All],4,FALSE))","v":"Salvador"},{"$f":"IF(ISERROR(VLOOKUP(BMVT[[#This Row],[Matrícula]],Usuarios[#All],5,FALSE)),\"\",VLOOKUP(BMVT[[#This Row],[Matrícula]],Usuarios[#All],5,FALSE))","v":"ADMINISTRATIVO"},23184,"Regular",{"$f":"IF(ISERROR(VLOOKUP(BMVT[[#This Row],[Rota]],Rotas[#All],3,FALSE)),\"\",VLOOKUP(BMVT[[#This Row],[Rota]],Rotas[#All],3,FALSE))","v":"Jequié"},{"$f":"IF(ISERROR(VLOOKUP(BMVT[[#This Row],[Rota]],Rotas[#All],4,FALSE)),\"\",VLOOKUP(BMVT[[#This Row],[Rota]],Rotas[#All],4,FALSE))","v":"Ipiaú"},{"$f":"IF(ISERROR(VLOOKUP(BMVT[[#This Row],[Rota]],Rotas[#All],5,FALSE)),\"\",VLOOKUP(BMVT[[#This Row],[Rota]],Rotas[#All],5,FALSE))","v":"Intermunicipal"},{"$f":"IF(ISERROR(VLOOKUP(BMVT[[#This Row],[Rota]],Rotas[#All],6,FALSE)),\"\",VLOOKUP(BMVT[[#This Row],[Rota]],Rotas[#All],6,FALSE))","v":"Cidade Sol"},2,{"$f":"L8","v":2},42,48,24,{"$f":"IF(ISERROR(VLOOKUP(BMVT[[#This Row],[Rota]],Rotas[#All],7,FALSE)),0,VLOOKUP(BMVT[[#This Row],[Rota]],Rotas[#All],7,FALSE))","v":10.65},511.20000000000005,null,null,{"$f":"IF(ISERROR(BMVT[[#This Row],[Origem]]&\" - \"&BMVT[[#This Row],[Destino]]),\"\",BMVT[[#This Row],[Origem]]&\" - \"&BMVT[[#This Row],[Destino]])","v":"Jequié - Ipiaú"},null,"Março","2016-03-01","2016-03-31","2016-03-25",null,"2016-03-24",null,null,{"$f":"NETWORKDAYS(X8,Y8,Z8:AD8)","v":21},1]
["000.004",{"$f":"IF(ISERROR(VLOOKUP(BMVT[[#This Row],[Matrícula]],Usuarios[#All],2,FALSE)),\"\",VLOOKUP(BMVT[[#This Row],[Matrícula]],Usuarios[#All],2,FALSE))","v":"Ricardo"},{"$f":"IF(ISERROR(VLOOKUP(BMVT[[#This Row],[Matrícula]],Usuarios[#All],3,FALSE)),\"\",VLOOKUP(BMVT[[#This Row],[Matrícula]],Usuarios[#All],3,FALSE))","v":"Empregado"},{"$f":"IF(ISERROR(VLOOKUP(BMVT[[#This Row],[Matrícula]],Usuarios[#All],4,FALSE)),\"\",VLOOKUP(BMVT[[#This Row],[Matrícula]],Usuarios[#All],4,FALSE))","v":"Salvador"},{"$f":"IF(ISERROR(VLOOKUP(BMVT[[#This Row],[Matrícula]],Usuarios[#All],5,FALSE)),\"\",VLOOKUP(BMVT[[#This Row],[Matrícula]],Usuarios[#All],5,FALSE))","v":"ADMINISTRATIVO"},23183,"Regular",{"$f":"IF(ISERROR(VLOOKUP(BMVT[[#This Row],[Rota]],Rotas[#All],3,FALSE)),\"\",VLOOKUP(BMVT[[#This Row],[Rota]],Rotas[#All],3,FALSE))","v":"Feira de Santana"},{"$f":"IF(ISERROR(VLOOKUP(BMVT[[#This Row],[Rota]],Rotas[#All],4,FALSE)),\"\",VLOOKUP(BMVT[[#This Row],[Rota]],Rotas[#All],4,FALSE))","v":"Feira de Santana"},{"$f":"IF(ISERROR(VLOOKUP(BMVT[[#This Row],[Rota]],Rotas[#All],5,FALSE)),\"\",VLOOKUP(BMVT[[#This Row],[Rota]],Rotas[#All],5,FALSE))","v":"Urbano"},{"$f":"IF(ISERROR(VLOOKUP(BMVT[[#This Row],[Rota]],Rotas[#All],6,FALSE)),\"\",VLOOKUP(BMVT[[#This Row],[Rota]],Rotas[#All],6,FALSE))","v":"Via Feira"},2,2,42,0,0,{"$f":"IF(ISERROR(VLOOKUP(BMVT[[#This Row],[Rota]],Rotas[#All],7,FALSE)),0,VLOOKUP(BMVT[[#This Row],[Rota]],Rotas[#All],7,FALSE))","v":3.1},0,null,null,{"$f":"IF(ISERROR(BMVT[[#This Row],[Origem]]&\" - \"&BMVT[[#This Row],[Destino]]),\"\",BMVT[[#This Row],[Origem]]&\" - \"&BMVT[[#This Row],[Destino]])","v":"Feira de Santana - Feira de Santana"},null,"Abril","2016-04-01","2016-04-30","2016-04-21",null,"2016-01-22",null,null,20,1]
["000.005",{"$f":"IF(ISERROR(VLOOKUP(BMVT[[#This Row],[Matrícula]],Usuarios[#All],2,FALSE)),\"\",VLOOKUP(BMVT[[#This Row],[Matrícula]],Usuarios[#All],2,FALSE))","v":"Mauro"},{"$f":"IF(ISERROR(VLOOKUP(BMVT[[#This Row],[Matrícula]],Usuarios[#All],3,FALSE)),\"\",VLOOKUP(BMVT[[#This Row],[Matrícula]],Usuarios[#All],3,FALSE))","v":"Empregado"},{"$f":"IF(ISERROR(VLOOKUP(BMVT[[#This Row],[Matrícula]],Usuarios[#All],4,FALSE)),\"\",VLOOKUP(BMVT[[#This Row],[Matrícula]],Usuarios[#All],4,FALSE))","v":"Salvador"},{"$f":"IF(ISERROR(VLOOKUP(BMVT[[#This Row],[Matrícula]],Usuarios[#All],5,FALSE)),\"\",VLOOKUP(BMVT[[#This Row],[Matrícula]],Usuarios[#All],5,FALSE))","v":"ADMINISTRATIVO"},23183,"Regular",{"$f":"IF(ISERROR(VLOOKUP(BMVT[[#This Row],[Rota]],Rotas[#All],3,FALSE)),\"\",VLOOKUP(BMVT[[#This Row],[Rota]],Rotas[#All],3,FALSE))","v":"Feira de Santana"},{"$f":"IF(ISERROR(VLOOKUP(BMVT[[#This Row],[Rota]],Rotas[#All],4,FALSE)),\"\",VLOOKUP(BMVT[[#This Row],[Rota]],Rotas[#All],4,FALSE))","v":"Feira de Santana"},{"$f":"IF(ISERROR(VLOOKUP(BMVT[[#This Row],[Rota]],Rotas[#All],5,FALSE)),\"\",VLOOKUP(BMVT[[#This Row],[Rota]],Rotas[#All],5,FALSE))","v":"Urbano"},{"$f":"IF(ISERROR(VLOOKUP(BMVT[[#This Row],[Rota]],Rotas[#All],6,FALSE)),\"\",VLOOKUP(BMVT[[#This Row],[Rota]],Rotas[#All],6,FALSE))","v":"Via Feira"},2,2,42,{"$f":"BMVT[[#This Row],[Quant. Apur.]]","v":42},21,{"$f":"IF(ISERROR(VLOOKUP(BMVT[[#This Row],[Rota]],Rotas[#All],7,FALSE)),0,VLOOKUP(BMVT[[#This Row],[Rota]],Rotas[#All],7,FALSE))","v":3.1},130.20000000000002,null,null,{"$f":"IF(ISERROR(BMVT[[#This Row],[Origem]]&\" - \"&BMVT[[#This Row],[Destino]]),\"\",BMVT[[#This Row],[Origem]]&\" - \"&BMVT[[#This Row],[Destino]])","v":"Feira de Santana - Feira de Santana"},null,"Maio","2016-05-01","2016-05-31","2016-05-26",null,"2016-05-27",null,null,20,1]
["000.006",{"$f":"IF(ISERROR(VLOOKUP(BMVT[[#This Row],[Matrícula]],Usuarios[#All],2,FALSE)),\"\",VLOOKUP(BMVT[[#This Row],[Matrícula]],Usuarios[#All],2,FALSE))","v":"Marcio"},{"$f":"IF(ISERROR(VLOOKUP(BMVT[[#This Row],[Matrícula]],Usuarios[#All],3,FALSE)),\"\",VLOOKUP(BMVT[[#This Row],[Matrícula]],Usuarios[#All],3,FALSE))","v":"Empregado"},{"$f":"IF(ISERROR(VLOOKUP(BMVT[[#This Row],[Matrícula]],Usuarios[#All],4,FALSE)),\"\",VLOOKUP(BMVT[[#This Row],[Matrícula]],Usuarios[#All],4,FALSE))","v":"Salvador"},{"$f":"IF(ISERROR(VLOOKUP(BMVT[[#This Row],[Matrícula]],Usuarios[#All],5,FALSE)),\"\",VLOOKUP(BMVT[[#This Row],[Matrícula]],Usuarios[#All],5,FALSE))","v":"ADMINISTRATIVO"},"23125-M","Regular",{"$f":"IF(ISERROR(VLOOKUP(BMVT[[#This Row],[Rota]],Rotas[#All],3,FALSE)),\"\",VLOOKUP(BMVT[[#This Row],[Rota]],Rotas[#All],3,FALSE))","v":"Conceição de Feira"},{"$f":"IF(ISERROR(VLOOKUP(BMVT[[#This Row],[Rota]],Rotas[#All],4,FALSE)),\"\",VLOOKUP(BMVT[[#This Row],[Rota]],Rotas[#All],4,FALSE))","v":"Salvador"},{"$f":"IF(ISERROR(VLOOKUP(BMVT[[#This Row],[Rota]],Rotas[#All],5,FALSE)),\"\",VLOOKUP(BMVT[[#This Row],[Rota]],Rotas[#All],5,FALSE))","v":"Intermunicipal"},{"$f":"IF(ISERROR(VLOOKUP(BMVT[[#This Row],[Rota]],Rotas[#All],6,FALSE)),\"\",VLOOKUP(BMVT[[#This Row],[Rota]],Rotas[#All],6,FALSE))","v":"Viação Jauá"},2,2,42,10,5,{"$f":"IF(ISERROR(VLOOKUP(BMVT[[#This Row],[Rota]],Rotas[#All],7,FALSE)),0,VLOOKUP(BMVT[[#This Row],[Rota]],Rotas[#All],7,FALSE))","v":23.03},230.3,null,null,{"$f":"IF(ISERROR(BMVT[[#This Row],[Origem]]&\" - \"&BMVT[[#This Row],[Destino]]),\"\",BMVT[[#This Row],[Origem]]&\" - \"&BMVT[[#This Row],[Destino]])","v":"Conceição de Feira - Salvador"},null,"Junho","2016-06-01","2016-06-30",null,null,null,"2016-06-24",null,21,1]
["000.007",{"$f":"IF(ISERROR(VLOOKUP(BMVT[[#This Row],[Matrícula]],Usuarios[#All],2,FALSE)),\"\",VLOOKUP(BMVT[[#This Row],[Matrícula]],Usuarios[#All],2,FALSE))","v":"Carla"},{"$f":"IF(ISERROR(VLOOKUP(BMVT[[#This Row],[Matrícula]],Usuarios[#All],3,FALSE)),\"\",VLOOKUP(BMVT[[#This Row],[Matrícula]],Usuarios[#All],3,FALSE))","v":"Empregado"},{"$f":"IF(ISERROR(VLOOKUP(BMVT[[#This Row],[Matrícula]],Usuarios[#All],4,FALSE)),\"\",VLOOKUP(BMVT[[#This Row],[Matrícula]],Usuarios[#All],4,FALSE))","v":"Salvador"},{"$f":"IF(ISERROR(VLOOKUP(BMVT[[#This Row],[Matrícula]],Usuarios[#All],5,FALSE)),\"\",VLOOKUP(BMVT[[#This Row],[Matrícula]],Usuarios[#All],5,FALSE))","v":"ADMINISTRATIVO"},"23125-M","Regular",{"$f":"IF(ISERROR(VLOOKUP(BMVT[[#This Row],[Rota]],Rotas[#All],3,FALSE)),\"\",VLOOKUP(BMVT[[#This Row],[Rota]],Rotas[#All],3,FALSE))","v":"Conceição de Feira"},{"$f":"IF(ISERROR(VLOOKUP(BMVT[[#This Row],[Rota]],Rotas[#All],4,FALSE)),\"\",VLOOKUP(BMVT[[#This Row],[Rota]],Rotas[#All],4,FALSE))","v":"Salvador"},{"$f":"IF(ISERROR(VLOOKUP(BMVT[[#This Row],[Rota]],Rotas[#All],5,FALSE)),\"\",VLOOKUP(BMVT[[#This Row],[Rota]],Rotas[#All],5,FALSE))","v":"Intermunicipal"},{"$f":"IF(ISERROR(VLOOKUP(BMVT[[#This Row],[Rota]],Rotas[#All],6,FALSE)),\"\",VLOOKUP(BMVT[[#This Row],[Rota]],Rotas[#All],6,FALSE))","v":"Viação Jauá"},2,2,42,{"$f":"BMVT[[#This Row],[Quant. Apur.]]","v":42},21,{"$f":"IF(ISERROR(VLOOKUP(BMVT[[#This Row],[Rota]],Rotas[#All],7,FALSE)),0,VLOOKUP(BMVT[[#This Row],[Rota]],Rotas[#All],7,FALSE))","v":23.03},967.26,null,null,{"$f":"IF(ISERROR(BMVT[[#This Row],[Origem]]&\" - \"&BMVT[[#This Row],[Destino]]),\"\",BMVT[[#This Row],[Origem]]&\" - \"&BMVT[[#This Row],[Destino]])","v":"Conceição de Feira - Salvador"},null,"Julho","2016-07-01","2016-07-31",null,null,null,null,null,21,0]
["000.008",{"$f":"IF(ISERROR(VLOOKUP(BMVT[[#This Row],[Matrícula]],Usuarios[#All],2,FALSE)),\"\",VLOOKUP(BMVT[[#This Row],[Matrícula]],Usuarios[#All],2,FALSE))","v":"Caroline"},{"$f":"IF(ISERROR(VLOOKUP(BMVT[[#This Row],[Matrícula]],Usuarios[#All],3,FALSE)),\"\",VLOOKUP(BMVT[[#This Row],[Matrícula]],Usuarios[#All],3,FALSE))","v":"Empregado"},{"$f":"IF(ISERROR(VLOOKUP(BMVT[[#This Row],[Matrícula]],Usuarios[#All],4,FALSE)),\"\",VLOOKUP(BMVT[[#This Row],[Matrícula]],Usuarios[#All],4,FALSE))","v":"Salvador"},{"$f":"IF(ISERROR(VLOOKUP(BMVT[[#This Row],[Matrícula]],Usuarios[#All],5,FALSE)),\"\",VLOOKUP(BMVT[[#This Row],[Matrícula]],Usuarios[#All],5,FALSE))","v":"COMERCIAL"},"23190-V","Regular",{"$f":"IF(ISERROR(VLOOKUP(BMVT[[#This Row],[Rota]],Rotas[#All],3,FALSE)),\"\",VLOOKUP(BMVT[[#This Row],[Rota]],Rotas[#All],3,FALSE))","v":"Lauro de Freitas"},{"$f":"IF(ISERROR(VLOOKUP(BMVT[[#This Row],[Rota]],Rotas[#All],4,FALSE)),\"\",VLOOKUP(BMVT[[#This Row],[Rota]],Rotas[#All],4,FALSE))","v":"Salvador"},{"$f":"IF(ISERROR(VLOOKUP(BMVT[[#This Row],[Rota]],Rotas[#All],5,FALSE)),\"\",VLOOKUP(BMVT[[#This Row],[Rota]],Rotas[#All],5,FALSE))","v":"Intermunicipal"},{"$f":"IF(ISERROR(VLOOKUP(BMVT[[#This Row],[Rota]],Rotas[#All],6,FALSE)),\"\",VLOOKUP(BMVT[[#This Row],[Rota]],Rotas[#All],6,FALSE))","v":"Metropasse"},2,2,42,{"$f":"BMVT[[#This Row],[Quant. Apur.]]","v":42},21,{"$f":"IF(ISERROR(VLOOKUP(BMVT[[#This Row],[Rota]],Rotas[#All],7,FALSE)),0,VLOOKUP(BMVT[[#This Row],[Rota]],Rotas[#All],7,FALSE))","v":3.3},138.6,null,null,{"$f":"IF(ISERROR(BMVT[[#This Row],[Origem]]&\" - \"&BMVT[[#This Row],[Destino]]),\"\",BMVT[[#This Row],[Origem]]&\" - \"&BMVT[[#This Row],[Destino]])","v":"Lauro de Freitas - Salvador"},null,"Agosto","2016-08-01","2016-08-31",null,null,null,null,null,23,0]
["000.009",{"$f":"IF(ISERROR(VLOOKUP(BMVT[[#This Row],[Matrícula]],Usuarios[#All],2,FALSE)),\"\",VLOOKUP(BMVT[[#This Row],[Matrícula]],Usuarios[#All],2,FALSE))","v":"Pedro"},{"$f":"IF(ISERROR(VLOOKUP(BMVT[[#This Row],[Matrícula]],Usuarios[#All],3,FALSE)),\"\",VLOOKUP(BMVT[[#This Row],[Matrícula]],Usuarios[#All],3,FALSE))","v":"Empregado"},{"$f":"IF(ISERROR(VLOOKUP(BMVT[[#This Row],[Matrícula]],Usuarios[#All],4,FALSE)),\"\",VLOOKUP(BMVT[[#This Row],[Matrícula]],Usuarios[#All],4,FALSE))","v":"Salvador"},{"$f":"IF(ISERROR(VLOOKUP(BMVT[[#This Row],[Matrícula]],Usuarios[#All],5,FALSE)),\"\",VLOOKUP(BMVT[[#This Row],[Matrícula]],Usuarios[#All],5,FALSE))","v":"COMERCIAL"},"23190-V","Regular",{"$f":"IF(ISERROR(VLOOKUP(BMVT[[#This Row],[Rota]],Rotas[#All],3,FALSE)),\"\",VLOOKUP(BMVT[[#This Row],[Rota]],Rotas[#All],3,FALSE))","v":"Lauro de Freitas"},{"$f":"IF(ISERROR(VLOOKUP(BMVT[[#This Row],[Rota]],Rotas[#All],4,FALSE)),\"\",VLOOKUP(BMVT[[#This Row],[Rota]],Rotas[#All],4,FALSE))","v":"Salvador"},{"$f":"IF(ISERROR(VLOOKUP(BMVT[[#This Row],[Rota]],Rotas[#All],5,FALSE)),\"\",VLOOKUP(BMVT[[#This Row],[Rota]],Rotas[#All],5,FALSE))","v":"Intermunicipal"},{"$f":"IF(ISERROR(VLOOKUP(BMVT[[#This Row],[Rota]],Rotas[#All],6,FALSE)),\"\",VLOOKUP(BMVT[[#This Row],[Rota]],Rotas[#All],6,FALSE))","v":"Metropasse"},2,2,42,{"$f":"BMVT[[#This Row],[Quant. Apur.]]*0","v":0},0,{"$f":"IF(ISERROR(VLOOKUP(BMVT[[#This Row],[Rota]],Rotas[#All],7,FALSE)),0,VLOOKUP(BMVT[[#This Row],[Rota]],Rotas[#All],7,FALSE))","v":3.3},0,null,null,{"$f":"IF(ISERROR(BMVT[[#This Row],[Origem]]&\" - \"&BMVT[[#This Row],[Destino]]),\"\",BMVT[[#This Row],[Origem]]&\" - \"&BMVT[[#This Row],[Destino]])","v":"Lauro de Freitas - Salvador"},null,"Setembro","2016-09-01","2016-09-30","2016-09-07",null,null,null,null,21,0]
["000.010",{"$f":"IF(ISERROR(VLOOKUP(BMVT[[#This Row],[Matrícula]],Usuarios[#All],2,FALSE)),\"\",VLOOKUP(BMVT[[#This Row],[Matrícula]],Usuarios[#All],2,FALSE))","v":"Paulo"},{"$f":"IF(ISERROR(VLOOKUP(BMVT[[#This Row],[Matrícula]],Usuarios[#All],3,FALSE)),\"\",VLOOKUP(BMVT[[#This Row],[Matrícula]],Usuarios[#All],3,FALSE))","v":"Empregado"},{"$f":"IF(ISERROR(VLOOKUP(BMVT[[#This Row],[Matrícula]],Usuarios[#All],4,FALSE)),\"\",VLOOKUP(BMVT[[#This Row],[Matrícula]],Usuarios[#All],4,FALSE))","v":"Salvador"},{"$f":"IF(ISERROR(VLOOKUP(BMVT[[#This Row],[Matrícula]],Usuarios[#All],5,FALSE)),\"\",VLOOKUP(BMVT[[#This Row],[Matrícula]],Usuarios[#All],5,FALSE))","v":"COMERCIAL"},"23190-V","Regular",{"$f":"IF(ISERROR(VLOOKUP(BMVT[[#This Row],[Rota]],Rotas[#All],3,FALSE)),\"\",VLOOKUP(BMVT[[#This Row],[Rota]],Rotas[#All],3,FALSE))","v":"Lauro de Freitas"},{"$f":"IF(ISERROR(VLOOKUP(BMVT[[#This Row],[Rota]],Rotas[#All],4,FALSE)),\"\",VLOOKUP(BMVT[[#This Row],[Rota]],Rotas[#All],4,FALSE))","v":"Salvador"},{"$f":"IF(ISERROR(VLOOKUP(BMVT[[#This Row],[Rota]],Rotas[#All],5,FALSE)),\"\",VLOOKUP(BMVT[[#This Row],[Rota]],Rotas[#All],5,FALSE))","v":"Intermunicipal"},{"$f":"IF(ISERROR(VLOOKUP(BMVT[[#This Row],[Rota]],Rotas[#All],6,FALSE)),\"\",VLOOKUP(BMVT[[#This Row],[Rota]],Rotas[#All],6,FALSE))","v":"Metropasse"},2,2,42,{"$f":"BMVT[[#This Row],[Quant. Apur.]]","v":42},21,{"$f":"IF(ISERROR(VLOOKUP(BMVT[[#This Row],[Rota]],Rotas[#All],7,FALSE)),0,VLOOKUP(BMVT[[#This Row],[Rota]],Rotas[#All],7,FALSE))","v":3.3},138.6,null,null,{"$f":"IF(ISERROR(BMVT[[#This Row],[Origem]]&\" - \"&BMVT[[#This Row],[Destino]]),\"\",BMVT[[#This Row],[Origem]]&\" - \"&BMVT[[#This Row],[Destino]])","v":"Lauro de Freitas - Salvador"},null,"Outubro","2016-10-01","2016-10-31","2016-10-12",null,null,null,null,20,0]
["000.011",{"$f":"IF(ISERROR(VLOOKUP(BMVT[[#This Row],[Matrícula]],Usuarios[#All],2,FALSE)),\"\",VLOOKUP(BMVT[[#This Row],[Matrícula]],Usuarios[#All],2,FALSE))","v":"Rafael"},{"$f":"IF(ISERROR(VLOOKUP(BMVT[[#This Row],[Matrícula]],Usuarios[#All],3,FALSE)),\"\",VLOOKUP(BMVT[[#This Row],[Matrícula]],Usuarios[#All],3,FALSE))","v":"Empregado"},{"$f":"IF(ISERROR(VLOOKUP(BMVT[[#This Row],[Matrícula]],Usuarios[#All],4,FALSE)),\"\",VLOOKUP(BMVT[[#This Row],[Matrícula]],Usuarios[#All],4,FALSE))","v":"Salvador"},{"$f":"IF(ISERROR(VLOOKUP(BMVT[[#This Row],[Matrícula]],Usuarios[#All],5,FALSE)),\"\",VLOOKUP(BMVT[[#This Row],[Matrícula]],Usuarios[#All],5,FALSE))","v":"COMERCIAL"},"23190-V","Regular",{"$f":"IF(ISERROR(VLOOKUP(BMVT[[#This Row],[Rota]],Rotas[#All],3,FALSE)),\"\",VLOOKUP(BMVT[[#This Row],[Rota]],Rotas[#All],3,FALSE))","v":"Lauro de Freitas"},{"$f":"IF(ISERROR(VLOOKUP(BMVT[[#This Row],[Rota]],Rotas[#All],4,FALSE)),\"\",VLOOKUP(BMVT[[#This Row],[Rota]],Rotas[#All],4,FALSE))","v":"Salvador"},{"$f":"IF(ISERROR(VLOOKUP(BMVT[[#This Row],[Rota]],Rotas[#All],5,FALSE)),\"\",VLOOKUP(BMVT[[#This Row],[Rota]],Rotas[#All],5,FALSE))","v":"Intermunicipal"},{"$f":"IF(ISERROR(VLOOKUP(BMVT[[#This Row],[Rota]],Rotas[#All],6,FALSE)),\"\",VLOOKUP(BMVT[[#This Row],[Rota]],Rotas[#All],6,FALSE))","v":"Metropasse"},2,2,42,{"$f":"BMVT[[#This Row],[Quant. Apur.]]","v":42},21,{"$f":"IF(ISERROR(VLOOKUP(BMVT[[#This Row],[Rota]],Rotas[#All],7,FALSE)),0,VLOOKUP(BMVT[[#This Row],[Rota]],Rotas[#All],7,FALSE))","v":3.3},138.6,null,null,{"$f":"IF(ISERROR(BMVT[[#This Row],[Origem]]&\" - \"&BMVT[[#This Row],[Destino]]),\"\",BMVT[[#This Row],[Origem]]&\" - \"&BMVT[[#This Row],[Destino]])","v":"Lauro de Freitas - Salvador"},null,"Novembro","2016-11-01","2016-11-30","2016-11-02","2016-11-15","2016-11-14",null,null,{"$f":"NETWORKDAYS(X16,Y16,Z16:AD16)","v":19},1]
["000.012",{"$f":"IF(ISERROR(VLOOKUP(BMVT[[#This Row],[Matrícula]],Usuarios[#All],2,FALSE)),\"\",VLOOKUP(BMVT[[#This Row],[Matrícula]],Usuarios[#All],2,FALSE))","v":"Ricardo"},{"$f":"IF(ISERROR(VLOOKUP(BMVT[[#This Row],[Matrícula]],Usuarios[#All],3,FALSE)),\"\",VLOOKUP(BMVT[[#This Row],[Matrícula]],Usuarios[#All],3,FALSE))","v":"Empregado"},{"$f":"IF(ISERROR(VLOOKUP(BMVT[[#This Row],[Matrícula]],Usuarios[#All],4,FALSE)),\"\",VLOOKUP(BMVT[[#This Row],[Matrícula]],Usuarios[#All],4,FALSE))","v":"Salvador"},{"$f":"IF(ISERROR(VLOOKUP(BMVT[[#This Row],[Matrícula]],Usuarios[#All],5,FALSE)),\"\",VLOOKUP(BMVT[[#This Row],[Matrícula]],Usuarios[#All],5,FALSE))","v":"COMERCIAL"},"23170-I","Regular",{"$f":"IF(ISERROR(VLOOKUP(BMVT[[#This Row],[Rota]],Rotas[#All],3,FALSE)),\"\",VLOOKUP(BMVT[[#This Row],[Rota]],Rotas[#All],3,FALSE))","v":"Aracaju"},{"$f":"IF(ISERROR(VLOOKUP(BMVT[[#This Row],[Rota]],Rotas[#All],4,FALSE)),\"\",VLOOKUP(BMVT[[#This Row],[Rota]],Rotas[#All],4,FALSE))","v":"Aracaju"},{"$f":"IF(ISERROR(VLOOKUP(BMVT[[#This Row],[Rota]],Rotas[#All],5,FALSE)),\"\",VLOOKUP(BMVT[[#This Row],[Rota]],Rotas[#All],5,FALSE))","v":"Urbano"},{"$f":"IF(ISERROR(VLOOKUP(BMVT[[#This Row],[Rota]],Rotas[#All],6,FALSE)),\"\",VLOOKUP(BMVT[[#This Row],[Rota]],Rotas[#All],6,FALSE))","v":"Aracaju Card"},2,2,42,{"$f":"BMVT[[#This Row],[Quant. Apur.]]+12","v":54},27,{"$f":"IF(ISERROR(VLOOKUP(BMVT[[#This Row],[Rota]],Rotas[#All],7,FALSE)),0,VLOOKUP(BMVT[[#This Row],[Rota]],Rotas[#All],7,FALSE))","v":3.1},167.4,null,null,{"$f":"IF(ISERROR(BMVT[[#This Row],[Origem]]&\" - \"&BMVT[[#This Row],[Destino]]),\"\",BMVT[[#This Row],[Origem]]&\" - \"&BMVT[[#This Row],[Destino]])","v":"Aracaju - Aracaju"}]
["000.013",{"$f":"IF(ISERROR(VLOOKUP(BMVT[[#This Row],[Matrícula]],Usuarios[#All],2,FALSE)),\"\",VLOOKUP(BMVT[[#This Row],[Matrícula]],Usuarios[#All],2,FALSE))","v":"Jose"},{"$f":"IF(ISERROR(VLOOKUP(BMVT[[#This Row],[Matrícula]],Usuarios[#All],3,FALSE)),\"\",VLOOKUP(BMVT[[#This Row],[Matrícula]],Usuarios[#All],3,FALSE))","v":"Empregado"},{"$f":"IF(ISERROR(VLOOKUP(BMVT[[#This Row],[Matrícula]],Usuarios[#All],4,FALSE)),\"\",VLOOKUP(BMVT[[#This Row],[Matrícula]],Usuarios[#All],4,FALSE))","v":"Salvador"},{"$f":"IF(ISERROR(VLOOKUP(BMVT[[#This Row],[Matrícula]],Usuarios[#All],5,FALSE)),\"\",VLOOKUP(BMVT[[#This Row],[Matrícula]],Usuarios[#All],5,FALSE))","v":"COMERCIAL"},"xxxxx-Y (Pool)","Regular",{"$f":"IF(ISERROR(VLOOKUP(BMVT[[#This Row],[Rota]],Rotas[#All],3,FALSE)),\"\",VLOOKUP(BMVT[[#This Row],[Rota]],Rotas[#All],3,FALSE))","v":"Feira de Santana"},{"$f":"IF(ISERROR(VLOOKUP(BMVT[[#This Row],[Rota]],Rotas[#All],4,FALSE)),\"\",VLOOKUP(BMVT[[#This Row],[Rota]],Rotas[#All],4,FALSE))","v":"Camaçari"},{"$f":"IF(ISERROR(VLOOKUP(BMVT[[#This Row],[Rota]],Rotas[#All],5,FALSE)),\"\",VLOOKUP(BMVT[[#This Row],[Rota]],Rotas[#All],5,FALSE))","v":"Intermunicipal"},{"$f":"IF(ISERROR(VLOOKUP(BMVT[[#This Row],[Rota]],Rotas[#All],6,FALSE)),\"\",VLOOKUP(BMVT[[#This Row],[Rota]],Rotas[#All],6,FALSE))","v":"Lis Transportes"},2,{"$f":"L18","v":2},42,10,5,{"$f":"IF(ISERROR(VLOOKUP(BMVT[[#This Row],[Rota]],Rotas[#All],7,FALSE)),0,VLOOKUP(BMVT[[#This Row],[Rota]],Rotas[#All],7,FALSE))","v":650},{"$f":"Q18","v":650},null,null,{"$f":"IF(ISERROR(BMVT[[#This Row],[Origem]]&\" - \"&BMVT[[#This Row],[Destino]]),\"\",BMVT[[#This Row],[Origem]]&\" - \"&BMVT[[#This Row],[Destino]])","v":"Feira de Santana - Camaçari"}]
["000.014",{"$f":"IF(ISERROR(VLOOKUP(BMVT[[#This Row],[Matrícula]],Usuarios[#All],2,FALSE)),\"\",VLOOKUP(BMVT[[#This Row],[Matrícula]],Usuarios[#All],2,FALSE))","v":"Felipe"},{"$f":"IF(ISERROR(VLOOKUP(BMVT[[#This Row],[Matrícula]],Usuarios[#All],3,FALSE)),\"\",VLOOKUP(BMVT[[#This Row],[Matrícula]],Usuarios[#All],3,FALSE))","v":"Empregado"},{"$f":"IF(ISERROR(VLOOKUP(BMVT[[#This Row],[Matrícula]],Usuarios[#All],4,FALSE)),\"\",VLOOKUP(BMVT[[#This Row],[Matrícula]],Usuarios[#All],4,FALSE))","v":"Salvador"},{"$f":"IF(ISERROR(VLOOKUP(BMVT[[#This Row],[Matrícula]],Usuarios[#All],5,FALSE)),\"\",VLOOKUP(BMVT[[#This Row],[Matrícula]],Usuarios[#All],5,FALSE))","v":"COMERCIAL"},23182,"Regular",{"$f":"IF(ISERROR(VLOOKUP(BMVT[[#This Row],[Rota]],Rotas[#All],3,FALSE)),\"\",VLOOKUP(BMVT[[#This Row],[Rota]],Rotas[#All],3,FALSE))","v":"Amélia Rodrigues"},{"$f":"IF(ISERROR(VLOOKUP(BMVT[[#This Row],[Rota]],Rotas[#All],4,FALSE)),\"\",VLOOKUP(BMVT[[#This Row],[Rota]],Rotas[#All],4,FALSE))","v":"Governador Mangabeira"},{"$f":"IF(ISERROR(VLOOKUP(BMVT[[#This Row],[Rota]],Rotas[#All],5,FALSE)),\"\",VLOOKUP(BMVT[[#This Row],[Rota]],Rotas[#All],5,FALSE))","v":"Intermunicipal"},{"$f":"IF(ISERROR(VLOOKUP(BMVT[[#This Row],[Rota]],Rotas[#All],6,FALSE)),\"\",VLOOKUP(BMVT[[#This Row],[Rota]],Rotas[#All],6,FALSE))","v":"RD Transportes"},2,2,42,25,12.5,10.06,{"$f":"O19*Q19","v":251.5},null,null,{"$f":"IF(ISERROR(BMVT[[#This Row],[Origem]]&\" - \"&BMVT[[#This Row],[Destino]]),\"\",BMVT[[#This Row],[Origem]]&\" - \"&BMVT[[#This Row],[Destino]])","v":"Amélia Rodrigues - Governador Mangabeira"}]
["000.015",{"$f":"IF(ISERROR(VLOOKUP(BMVT[[#This Row],[Matrícula]],Usuarios[#All],2,FALSE)),\"\",VLOOKUP(BMVT[[#This Row],[Matrícula]],Usuarios[#All],2,FALSE))","v":"Julio"},{"$f":"IF(ISERROR(VLOOKUP(BMVT[[#This Row],[Matrícula]],Usuarios[#All],3,FALSE)),\"\",VLOOKUP(BMVT[[#This Row],[Matrícula]],Usuarios[#All],3,FALSE))","v":"Empregado"},{"$f":"IF(ISERROR(VLOOKUP(BMVT[[#This Row],[Matrícula]],Usuarios[#All],4,FALSE)),\"\",VLOOKUP(BMVT[[#This Row],[Matrícula]],Usuarios[#All],4,FALSE))","v":"Salvador"},{"$f":"IF(ISERROR(VLOOKUP(BMVT[[#This Row],[Matrícula]],Usuarios[#All],5,FALSE)),\"\",VLOOKUP(BMVT[[#This Row],[Matrícula]],Usuarios[#All],5,FALSE))","v":"COMERCIAL"},"23101-A (09096)","Regular",{"$f":"IF(ISERROR(VLOOKUP(BMVT[[#This Row],[Rota]],Rotas[#All],3,FALSE)),\"\",VLOOKUP(BMVT[[#This Row],[Rota]],Rotas[#All],3,FALSE))","v":"Salvador"},{"$f":"IF(ISERROR(VLOOKUP(BMVT[[#This Row],[Rota]],Rotas[#All],4,FALSE)),\"\",VLOOKUP(BMVT[[#This Row],[Rota]],Rotas[#All],4,FALSE))","v":"Salvador"},{"$f":"IF(ISERROR(VLOOKUP(BMVT[[#This Row],[Rota]],Rotas[#All],5,FALSE)),\"\",VLOOKUP(BMVT[[#This Row],[Rota]],Rotas[#All],5,FALSE))","v":"Urbano"},{"$f":"IF(ISERROR(VLOOKUP(BMVT[[#This Row],[Rota]],Rotas[#All],6,FALSE)),\"\",VLOOKUP(BMVT[[#This Row],[Rota]],Rotas[#All],6,FALSE))","v":"Salvador Card"},2,4,{"$f":"L20*$G$1","v":42},{"$f":"BMVT[[#This Row],[Quant. Apur.]]","v":42},10.5,{"$f":"IF(ISERROR(VLOOKUP(BMVT[[#This Row],[Rota]],Rotas[#All],7,FALSE)),0,VLOOKUP(BMVT[[#This Row],[Rota]],Rotas[#All],7,FALSE))","v":3.3},138.6,null,null,{"$f":"IF(ISERROR(BMVT[[#This Row],[Origem]]&\" - \"&BMVT[[#This Row],[Destino]]),\"\",BMVT[[#This Row],[Origem]]&\" - \"&BMVT[[#This Row],[Destino]])","v":"Salvador - Salvador"}]
["000.016",{"$f":"IF(ISERROR(VLOOKUP(BMVT[[#This Row],[Matrícula]],Usuarios[#All],2,FALSE)),\"\",VLOOKUP(BMVT[[#This Row],[Matrícula]],Usuarios[#All],2,FALSE))","v":"Lucia"},{"$f":"IF(ISERROR(VLOOKUP(BMVT[[#This Row],[Matrícula]],Usuarios[#All],3,FALSE)),\"\",VLOOKUP(BMVT[[#This Row],[Matrícula]],Usuarios[#All],3,FALSE))","v":"Empregado"},{"$f":"IF(ISERROR(VLOOKUP(BMVT[[#This Row],[Matrícula]],Usuarios[#All],4,FALSE)),\"\",VLOOKUP(BMVT[[#This Row],[Matrícula]],Usuarios[#All],4,FALSE))","v":"Salvador"},{"$f":"IF(ISERROR(VLOOKUP(BMVT[[#This Row],[Matrícula]],Usuarios[#All],5,FALSE)),\"\",VLOOKUP(BMVT[[#This Row],[Matrícula]],Usuarios[#All],5,FALSE))","v":"PESSOAL"},"23101-A (09096)","Regular",{"$f":"IF(ISERROR(VLOOKUP(BMVT[[#This Row],[Rota]],Rotas[#All],3,FALSE)),\"\",VLOOKUP(BMVT[[#This Row],[Rota]],Rotas[#All],3,FALSE))","v":"Salvador"},{"$f":"IF(ISERROR(VLOOKUP(BMVT[[#This Row],[Rota]],Rotas[#All],4,FALSE)),\"\",VLOOKUP(BMVT[[#This Row],[Rota]],Rotas[#All],4,FALSE))","v":"Salvador"},{"$f":"IF(ISERROR(VLOOKUP(BMVT[[#This Row],[Rota]],Rotas[#All],5,FALSE)),\"\",VLOOKUP(BMVT[[#This Row],[Rota]],Rotas[#All],5,FALSE))","v":"Urbano"},{"$f":"IF(ISERROR(VLOOKUP(BMVT[[#This Row],[Rota]],Rotas[#All],6,FALSE)),\"\",VLOOKUP(BMVT[[#This Row],[Rota]],Rotas[#All],6,FALSE))","v":"Salvador Card"},2,2,42,{"$f":"BMVT[[#This Row],[Quant. Apur.]]+2","v":44},22,{"$f":"IF(ISERROR(VLOOKUP(BMVT[[#This Row],[Rota]],Rotas[#All],7,FALSE)),0,VLOOKUP(BMVT[[#This Row],[Rota]],Rotas[#All],7,FALSE))","v":3.3},145.19999999999999,null,null,{"$f":"IF(ISERROR(BMVT[[#This Row],[Origem]]&\" - \"&BMVT[[#This Row],[Destino]]),\"\",BMVT[[#This Row],[Origem]]&\" - \"&BMVT[[#This Row],[Destino]])","v":"Salvador - Salvador"}]
["000.017",{"$f":"IF(ISERROR(VLOOKUP(BMVT[[#This Row],[Matrícula]],Usuarios[#All],2,FALSE)),\"\",VLOOKUP(BMVT[[#This Row],[Matrícula]],Usuarios[#All],2,FALSE))","v":"Luciano"},{"$f":"IF(ISERROR(VLOOKUP(BMVT[[#This Row],[Matrícula]],Usuarios[#All],3,FALSE)),\"\",VLOOKUP(BMVT[[#This Row],[Matrícula]],Usuarios[#All],3,FALSE))","v":"Empregado"},{"$f":"IF(ISERROR(VLOOKUP(BMVT[[#This Row],[Matrícula]],Usuarios[#All],4,FALSE)),\"\",VLOOKUP(BMVT[[#This Row],[Matrícula]],Usuarios[#All],4,FALSE))","v":"Salvador"},{"$f":"IF(ISERROR(VLOOKUP(BMVT[[#This Row],[Matrícula]],Usuarios[#All],5,FALSE)),\"\",VLOOKUP(BMVT[[#This Row],[Matrícula]],Usuarios[#All],5,FALSE))","v":"PESSOAL"},"23101-A (09096)","Regular",{"$f":"IF(ISERROR(VLOOKUP(BMVT[[#This Row],[Rota]],Rotas[#All],3,FALSE)),\"\",VLOOKUP(BMVT[[#This Row],[Rota]],Rotas[#All],3,FALSE))","v":"Salvador"},{"$f":"IF(ISERROR(VLOOKUP(BMVT[[#This Row],[Rota]],Rotas[#All],4,FALSE)),\"\",VLOOKUP(BMVT[[#This Row],[Rota]],Rotas[#All],4,FALSE))","v":"Salvador"},{"$f":"IF(ISERROR(VLOOKUP(BMVT[[#This Row],[Rota]],Rotas[#All],5,FALSE)),\"\",VLOOKUP(BMVT[[#This Row],[Rota]],Rotas[#All],5,FALSE))","v":"Urbano"},{"$f":"IF(ISERROR(VLOOKUP(BMVT[[#This Row],[Rota]],Rotas[#All],6,FALSE)),\"\",VLOOKUP(BMVT[[#This Row],[Rota]],Rotas[#All],6,FALSE))","v":"Salvador Card"},0,0,0,{"$f":"BMVT[[#This Row],[Quant. Apur.]]","v":0},0,{"$f":"IF(ISERROR(VLOOKUP(BMVT[[#This Row],[Rota]],Rotas[#All],7,FALSE)),0,VLOOKUP(BMVT[[#This Row],[Rota]],Rotas[#All],7,FALSE))","v":3.3},0,null,null,{"$f":"IF(ISERROR(BMVT[[#This Row],[Origem]]&\" - \"&BMVT[[#This Row],[Destino]]),\"\",BMVT[[#This Row],[Origem]]&\" - \"&BMVT[[#This Row],[Destino]])","v":"Salvador - Salvador"}]
["000.018",{"$f":"IF(ISERROR(VLOOKUP(BMVT[[#This Row],[Matrícula]],Usuarios[#All],2,FALSE)),\"\",VLOOKUP(BMVT[[#This Row],[Matrícula]],Usuarios[#All],2,FALSE))","v":"Bruno"},{"$f":"IF(ISERROR(VLOOKUP(BMVT[[#This Row],[Matrícula]],Usuarios[#All],3,FALSE)),\"\",VLOOKUP(BMVT[[#This Row],[Matrícula]],Usuarios[#All],3,FALSE))","v":"Empregado"},{"$f":"IF(ISERROR(VLOOKUP(BMVT[[#This Row],[Matrícula]],Usuarios[#All],4,FALSE)),\"\",VLOOKUP(BMVT[[#This Row],[Matrícula]],Usuarios[#All],4,FALSE))","v":"Salvador"},{"$f":"IF(ISERROR(VLOOKUP(BMVT[[#This Row],[Matrícula]],Usuarios[#All],5,FALSE)),\"\",VLOOKUP(BMVT[[#This Row],[Matrícula]],Usuarios[#All],5,FALSE))","v":"PESSOAL"},"23101-A (09096)","Regular",{"$f":"IF(ISERROR(VLOOKUP(BMVT[[#This Row],[Rota]],Rotas[#All],3,FALSE)),\"\",VLOOKUP(BMVT[[#This Row],[Rota]],Rotas[#All],3,FALSE))","v":"Salvador"},{"$f":"IF(ISERROR(VLOOKUP(BMVT[[#This Row],[Rota]],Rotas[#All],4,FALSE)),\"\",VLOOKUP(BMVT[[#This Row],[Rota]],Rotas[#All],4,FALSE))","v":"Salvador"},{"$f":"IF(ISERROR(VLOOKUP(BMVT[[#This Row],[Rota]],Rotas[#All],5,FALSE)),\"\",VLOOKUP(BMVT[[#This Row],[Rota]],Rotas[#All],5,FALSE))","v":"Urbano"},{"$f":"IF(ISERROR(VLOOKUP(BMVT[[#This Row],[Rota]],Rotas[#All],6,FALSE)),\"\",VLOOKUP(BMVT[[#This Row],[Rota]],Rotas[#All],6,FALSE))","v":"Salvador Card"},2,{"$f":"L23","v":2},{"$f":"L23*$G$1","v":42},{"$f":"BMVT[[#This Row],[Quant. Apur.]]","v":42},{"$f":"IF(ISERROR(O23/M23),0,O23/M23)","v":21},{"$f":"IF(ISERROR(VLOOKUP(BMVT[[#This Row],[Rota]],Rotas[#All],7,FALSE)),0,VLOOKUP(BMVT[[#This Row],[Rota]],Rotas[#All],7,FALSE))","v":3.3},{"$f":"O23*Q23","v":138.6},null,null,{"$f":"IF(ISERROR(BMVT[[#This Row],[Origem]]&\" - \"&BMVT[[#This Row],[Destino]]),\"\",BMVT[[#This Row],[Origem]]&\" - \"&BMVT[[#This Row],[Destino]])","v":"Salvador - Salvador"}]
["000.019",{"$f":"IF(ISERROR(VLOOKUP(BMVT[[#This Row],[Matrícula]],Usuarios[#All],2,FALSE)),\"\",VLOOKUP(BMVT[[#This Row],[Matrícula]],Usuarios[#All],2,FALSE))","v":"Vinicius"},{"$f":"IF(ISERROR(VLOOKUP(BMVT[[#This Row],[Matrícula]],Usuarios[#All],3,FALSE)),\"\",VLOOKUP(BMVT[[#This Row],[Matrícula]],Usuarios[#All],3,FALSE))","v":"Anistiado"},{"$f":"IF(ISERROR(VLOOKUP(BMVT[[#This Row],[Matrícula]],Usuarios[#All],4,FALSE)),\"\",VLOOKUP(BMVT[[#This Row],[Matrícula]],Usuarios[#All],4,FALSE))","v":"Salvador"},{"$f":"IF(ISERROR(VLOOKUP(BMVT[[#This Row],[Matrícula]],Usuarios[#All],5,FALSE)),\"\",VLOOKUP(BMVT[[#This Row],[Matrícula]],Usuarios[#All],5,FALSE))","v":"PESSOAL"},"23101-A (09096)","Regular",{"$f":"IF(ISERROR(VLOOKUP(BMVT[[#This Row],[Rota]],Rotas[#All],3,FALSE)),\"\",VLOOKUP(BMVT[[#This Row],[Rota]],Rotas[#All],3,FALSE))","v":"Salvador"},{"$f":"IF(ISERROR(VLOOKUP(BMVT[[#This Row],[Rota]],Rotas[#All],4,FALSE)),\"\",VLOOKUP(BMVT[[#This Row],[Rota]],Rotas[#All],4,FALSE))","v":"Salvador"},{"$f":"IF(ISERROR(VLOOKUP(BMVT[[#This Row],[Rota]],Rotas[#All],5,FALSE)),\"\",VLOOKUP(BMVT[[#This Row],[Rota]],Rotas[#All],5,FALSE))","v":"Urbano"},{"$f":"IF(ISERROR(VLOOKUP(BMVT[[#This Row],[Rota]],Rotas[#All],6,FALSE)),\"\",VLOOKUP(BMVT[[#This Row],[Rota]],Rotas[#All],6,FALSE))","v":"Salvador Card"},2,2,42,{"$f":"BMVT[[#This Row],[Quant. Apur.]]","v":42},21,{"$f":"IF(ISERROR(VLOOKUP(BMVT[[#This Row],[Rota]],Rotas[#All],7,FALSE)),0,VLOOKUP(BMVT[[#This Row],[Rota]],Rotas[#All],7,FALSE))","v":3.3},138.6]
["000.020",{"$f":"IF(ISERROR(VLOOKUP(BMVT[[#This Row],[Matrícula]],Usuarios[#All],2,FALSE)),\"\",VLOOKUP(BMVT[[#This Row],[Matrícula]],Usuarios[#All],2,FALSE))","v":"José Carlos"},{"$f":"IF(ISERROR(VLOOKUP(BMVT[[#This Row],[Matrícula]],Usuarios[#All],3,FALSE)),\"\",VLOOKUP(BMVT[[#This Row],[Matrícula]],Usuarios[#All],3,FALSE))","v":"Empregado"},{"$f":"IF(ISERROR(VLOOKUP(BMVT[[#This Row],[Matrícula]],Usuarios[#All],4,FALSE)),\"\",VLOOKUP(BMVT[[#This Row],[Matrícula]],Usuarios[#All],4,FALSE))","v":"Salvador"},{"$f":"IF(ISERROR(VLOOKUP(BMVT[[#This Row],[Matrícula]],Usuarios[#All],5,FALSE)),\"\",VLOOKUP(BMVT[[#This Row],[Matrícula]],Usuarios[#All],5,FALSE))","v":"LOGISTICA"},"23101-A (09096)","Regular",{"$f":"IF(ISERROR(VLOOKUP(BMVT[[#This Row],[Rota]],Rotas[#All],3,FALSE)),\"\",VLOOKUP(BMVT[[#This Row],[Rota]],Rotas[#All],3,FALSE))","v":"Salvador"},{"$f":"IF(ISERROR(VLOOKUP(BMVT[[#This Row],[Rota]],Rotas[#All],4,FALSE)),\"\",VLOOKUP(BMVT[[#This Row],[Rota]],Rotas[#All],4,FALSE))","v":"Salvador"},{"$f":"IF(ISERROR(VLOOKUP(BMVT[[#This Row],[Rota]],Rotas[#All],5,FALSE)),\"\",VLOOKUP(BMVT[[#This Row],[Rota]],Rotas[#All],5,FALSE))","v":"Urbano"},{"$f":"IF(ISERROR(VLOOKUP(BMVT[[#This Row],[Rota]],Rotas[#All],6,FALSE)),\"\",VLOOKUP(BMVT[[#This Row],[Rota]],Rotas[#All],6,FALSE))","v":"Salvador Card"},2,2,42,{"$f":"BMVT[[#This Row],[Quant. Apur.]]","v":42},21,{"$f":"IF(ISERROR(VLOOKUP(BMVT[[#This Row],[Rota]],Rotas[#All],7,FALSE)),0,VLOOKUP(BMVT[[#This Row],[Rota]],Rotas[#All],7,FALSE))","v":3.3},138.6,null,null,{"$f":"IF(ISERROR(BMVT[[#This Row],[Origem]]&\" - \"&BMVT[[#This Row],[Destino]]),\"\",BMVT[[#This Row],[Origem]]&\" - \"&BMVT[[#This Row],[Destino]])","v":"Salvador - Salvador"}]
["000.021",{"$f":"IF(ISERROR(VLOOKUP(BMVT[[#This Row],[Matrícula]],Usuarios[#All],2,FALSE)),\"\",VLOOKUP(BMVT[[#This Row],[Matrícula]],Usuarios[#All],2,FALSE))","v":"Carlos"},{"$f":"IF(ISERROR(VLOOKUP(BMVT[[#This Row],[Matrícula]],Usuarios[#All],3,FALSE)),\"\",VLOOKUP(BMVT[[#This Row],[Matrícula]],Usuarios[#All],3,FALSE))","v":"Empregado"},{"$f":"IF(ISERROR(VLOOKUP(BMVT[[#This Row],[Matrícula]],Usuarios[#All],4,FALSE)),\"\",VLOOKUP(BMVT[[#This Row],[Matrícula]],Usuarios[#All],4,FALSE))","v":"Salvador"},{"$f":"IF(ISERROR(VLOOKUP(BMVT[[#This Row],[Matrícula]],Usuarios[#All],5,FALSE)),\"\",VLOOKUP(BMVT[[#This Row],[Matrícula]],Usuarios[#All],5,FALSE))","v":"LOGISTICA"},"23101-A (09096)","Regular",{"$f":"IF(ISERROR(VLOOKUP(BMVT[[#This Row],[Rota]],Rotas[#All],3,FALSE)),\"\",VLOOKUP(BMVT[[#This Row],[Rota]],Rotas[#All],3,FALSE))","v":"Salvador"},{"$f":"IF(ISERROR(VLOOKUP(BMVT[[#This Row],[Rota]],Rotas[#All],4,FALSE)),\"\",VLOOKUP(BMVT[[#This Row],[Rota]],Rotas[#All],4,FALSE))","v":"Salvador"},{"$f":"IF(ISERROR(VLOOKUP(BMVT[[#This Row],[Rota]],Rotas[#All],5,FALSE)),\"\",VLOOKUP(BMVT[[#This Row],[Rota]],Rotas[#All],5,FALSE))","v":"Urbano"},{"$f":"IF(ISERROR(VLOOKUP(BMVT[[#This Row],[Rota]],Rotas[#All],6,FALSE)),\"\",VLOOKUP(BMVT[[#This Row],[Rota]],Rotas[#All],6,FALSE))","v":"Salvador Card"},2,2,42,{"$f":"BMVT[[#This Row],[Quant. Apur.]]","v":42},21,{"$f":"IF(ISERROR(VLOOKUP(BMVT[[#This Row],[Rota]],Rotas[#All],7,FALSE)),0,VLOOKUP(BMVT[[#This Row],[Rota]],Rotas[#All],7,FALSE))","v":3.3},138.6,null,null,{"$f":"IF(ISERROR(BMVT[[#This Row],[Origem]]&\" - \"&BMVT[[#This Row],[Destino]]),\"\",BMVT[[#This Row],[Origem]]&\" - \"&BMVT[[#This Row],[Destino]])","v":"Salvador - Salvador"}]
["000.022",{"$f":"IF(ISERROR(VLOOKUP(BMVT[[#This Row],[Matrícula]],Usuarios[#All],2,FALSE)),\"\",VLOOKUP(BMVT[[#This Row],[Matrícula]],Usuarios[#All],2,FALSE))","v":"Miguel"},{"$f":"IF(ISERROR(VLOOKUP(BMVT[[#This Row],[Matrícula]],Usuarios[#All],3,FALSE)),\"\",VLOOKUP(BMVT[[#This Row],[Matrícula]],Usuarios[#All],3,FALSE))","v":"Empregado"},{"$f":"IF(ISERROR(VLOOKUP(BMVT[[#This Row],[Matrícula]],Usuarios[#All],4,FALSE)),\"\",VLOOKUP(BMVT[[#This Row],[Matrícula]],Usuarios[#All],4,FALSE))","v":"Salvador"},{"$f":"IF(ISERROR(VLOOKUP(BMVT[[#This Row],[Matrícula]],Usuarios[#All],5,FALSE)),\"\",VLOOKUP(BMVT[[#This Row],[Matrícula]],Usuarios[#All],5,FALSE))","v":"LOGISTICA"},"23101-A (09096)","Regular",{"$f":"IF(ISERROR(VLOOKUP(BMVT[[#This Row],[Rota]],Rotas[#All],3,FALSE)),\"\",VLOOKUP(BMVT[[#This Row],[Rota]],Rotas[#All],3,FALSE))","v":"Salvador"},{"$f":"IF(ISERROR(VLOOKUP(BMVT[[#This Row],[Rota]],Rotas[#All],4,FALSE)),\"\",VLOOKUP(BMVT[[#This Row],[Rota]],Rotas[#All],4,FALSE))","v":"Salvador"},{"$f":"IF(ISERROR(VLOOKUP(BMVT[[#This Row],[Rota]],Rotas[#All],5,FALSE)),\"\",VLOOKUP(BMVT[[#This Row],[Rota]],Rotas[#All],5,FALSE))","v":"Urbano"},{"$f":"IF(ISERROR(VLOOKUP(BMVT[[#This Row],[Rota]],Rotas[#All],6,FALSE)),\"\",VLOOKUP(BMVT[[#This Row],[Rota]],Rotas[#All],6,FALSE))","v":"Salvador Card"},2,2,42,{"$f":"BMVT[[#This Row],[Quant. Apur.]]","v":42},21,{"$f":"IF(ISERROR(VLOOKUP(BMVT[[#This Row],[Rota]],Rotas[#All],7,FALSE)),0,VLOOKUP(BMVT[[#This Row],[Rota]],Rotas[#All],7,FALSE))","v":3.3},138.6,null,null,{"$f":"IF(ISERROR(BMVT[[#This Row],[Origem]]&\" - \"&BMVT[[#This Row],[Destino]]),\"\",BMVT[[#This Row],[Origem]]&\" - \"&BMVT[[#This Row],[Destino]])","v":"Salvador - Salvador"}]
["000.023",{"$f":"IF(ISERROR(VLOOKUP(BMVT[[#This Row],[Matrícula]],Usuarios[#All],2,FALSE)),\"\",VLOOKUP(BMVT[[#This Row],[Matrícula]],Usuarios[#All],2,FALSE))","v":"Gustavo"},{"$f":"IF(ISERROR(VLOOKUP(BMVT[[#This Row],[Matrícula]],Usuarios[#All],3,FALSE)),\"\",VLOOKUP(BMVT[[#This Row],[Matrícula]],Usuarios[#All],3,FALSE))","v":"Empregado"},{"$f":"IF(ISERROR(VLOOKUP(BMVT[[#This Row],[Matrícula]],Usuarios[#All],4,FALSE)),\"\",VLOOKUP(BMVT[[#This Row],[Matrícula]],Usuarios[#All],4,FALSE))","v":"Salvador"},{"$f":"IF(ISERROR(VLOOKUP(BMVT[[#This Row],[Matrícula]],Usuarios[#All],5,FALSE)),\"\",VLOOKUP(BMVT[[#This Row],[Matrícula]],Usuarios[#All],5,FALSE))","v":"FINANCEIRO"},"23101-A (09096)","Regular",{"$f":"IF(ISERROR(VLOOKUP(BMVT[[#This Row],[Rota]],Rotas[#All],3,FALSE)),\"\",VLOOKUP(BMVT[[#This Row],[Rota]],Rotas[#All],3,FALSE))","v":"Salvador"},{"$f":"IF(ISERROR(VLOOKUP(BMVT[[#This Row],[Rota]],Rotas[#All],4,FALSE)),\"\",VLOOKUP(BMVT[[#This Row],[Rota]],Rotas[#All],4,FALSE))","v":"Salvador"},{"$f":"IF(ISERROR(VLOOKUP(BMVT[[#This Row],[Rota]],Rotas[#All],5,FALSE)),\"\",VLOOKUP(BMVT[[#This Row],[Rota]],Rotas[#All],5,FALSE))","v":"Urbano"},{"$f":"IF(ISERROR(VLOOKUP(BMVT[[#This Row],[Rota]],Rotas[#All],6,FALSE)),\"\",VLOOKUP(BMVT[[#This Row],[Rota]],Rotas[#All],6,FALSE))","v":"Salvador Card"},4,4,84,{"$f":"BMVT[[#This Row],[Quant. Apur.]]","v":84},21,{"$f":"IF(ISERROR(VLOOKUP(BMVT[[#This Row],[Rota]],Rotas[#All],7,FALSE)),0,VLOOKUP(BMVT[[#This Row],[Rota]],Rotas[#All],7,FALSE))","v":3.3},277.2,null,null,{"$f":"IF(ISERROR(BMVT[[#This Row],[Origem]]&\" - \"&BMVT[[#This Row],[Destino]]),\"\",BMVT[[#This Row],[Origem]]&\" - \"&BMVT[[#This Row],[Destino]])","v":"Salvador - Salvador"}]
["000.024",{"$f":"IF(ISERROR(VLOOKUP(BMVT[[#This Row],[Matrícula]],Usuarios[#All],2,FALSE)),\"\",VLOOKUP(BMVT[[#This Row],[Matrícula]],Usuarios[#All],2,FALSE))","v":"Guilherme"},{"$f":"IF(ISERROR(VLOOKUP(BMVT[[#This Row],[Matrícula]],Usuarios[#All],3,FALSE)),\"\",VLOOKUP(BMVT[[#This Row],[Matrícula]],Usuarios[#All],3,FALSE))","v":"Empregado"},{"$f":"IF(ISERROR(VLOOKUP(BMVT[[#This Row],[Matrícula]],Usuarios[#All],4,FALSE)),\"\",VLOOKUP(BMVT[[#This Row],[Matrícula]],Usuarios[#All],4,FALSE))","v":"Salvador"},{"$f":"IF(ISERROR(VLOOKUP(BMVT[[#This Row],[Matrícula]],Usuarios[#All],5,FALSE)),\"\",VLOOKUP(BMVT[[#This Row],[Matrícula]],Usuarios[#All],5,FALSE))","v":"FINANCEIRO"},"23101-A (09096)","Irregular",{"$f":"IF(ISERROR(VLOOKUP(BMVT[[#This Row],[Rota]],Rotas[#All],3,FALSE)),\"\",VLOOKUP(BMVT[[#This Row],[Rota]],Rotas[#All],3,FALSE))","v":"Salvador"},{"$f":"IF(ISERROR(VLOOKUP(BMVT[[#This Row],[Rota]],Rotas[#All],4,FALSE)),\"\",VLOOKUP(BMVT[[#This Row],[Rota]],Rotas[#All],4,FALSE))","v":"Salvador"},{"$f":"IF(ISERROR(VLOOKUP(BMVT[[#This Row],[Rota]],Rotas[#All],5,FALSE)),\"\",VLOOKUP(BMVT[[#This Row],[Rota]],Rotas[#All],5,FALSE))","v":"Urbano"},{"$f":"IF(ISERROR(VLOOKUP(BMVT[[#This Row],[Rota]],Rotas[#All],6,FALSE)),\"\",VLOOKUP(BMVT[[#This Row],[Rota]],Rotas[#All],6,FALSE))","v":"Salvador Card"},0,0,0,{"$f":"BMVT[[#This Row],[Quant. Apur.]]","v":0},0,{"$f":"IF(ISERROR(VLOOKUP(BMVT[[#This Row],[Rota]],Rotas[#All],7,FALSE)),0,VLOOKUP(BMVT[[#This Row],[Rota]],Rotas[#All],7,FALSE))","v":3.3},0,null,null,{"$f":"IF(ISERROR(BMVT[[#This Row],[Origem]]&\" - \"&BMVT[[#This Row],[Destino]]),\"\",BMVT[[#This Row],[Origem]]&\" - \"&BMVT[[#This Row],[Destino]])","v":"Salvador - Salvador"}]
["000.025",{"$f":"IF(ISERROR(VLOOKUP(BMVT[[#This Row],[Matrícula]],Usuarios[#All],2,FALSE)),\"\",VLOOKUP(BMVT[[#This Row],[Matrícula]],Usuarios[#All],2,FALSE))","v":"Bruno Brito"},{"$f":"IF(ISERROR(VLOOKUP(BMVT[[#This Row],[Matrícula]],Usuarios[#All],3,FALSE)),\"\",VLOOKUP(BMVT[[#This Row],[Matrícula]],Usuarios[#All],3,FALSE))","v":"Empregado"},{"$f":"IF(ISERROR(VLOOKUP(BMVT[[#This Row],[Matrícula]],Usuarios[#All],4,FALSE)),\"\",VLOOKUP(BMVT[[#This Row],[Matrícula]],Usuarios[#All],4,FALSE))","v":"Salvador"},{"$f":"IF(ISERROR(VLOOKUP(BMVT[[#This Row],[Matrícula]],Usuarios[#All],5,FALSE)),\"\",VLOOKUP(BMVT[[#This Row],[Matrícula]],Usuarios[#All],5,FALSE))","v":"FINANCEIRO"},"23101-A (09096)","Regular",{"$f":"IF(ISERROR(VLOOKUP(BMVT[[#This Row],[Rota]],Rotas[#All],3,FALSE)),\"\",VLOOKUP(BMVT[[#This Row],[Rota]],Rotas[#All],3,FALSE))","v":"Salvador"},{"$f":"IF(ISERROR(VLOOKUP(BMVT[[#This Row],[Rota]],Rotas[#All],4,FALSE)),\"\",VLOOKUP(BMVT[[#This Row],[Rota]],Rotas[#All],4,FALSE))","v":"Salvador"},{"$f":"IF(ISERROR(VLOOKUP(BMVT[[#This Row],[Rota]],Rotas[#All],5,FALSE)),\"\",VLOOKUP(BMVT[[#This Row],[Rota]],Rotas[#All],5,FALSE))","v":"Urbano"},{"$f":"IF(ISERROR(VLOOKUP(BMVT[[#This Row],[Rota]],Rotas[#All],6,FALSE)),\"\",VLOOKUP(BMVT[[#This Row],[Rota]],Rotas[#All],6,FALSE))","v":"Salvador Card"},2,2,42,14,7,{"$f":"IF(ISERROR(VLOOKUP(BMVT[[#This Row],[Rota]],Rotas[#All],7,FALSE)),0,VLOOKUP(BMVT[[#This Row],[Rota]],Rotas[#All],7,FALSE))","v":3.3},46.199999999999996,null,null,{"$f":"IF(ISERROR(BMVT[[#This Row],[Origem]]&\" - \"&BMVT[[#This Row],[Destino]]),\"\",BMVT[[#This Row],[Origem]]&\" - \"&BMVT[[#This Row],[Destino]])","v":"Salvador - Salvador"}]
[null,{"$f":"IF(ISERROR(VLOOKUP(BMVT[[#This Row],[Matrícula]],Usuarios[#All],2,FALSE)),\"\",VLOOKUP(BMVT[[#This Row],[Matrícula]],Usuarios[#All],2,FALSE))","v":""},{"$f":"IF(ISERROR(VLOOKUP(BMVT[[#This Row],[Matrícula]],Usuarios[#All],3,FALSE)),\"\",VLOOKUP(BMVT[[#This Row],[Matrícula]],Usuarios[#All],3,FALSE))","v":""},{"$f":"IF(ISERROR(VLOOKUP(BMVT[[#This Row],[Matrícula]],Usuarios[#All],4,FALSE)),\"\",VLOOKUP(BMVT[[#This Row],[Matrícula]],Usuarios[#All],4,FALSE))","v":""},{"$f":"IF(ISERROR(VLOOKUP(BMVT[[#This Row],[Matrícula]],Usuarios[#All],5,FALSE)),\"\",VLOOKUP(BMVT[[#This Row],[Matrícula]],Usuarios[#All],5,FALSE))","v":""},null,null,{"$f":"IF(ISERROR(VLOOKUP(BMVT[[#This Row],[Rota]],Rotas[#All],3,FALSE)),\"\",VLOOKUP(BMVT[[#This Row],[Rota]],Rotas[#All],3,FALSE))","v":""},{"$f":"IF(ISERROR(VLOOKUP(BMVT[[#This Row],[Rota]],Rotas[#All],4,FALSE)),\"\",VLOOKUP(BMVT[[#This Row],[Rota]],Rotas[#All],4,FALSE))","v":""},{"$f":"IF(ISERROR(VLOOKUP(BMVT[[#This Row],[Rota]],Rotas[#All],5,FALSE)),\"\",VLOOKUP(BMVT[[#This Row],[Rota]],Rotas[#All],5,FALSE))","v":""},{"$f":"IF(ISERROR(VLOOKUP(BMVT[[#This Row],[Rota]],Rotas[#All],6,FALSE)),\"\",VLOOKUP(BMVT[[#This Row],[Rota]],Rotas[#All],6,FALSE))","v":""},null,0,0,{"$f":"BMVT[[#This Row],[Quant. Apur.]]","v":0},0,{"$f":"IF(ISERROR(VLOOKUP(BMVT[[#This Row],[Rota]],Rotas[#All],7,FALSE)),0,VLOOKUP(BMVT[[#This Row],[Rota]],Rotas[#All],7,FALSE))","v":0},0,null,null,{"$f":"IF(ISERROR(BMVT[[#This Row],[Origem]]&\" - \"&BMVT[[#This Row],[Destino]]),\"\",BMVT[[#This Row],[Origem]]&\" - \"&BMVT[[#This Row],[Destino]])","v":" - "}]
[null,{"$f":"IF(ISERROR(VLOOKUP(BMVT[[#This Row],[Matrícula]],Usuarios[#All],2,FALSE)),\"\",VLOOKUP(BMVT[[#This Row],[Matrícula]],Usuarios[#All],2,FALSE))","v":""},{"$f":"IF(ISERROR(VLOOKUP(BMVT[[#This Row],[Matrícula]],Usuarios[#All],3,FALSE)),\"\",VLOOKUP(BMVT[[#This Row],[Matrícula]],Usuarios[#All],3,FALSE))","v":""},{"$f":"IF(ISERROR(VLOOKUP(BMVT[[#This Row],[Matrícula]],Usuarios[#All],4,FALSE)),\"\",VLOOKUP(BMVT[[#This Row],[Matrícula]],Usuarios[#All],4,FALSE))","v":""},{"$f":"IF(ISERROR(VLOOKUP(BMVT[[#This Row],[Matrícula]],Usuarios[#All],5,FALSE)),\"\",VLOOKUP(BMVT[[#This Row],[Matrícula]],Usuarios[#All],5,FALSE))","v":""},null,null,{"$f":"IF(ISERROR(VLOOKUP(BMVT[[#This Row],[Rota]],Rotas[#All],3,FALSE)),\"\",VLOOKUP(BMVT[[#This Row],[Rota]],Rotas[#All],3,FALSE))","v":""},{"$f":"IF(ISERROR(VLOOKUP(BMVT[[#This Row],[Rota]],Rotas[#All],4,FALSE)),\"\",VLOOKUP(BMVT[[#This Row],[Rota]],Rotas[#All],4,FALSE))","v":""},{"$f":"IF(ISERROR(VLOOKUP(BMVT[[#This Row],[Rota]],Rotas[#All],5,FALSE)),\"\",VLOOKUP(BMVT[[#This Row],[Rota]],Rotas[#All],5,FALSE))","v":""},{"$f":"IF(ISERROR(VLOOKUP(BMVT[[#This Row],[Rota]],Rotas[#All],6,FALSE)),\"\",VLOOKUP(BMVT[[#This Row],[Rota]],Rotas[#All],6,FALSE))","v":""},null,0,0,{"$f":"BMVT[[#This Row],[Quant. Apur.]]","v":0},0,{"$f":"IF(ISERROR(VLOOKUP(BMVT[[#This Row],[Rota]],Rotas[#All],7,FALSE)),0,VLOOKUP(BMVT[[#This Row],[Rota]],Rotas[#All],7,FALSE))","v":0},0,null,null,{"$f":"IF(ISERROR(BMVT[[#This Row],[Origem]]&\" - \"&BMVT[[#This Row],[Destino]]),\"\",BMVT[[#This Row],[Origem]]&\" - \"&BMVT[[#This Row],[Destino]])","v":" - "}]
[null,{"$f":"IF(ISERROR(VLOOKUP(BMVT[[#This Row],[Matrícula]],Usuarios[#All],2,FALSE)),\"\",VLOOKUP(BMVT[[#This Row],[Matrícula]],Usuarios[#All],2,FALSE))","v":""},{"$f":"IF(ISERROR(VLOOKUP(BMVT[[#This Row],[Matrícula]],Usuarios[#All],3,FALSE)),\"\",VLOOKUP(BMVT[[#This Row],[Matrícula]],Usuarios[#All],3,FALSE))","v":""},{"$f":"IF(ISERROR(VLOOKUP(BMVT[[#This Row],[Matrícula]],Usuarios[#All],4,FALSE)),\"\",VLOOKUP(BMVT[[#This Row],[Matrícula]],Usuarios[#All],4,FALSE))","v":""},{"$f":"IF(ISERROR(VLOOKUP(BMVT[[#This Row],[Matrícula]],Usuarios[#All],5,FALSE)),\"\",VLOOKUP(BMVT[[#This Row],[Matrícula]],Usuarios[#All],5,FALSE))","v":""},null,null,{"$f":"IF(ISERROR(VLOOKUP(BMVT[[#This Row],[Rota]],Rotas[#All],3,FALSE)),\"\",VLOOKUP(BMVT[[#This Row],[Rota]],Rotas[#All],3,FALSE))","v":""},{"$f":"IF(ISERROR(VLOOKUP(BMVT[[#This Row],[Rota]],Rotas[#All],4,FALSE)),\"\",VLOOKUP(BMVT[[#This Row],[Rota]],Rotas[#All],4,FALSE))","v":""},{"$f":"IF(ISERROR(VLOOKUP(BMVT[[#This Row],[Rota]],Rotas[#All],5,FALSE)),\"\",VLOOKUP(BMVT[[#This Row],[Rota]],Rotas[#All],5,FALSE))","v":""},{"$f":"IF(ISERROR(VLOOKUP(BMVT[[#This Row],[Rota]],Rotas[#All],6,FALSE)),\"\",VLOOKUP(BMVT[[#This Row],[Rota]],Rotas[#All],6,FALSE))","v":""},null,0,0,{"$f":"BMVT[[#This Row],[Quant. Apur.]]","v":0},0,{"$f":"IF(ISERROR(VLOOKUP(BMVT[[#This Row],[Rota]],Rotas[#All],7,FALSE)),0,VLOOKUP(BMVT[[#This Row],[Rota]],Rotas[#All],7,FALSE))","v":0},0,null,null,{"$f":"IF(ISERROR(BMVT[[#This Row],[Origem]]&\" - \"&BMVT[[#This Row],[Destino]]),\"\",BMVT[[#This Row],[Origem]]&\" - \"&BMVT[[#This Row],[Destino]])","v":" - "}]
[null,{"$f":"IF(ISERROR(VLOOKUP(BMVT[[#This Row],[Matrícula]],Usuarios[#All],2,FALSE)),\"\",VLOOKUP(BMVT[[#This Row],[Matrícula]],Usuarios[#All],2,FALSE))","v":""},{"$f":"IF(ISERROR(VLOOKUP(BMVT[[#This Row],[Matrícula]],Usuarios[#All],3,FALSE)),\"\",VLOOKUP(BMVT[[#This Row],[Matrícula]],Usuarios[#All],3,FALSE))","v":""},{"$f":"IF(ISERROR(VLOOKUP(BMVT[[#This Row],[Matrícula]],Usuarios[#All],4,FALSE)),\"\",VLOOKUP(BMVT[[#This Row],[Matrícula]],Usuarios[#All],4,FALSE))","v":""},{"$f":"IF(ISERROR(VLOOKUP(BMVT[[#This Row],[Matrícula]],Usuarios[#All],5,FALSE)),\"\",VLOOKUP(BMVT[[#This Row],[Matrícula]],Usuarios[#All],5,FALSE))","v":""},null,null,{"$f":"IF(ISERROR(VLOOKUP(BMVT[[#This Row],[Rota]],Rotas[#All],3,FALSE)),\"\",VLOOKUP(BMVT[[#This Row],[Rota]],Rotas[#All],3,FALSE))","v":""},{"$f":"IF(ISERROR(VLOOKUP(BMVT[[#This Row],[Rota]],Rotas[#All],4,FALSE)),\"\",VLOOKUP(BMVT[[#This Row],[Rota]],Rotas[#All],4,FALSE))","v":""},{"$f":"IF(ISERROR(VLOOKUP(BMVT[[#This Row],[Rota]],Rotas[#All],5,FALSE)),\"\",VLOOKUP(BMVT[[#This Row],[Rota]],Rotas[#All],5,FALSE))","v":""},{"$f":"IF(ISERROR(VLOOKUP(BMVT[[#This Row],[Rota]],Rotas[#All],6,FALSE)),\"\",VLOOKUP(BMVT[[#This Row],[Rota]],Rotas[#All],6,FALSE))","v":""},null,0,0,{"$f":"BMVT[[#This Row],[Quant. Apur.]]","v":0},{"$f":"IF(ISERROR(O34/M34),0,O34/M34)","v":0},{"$f":"IF(ISERROR(VLOOKUP(BMVT[[#This Row],[Rota]],Rotas[#All],7,FALSE)),0,VLOOKUP(BMVT[[#This Row],[Rota]],Rotas[#All],7,FALSE))","v":0},0,null,null,{"$f":"IF(ISERROR(BMVT[[#This Row],[Origem]]&\" - \"&BMVT[[#This Row],[Destino]]),\"\",BMVT[[#This Row],[Origem]]&\" - \"&BMVT[[#This Row],[Destino]])","v":" - "}]
[null,{"$f":"IF(ISERROR(VLOOKUP(BMVT[[#This Row],[Matrícula]],Usuarios[#All],2,FALSE)),\"\",VLOOKUP(BMVT[[#This Row],[Matrícula]],Usuarios[#All],2,FALSE))","v":""},{"$f":"IF(ISERROR(VLOOKUP(BMVT[[#This Row],[Matrícula]],Usuarios[#All],3,FALSE)),\"\",VLOOKUP(BMVT[[#This Row],[Matrícula]],Usuarios[#All],3,FALSE))","v":""},{"$f":"IF(ISERROR(VLOOKUP(BMVT[[#This Row],[Matrícula]],Usuarios[#All],4,FALSE)),\"\",VLOOKUP(BMVT[[#This Row],[Matrícula]],Usuarios[#All],4,FALSE))","v":""},{"$f":"IF(ISERROR(VLOOKUP(BMVT[[#This Row],[Matrícula]],Usuarios[#All],5,FALSE)),\"\",VLOOKUP(BMVT[[#This Row],[Matrícula]],Usuarios[#All],5,FALSE))","v":""},null,null,{"$f":"IF(ISERROR(VLOOKUP(BMVT[[#This Row],[Rota]],Rotas[#All],3,FALSE)),\"\",VLOOKUP(BMVT[[#This Row],[Rota]],Rotas[#All],3,FALSE))","v":""},{"$f":"IF(ISERROR(VLOOKUP(BMVT[[#This Row],[Rota]],Rotas[#All],4,FALSE)),\"\",VLOOKUP(BMVT[[#This Row],[Rota]],Rotas[#All],4,FALSE))","v":""},{"$f":"IF(ISERROR(VLOOKUP(BMVT[[#This Row],[Rota]],Rotas[#All],5,FALSE)),\"\",VLOOKUP(BMVT[[#This Row],[Rota]],Rotas[#All],5,FALSE))","v":""},{"$f":"IF(ISERROR(VLOOKUP(BMVT[[#This Row],[Rota]],Rotas[#All],6,FALSE)),\"\",VLOOKUP(BMVT[[#This Row],[Rota]],Rotas[#All],6,FALSE))","v":""},null,0,0,0,{"$f":"IF(ISERROR(O35/M35),0,O35/M35)","v":0},{"$f":"IF(ISERROR(VLOOKUP(BMVT[[#This Row],[Rota]],Rotas[#All],7,FALSE)),0,VLOOKUP(BMVT[[#This Row],[Rota]],Rotas[#All],7,FALSE))","v":0},0,null,null,{"$f":"IF(ISERROR(BMVT[[#This Row],[Origem]]&\" - \"&BMVT[[#This Row],[Destino]]),\"\",BMVT[[#This Row],[Origem]]&\" - \"&BMVT[[#This Row],[Destino]])","v":" - "}]
[null,{"$f":"IF(ISERROR(VLOOKUP(BMVT[[#This Row],[Matrícula]],Usuarios[#All],2,FALSE)),\"\",VLOOKUP(BMVT[[#This Row],[Matrícula]],Usuarios[#All],2,FALSE))","v":""},{"$f":"IF(ISERROR(VLOOKUP(BMVT[[#This Row],[Matrícula]],Usuarios[#All],3,FALSE)),\"\",VLOOKUP(BMVT[[#This Row],[Matrícula]],Usuarios[#All],3,FALSE))","v":""},{"$f":"IF(ISERROR(VLOOKUP(BMVT[[#This Row],[Matrícula]],Usuarios[#All],4,FALSE)),\"\",VLOOKUP(BMVT[[#This Row],[Matrícula]],Usuarios[#All],4,FALSE))","v":""},{"$f":"IF(ISERROR(VLOOKUP(BMVT[[#This Row],[Matrícula]],Usuarios[#All],5,FALSE)),\"\",VLOOKUP(BMVT[[#This Row],[Matrícula]],Usuarios[#All],5,FALSE))","v":""},null,null,{"$f":"IF(ISERROR(VLOOKUP(BMVT[[#This Row],[Rota]],Rotas[#All],3,FALSE)),\"\",VLOOKUP(BMVT[[#This Row],[Rota]],Rotas[#All],3,FALSE))","v":""},{"$f":"IF(ISERROR(VLOOKUP(BMVT[[#This Row],[Rota]],Rotas[#All],4,FALSE)),\"\",VLOOKUP(BMVT[[#This Row],[Rota]],Rotas[#All],4,FALSE))","v":""},{"$f":"IF(ISERROR(VLOOKUP(BMVT[[#This Row],[Rota]],Rotas[#All],5,FALSE)),\"\",VLOOKUP(BMVT[[#This Row],[Rota]],Rotas[#All],5,FALSE))","v":""},{"$f":"IF(ISERROR(VLOOKUP(BMVT[[#This Row],[Rota]],Rotas[#All],6,FALSE)),\"\",VLOOKUP(BMVT[[#This Row],[Rota]],Rotas[#All],6,FALSE))","v":""},null,0,0,{"$f":"BMVT[[#This Row],[Quant. Apur.]]","v":0},0,{"$f":"IF(ISERROR(VLOOKUP(BMVT[[#This Row],[Rota]],Rotas[#All],7,FALSE)),0,VLOOKUP(BMVT[[#This Row],[Rota]],Rotas[#All],7,FALSE))","v":0},0,null,null,{"$f":"IF(ISERROR(BMVT[[#This Row],[Origem]]&\" - \"&BMVT[[#This Row],[Destino]]),\"\",BMVT[[#This Row],[Origem]]&\" - \"&BMVT[[#This Row],[Destino]])","v":" - "}]
[null,{"$f":"IF(ISERROR(VLOOKUP(BMVT[[#This Row],[Matrícula]],Usuarios[#All],2,FALSE)),\"\",VLOOKUP(BMVT[[#This Row],[Matrícula]],Usuarios[#All],2,FALSE))","v":""},{"$f":"IF(ISERROR(VLOOKUP(BMVT[[#This Row],[Matrícula]],Usuarios[#All],3,FALSE)),\"\",VLOOKUP(BMVT[[#This Row],[Matrícula]],Usuarios[#All],3,FALSE))","v":""},{"$f":"IF(ISERROR(VLOOKUP(BMVT[[#This Row],[Matrícula]],Usuarios[#All],4,FALSE)),\"\",VLOOKUP(BMVT[[#This Row],[Matrícula]],Usuarios[#All],4,FALSE))","v":""},{"$f":"IF(ISERROR(VLOOKUP(BMVT[[#This Row],[Matrícula]],Usuarios[#All],5,FALSE)),\"\",VLOOKUP(BMVT[[#This Row],[Matrícula]],Usuarios[#All],5,FALSE))","v":""},null,null,{"$f":"IF(ISERROR(VLOOKUP(BMVT[[#This Row],[Rota]],Rotas[#All],3,FALSE)),\"\",VLOOKUP(BMVT[[#This Row],[Rota]],Rotas[#All],3,FALSE))","v":""},{"$f":"IF(ISERROR(VLOOKUP(BMVT[[#This Row],[Rota]],Rotas[#All],4,FALSE)),\"\",VLOOKUP(BMVT[[#This Row],[Rota]],Rotas[#All],4,FALSE))","v":""},{"$f":"IF(ISERROR(VLOOKUP(BMVT[[#This Row],[Rota]],Rotas[#All],5,FALSE)),\"\",VLOOKUP(BMVT[[#This Row],[Rota]],Rotas[#All],5,FALSE))","v":""},{"$f":"IF(ISERROR(VLOOKUP(BMVT[[#This Row],[Rota]],Rotas[#All],6,FALSE)),\"\",VLOOKUP(BMVT[[#This Row],[Rota]],Rotas[#All],6,FALSE))","v":""},null,0,0,{"$f":"BMVT[[#This Row],[Quant. Apur.]]","v":0},0,{"$f":"IF(ISERROR(VLOOKUP(BMVT[[#This Row],[Rota]],Rotas[#All],7,FALSE)),0,VLOOKUP(BMVT[[#This Row],[Rota]],Rotas[#All],7,FALSE))","v":0},0,null,null,{"$f":"IF(ISERROR(BMVT[[#This Row],[Origem]]&\" - \"&BMVT[[#This Row],[Destino]]),\"\",BMVT[[#This Row],[Origem]]&\" - \"&BMVT[[#This Row],[Destino]])","v":" - "}]
[null,{"$f":"IF(ISERROR(VLOOKUP(BMVT[[#This Row],[Matrícula]],Usuarios[#All],2,FALSE)),\"\",VLOOKUP(BMVT[[#This Row],[Matrícula]],Usuarios[#All],2,FALSE))","v":""},{"$f":"IF(ISERROR(VLOOKUP(BMVT[[#This Row],[Matrícula]],Usuarios[#All],3,FALSE)),\"\",VLOOKUP(BMVT[[#This Row],[Matrícula]],Usuarios[#All],3,FALSE))","v":""},{"$f":"IF(ISERROR(VLOOKUP(BMVT[[#This Row],[Matrícula]],Usuarios[#All],4,FALSE)),\"\",VLOOKUP(BMVT[[#This Row],[Matrícula]],Usuarios[#All],4,FALSE))","v":""},{"$f":"IF(ISERROR(VLOOKUP(BMVT[[#This Row],[Matrícula]],Usuarios[#All],5,FALSE)),\"\",VLOOKUP(BMVT[[#This Row],[Matrícula]],Usuarios[#All],5,FALSE))","v":""},null,null,{"$f":"IF(ISERROR(VLOOKUP(BMVT[[#This Row],[Rota]],Rotas[#All],3,FALSE)),\"\",VLOOKUP(BMVT[[#This Row],[Rota]],Rotas[#All],3,FALSE))","v":""},{"$f":"IF(ISERROR(VLOOKUP(BMVT[[#This Row],[Rota]],Rotas[#All],4,FALSE)),\"\",VLOOKUP(BMVT[[#This Row],[Rota]],Rotas[#All],4,FALSE))","v":""},{"$f":"IF(ISERROR(VLOOKUP(BMVT[[#This Row],[Rota]],Rotas[#All],5,FALSE)),\"\",VLOOKUP(BMVT[[#This Row],[Rota]],Rotas[#All],5,FALSE))","v":""},{"$f":"IF(ISERROR(VLOOKUP(BMVT[[#This Row],[Rota]],Rotas[#All],6,FALSE)),\"\",VLOOKUP(BMVT[[#This Row],[Rota]],Rotas[#All],6,FALSE))","v":""},null,0,0,{"$f":"BMVT[[#This Row],[Quant. Apur.]]","v":0},0,{"$f":"IF(ISERROR(VLOOKUP(BMVT[[#This Row],[Rota]],Rotas[#All],7,FALSE)),0,VLOOKUP(BMVT[[#This Row],[Rota]],Rotas[#All],7,FALSE))","v":0},0,null,null,{"$f":"IF(ISERROR(BMVT[[#This Row],[Origem]]&\" - \"&BMVT[[#This Row],[Destino]]),\"\",BMVT[[#This Row],[Origem]]&\" - \"&BMVT[[#This Row],[Destino]])","v":" - "}]
[null,{"$f":"IF(ISERROR(VLOOKUP(BMVT[[#This Row],[Matrícula]],Usuarios[#All],2,FALSE)),\"\",VLOOKUP(BMVT[[#This Row],[Matrícula]],Usuarios[#All],2,FALSE))","v":""},{"$f":"IF(ISERROR(VLOOKUP(BMVT[[#This Row],[Matrícula]],Usuarios[#All],3,FALSE)),\"\",VLOOKUP(BMVT[[#This Row],[Matrícula]],Usuarios[#All],3,FALSE))","v":""},{"$f":"IF(ISERROR(VLOOKUP(BMVT[[#This Row],[Matrícula]],Usuarios[#All],4,FALSE)),\"\",VLOOKUP(BMVT[[#This Row],[Matrícula]],Usuarios[#All],4,FALSE))","v":""},{"$f":"IF(ISERROR(VLOOKUP(BMVT[[#This Row],[Matrícula]],Usuarios[#All],5,FALSE)),\"\",VLOOKUP(BMVT[[#This Row],[Matrícula]],Usuarios[#All],5,FALSE))","v":""},null,null,{"$f":"IF(ISERROR(VLOOKUP(BMVT[[#This Row],[Rota]],Rotas[#All],3,FALSE)),\"\",VLOOKUP(BMVT[[#This Row],[Rota]],Rotas[#All],3,FALSE))","v":""},{"$f":"IF(ISERROR(VLOOKUP(BMVT[[#This Row],[Rota]],Rotas[#All],4,FALSE)),\"\",VLOOKUP(BMVT[[#This Row],[Rota]],Rotas[#All],4,FALSE))","v":""},{"$f":"IF(ISERROR(VLOOKUP(BMVT[[#This Row],[Rota]],Rotas[#All],5,FALSE)),\"\",VLOOKUP(BMVT[[#This Row],[Rota]],Rotas[#All],5,FALSE))","v":""},{"$f":"IF(ISERROR(VLOOKUP(BMVT[[#This Row],[Rota]],Rotas[#All],6,FALSE)),\"\",VLOOKUP(BMVT[[#This Row],[Rota]],Rotas[#All],6,FALSE))","v":""},null,0,0,{"$f":"BMVT[[#This Row],[Quant. Apur.]]","v":0},0,{"$f":"IF(ISERROR(VLOOKUP(BMVT[[#This Row],[Rota]],Rotas[#All],7,FALSE)),0,VLOOKUP(BMVT[[#This Row],[Rota]],Rotas[#All],7,FALSE))","v":0},{"$f":"O39*Q39","v":0},null,null,{"$f":"IF(ISERROR(BMVT[[#This Row],[Origem]]&\" - \"&BMVT[[#This Row],[Destino]]),\"\",BMVT[[#This Row],[Origem]]&\" - \"&BMVT[[#This Row],[Destino]])","v":" - "}]
[null,{"$f":"IF(ISERROR(VLOOKUP(BMVT[[#This Row],[Matrícula]],Usuarios[#All],2,FALSE)),\"\",VLOOKUP(BMVT[[#This Row],[Matrícula]],Usuarios[#All],2,FALSE))","v":""},{"$f":"IF(ISERROR(VLOOKUP(BMVT[[#This Row],[Matrícula]],Usuarios[#All],3,FALSE)),\"\",VLOOKUP(BMVT[[#This Row],[Matrícula]],Usuarios[#All],3,FALSE))","v":""},{"$f":"IF(ISERROR(VLOOKUP(BMVT[[#This Row],[Matrícula]],Usuarios[#All],4,FALSE)),\"\",VLOOKUP(BMVT[[#This Row],[Matrícula]],Usuarios[#All],4,FALSE))","v":""},{"$f":"IF(ISERROR(VLOOKUP(BMVT[[#This Row],[Matrícula]],Usuarios[#All],5,FALSE)),\"\",VLOOKUP(BMVT[[#This Row],[Matrícula]],Usuarios[#All],5,FALSE))","v":""},null,null,{"$f":"IF(ISERROR(VLOOKUP(BMVT[[#This Row],[Rota]],Rotas[#All],3,FALSE)),\"\",VLOOKUP(BMVT[[#This Row],[Rota]],Rotas[#All],3,FALSE))","v":""},{"$f":"IF(ISERROR(VLOOKUP(BMVT[[#This Row],[Rota]],Rotas[#All],4,FALSE)),\"\",VLOOKUP(BMVT[[#This Row],[Rota]],Rotas[#All],4,FALSE))","v":""},{"$f":"IF(ISERROR(VLOOKUP(BMVT[[#This Row],[Rota]],Rotas[#All],5,FALSE)),\"\",VLOOKUP(BMVT[[#This Row],[Rota]],Rotas[#All],5,FALSE))","v":""},{"$f":"IF(ISERROR(VLOOKUP(BMVT[[#This Row],[Rota]],Rotas[#All],6,FALSE)),\"\",VLOOKUP(BMVT[[#This Row],[Rota]],Rotas[#All],6,FALSE))","v":""},null,0,0,{"$f":"BMVT[[#This Row],[Quant. Apur.]]","v":0},0,{"$f":"IF(ISERROR(VLOOKUP(BMVT[[#This Row],[Rota]],Rotas[#All],7,FALSE)),0,VLOOKUP(BMVT[[#This Row],[Rota]],Rotas[#All],7,FALSE))","v":0},0,null,null,{"$f":"IF(ISERROR(BMVT[[#This Row],[Origem]]&\" - \"&BMVT[[#This Row],[Destino]]),\"\",BMVT[[#This Row],[Origem]]&\" - \"&BMVT[[#This Row],[Destino]])","v":" - "}]
[null,{"$f":"IF(ISERROR(VLOOKUP(BMVT[[#This Row],[Matrícula]],Usuarios[#All],2,FALSE)),\"\",VLOOKUP(BMVT[[#This Row],[Matrícula]],Usuarios[#All],2,FALSE))","v":""},{"$f":"IF(ISERROR(VLOOKUP(BMVT[[#This Row],[Matrícula]],Usuarios[#All],3,FALSE)),\"\",VLOOKUP(BMVT[[#This Row],[Matrícula]],Usuarios[#All],3,FALSE))","v":""},{"$f":"IF(ISERROR(VLOOKUP(BMVT[[#This Row],[Matrícula]],Usuarios[#All],4,FALSE)),\"\",VLOOKUP(BMVT[[#This Row],[Matrícula]],Usuarios[#All],4,FALSE))","v":""},{"$f":"IF(ISERROR(VLOOKUP(BMVT[[#This Row],[Matrícula]],Usuarios[#All],5,FALSE)),\"\",VLOOKUP(BMVT[[#This Row],[Matrícula]],Usuarios[#All],5,FALSE))","v":""},null,null,{"$f":"IF(ISERROR(VLOOKUP(BMVT[[#This Row],[Rota]],Rotas[#All],3,FALSE)),\"\",VLOOKUP(BMVT[[#This Row],[Rota]],Rotas[#All],3,FALSE))","v":""},{"$f":"IF(ISERROR(VLOOKUP(BMVT[[#This Row],[Rota]],Rotas[#All],4,FALSE)),\"\",VLOOKUP(BMVT[[#This Row],[Rota]],Rotas[#All],4,FALSE))","v":""},{"$f":"IF(ISERROR(VLOOKUP(BMVT[[#This Row],[Rota]],Rotas[#All],5,FALSE)),\"\",VLOOKUP(BMVT[[#This Row],[Rota]],Rotas[#All],5,FALSE))","v":""},{"$f":"IF(ISERROR(VLOOKUP(BMVT[[#This Row],[Rota]],Rotas[#All],6,FALSE)),\"\",VLOOKUP(BMVT[[#This Row],[Rota]],Rotas[#All],6,FALSE))","v":""},null,0,0,0,0,{"$f":"IF(ISERROR(VLOOKUP(BMVT[[#This Row],[Rota]],Rotas[#All],7,FALSE)),0,VLOOKUP(BMVT[[#This Row],[Rota]],Rotas[#All],7,FALSE))","v":0},0,null,null,{"$f":"IF(ISERROR(BMVT[[#This Row],[Origem]]&\" - \"&BMVT[[#This Row],[Destino]]),\"\",BMVT[[#This Row],[Origem]]&\" - \"&BMVT[[#This Row],[Destino]])","v":" - "}]
[null,{"$f":"IF(ISERROR(VLOOKUP(BMVT[[#This Row],[Matrícula]],Usuarios[#All],2,FALSE)),\"\",VLOOKUP(BMVT[[#This Row],[Matrícula]],Usuarios[#All],2,FALSE))","v":""},{"$f":"IF(ISERROR(VLOOKUP(BMVT[[#This Row],[Matrícula]],Usuarios[#All],3,FALSE)),\"\",VLOOKUP(BMVT[[#This Row],[Matrícula]],Usuarios[#All],3,FALSE))","v":""},{"$f":"IF(ISERROR(VLOOKUP(BMVT[[#This Row],[Matrícula]],Usuarios[#All],4,FALSE)),\"\",VLOOKUP(BMVT[[#This Row],[Matrícula]],Usuarios[#All],4,FALSE))","v":""},{"$f":"IF(ISERROR(VLOOKUP(BMVT[[#This Row],[Matrícula]],Usuarios[#All],5,FALSE)),\"\",VLOOKUP(BMVT[[#This Row],[Matrícula]],Usuarios[#All],5,FALSE))","v":""},null,null,{"$f":"IF(ISERROR(VLOOKUP(BMVT[[#This Row],[Rota]],Rotas[#All],3,FALSE)),\"\",VLOOKUP(BMVT[[#This Row],[Rota]],Rotas[#All],3,FALSE))","v":""},{"$f":"IF(ISERROR(VLOOKUP(BMVT[[#This Row],[Rota]],Rotas[#All],4,FALSE)),\"\",VLOOKUP(BMVT[[#This Row],[Rota]],Rotas[#All],4,FALSE))","v":""},{"$f":"IF(ISERROR(VLOOKUP(BMVT[[#This Row],[Rota]],Rotas[#All],5,FALSE)),\"\",VLOOKUP(BMVT[[#This Row],[Rota]],Rotas[#All],5,FALSE))","v":""},{"$f":"IF(ISERROR(VLOOKUP(BMVT[[#This Row],[Rota]],Rotas[#All],6,FALSE)),\"\",VLOOKUP(BMVT[[#This Row],[Rota]],Rotas[#All],6,FALSE))","v":""},null,0,0,{"$f":"BMVT[[#This Row],[Quant. Apur.]]","v":0},0,{"$f":"IF(ISERROR(VLOOKUP(BMVT[[#This Row],[Rota]],Rotas[#All],7,FALSE)),0,VLOOKUP(BMVT[[#This Row],[Rota]],Rotas[#All],7,FALSE))","v":0},0,null,null,{"$f":"IF(ISERROR(BMVT[[#This Row],[Origem]]&\" - \"&BMVT[[#This Row],[Destino]]),\"\",BMVT[[#This Row],[Origem]]&\" - \"&BMVT[[#This Row],[Destino]])","v":" - "}]
[null,{"$f":"IF(ISERROR(VLOOKUP(BMVT[[#This Row],[Matrícula]],Usuarios[#All],2,FALSE)),\"\",VLOOKUP(BMVT[[#This Row],[Matrícula]],Usuarios[#All],2,FALSE))","v":""},{"$f":"IF(ISERROR(VLOOKUP(BMVT[[#This Row],[Matrícula]],Usuarios[#All],3,FALSE)),\"\",VLOOKUP(BMVT[[#This Row],[Matrícula]],Usuarios[#All],3,FALSE))","v":""},{"$f":"IF(ISERROR(VLOOKUP(BMVT[[#This Row],[Matrícula]],Usuarios[#All],4,FALSE)),\"\",VLOOKUP(BMVT[[#This Row],[Matrícula]],Usuarios[#All],4,FALSE))","v":""},{"$f":"IF(ISERROR(VLOOKUP(BMVT[[#This Row],[Matrícula]],Usuarios[#All],5,FALSE)),\"\",VLOOKUP(BMVT[[#This Row],[Matrícula]],Usuarios[#All],5,FALSE))","v":""},null,null,{"$f":"IF(ISERROR(VLOOKUP(BMVT[[#This Row],[Rota]],Rotas[#All],3,FALSE)),\"\",VLOOKUP(BMVT[[#This Row],[Rota]],Rotas[#All],3,FALSE))","v":""},{"$f":"IF(ISERROR(VLOOKUP(BMVT[[#This Row],[Rota]],Rotas[#All],4,FALSE)),\"\",VLOOKUP(BMVT[[#This Row],[Rota]],Rotas[#All],4,FALSE))","v":""},{"$f":"IF(ISERROR(VLOOKUP(BMVT[[#This Row],[Rota]],Rotas[#All],5,FALSE)),\"\",VLOOKUP(BMVT[[#This Row],[Rota]],Rotas[#All],5,FALSE))","v":""},{"$f":"IF(ISERROR(VLOOKUP(BMVT[[#This Row],[Rota]],Rotas[#All],6,FALSE)),\"\",VLOOKUP(BMVT[[#This Row],[Rota]],Rotas[#All],6,FALSE))","v":""},null,0,0,{"$f":"BMVT[[#This Row],[Quant. Apur.]]","v":0},0,{"$f":"IF(ISERROR(VLOOKUP(BMVT[[#This Row],[Rota]],Rotas[#All],7,FALSE)),0,VLOOKUP(BMVT[[#This Row],[Rota]],Rotas[#All],7,FALSE))","v":0},0,null,null,{"$f":"IF(ISERROR(BMVT[[#This Row],[Origem]]&\" - \"&BMVT[[#This Row],[Destino]]),\"\",BMVT[[#This Row],[Origem]]&\" - \"&BMVT[[#This Row],[Destino]])","v":" - "}]
[null,{"$f":"IF(ISERROR(VLOOKUP(BMVT[[#This Row],[Matrícula]],Usuarios[#All],2,FALSE)),\"\",VLOOKUP(BMVT[[#This Row],[Matrícula]],Usuarios[#All],2,FALSE))","v":""},{"$f":"IF(ISERROR(VLOOKUP(BMVT[[#This Row],[Matrícula]],Usuarios[#All],3,FALSE)),\"\",VLOOKUP(BMVT[[#This Row],[Matrícula]],Usuarios[#All],3,FALSE))","v":""},{"$f":"IF(ISERROR(VLOOKUP(BMVT[[#This Row],[Matrícula]],Usuarios[#All],4,FALSE)),\"\",VLOOKUP(BMVT[[#This Row],[Matrícula]],Usuarios[#All],4,FALSE))","v":""},{"$f":"IF(ISERROR(VLOOKUP(BMVT[[#This Row],[Matrícula]],Usuarios[#All],5,FALSE)),\"\",VLOOKUP(BMVT[[#This Row],[Matrícula]],Usuarios[#All],5,FALSE))","v":""},null,null,{"$f":"IF(ISERROR(VLOOKUP(BMVT[[#This Row],[Rota]],Rotas[#All],3,FALSE)),\"\",VLOOKUP(BMVT[[#This Row],[Rota]],Rotas[#All],3,FALSE))","v":""},{"$f":"IF(ISERROR(VLOOKUP(BMVT[[#This Row],[Rota]],Rotas[#All],4,FALSE)),\"\",VLOOKUP(BMVT[[#This Row],[Rota]],Rotas[#All],4,FALSE))","v":""},{"$f":"IF(ISERROR(VLOOKUP(BMVT[[#This Row],[Rota]],Rotas[#All],5,FALSE)),\"\",VLOOKUP(BMVT[[#This Row],[Rota]],Rotas[#All],5,FALSE))","v":""},{"$f":"IF(ISERROR(VLOOKUP(BMVT[[#This Row],[Rota]],Rotas[#All],6,FALSE)),\"\",VLOOKUP(BMVT[[#This Row],[Rota]],Rotas[#All],6,FALSE))","v":""},null,0,{"$f":"L44*$G$1","v":0},{"$f":"BMVT[[#This Row],[Quant. Apur.]]","v":0},0,{"$f":"IF(ISERROR(VLOOKUP(BMVT[[#This Row],[Rota]],Rotas[#All],7,FALSE)),0,VLOOKUP(BMVT[[#This Row],[Rota]],Rotas[#All],7,FALSE))","v":0},0,null,null,{"$f":"IF(ISERROR(BMVT[[#This Row],[Origem]]&\" - \"&BMVT[[#This Row],[Destino]]),\"\",BMVT[[#This Row],[Origem]]&\" - \"&BMVT[[#This Row],[Destino]])","v":" - "}]
[null,{"$f":"IF(ISERROR(VLOOKUP(BMVT[[#This Row],[Matrícula]],Usuarios[#All],2,FALSE)),\"\",VLOOKUP(BMVT[[#This Row],[Matrícula]],Usuarios[#All],2,FALSE))","v":""},{"$f":"IF(ISERROR(VLOOKUP(BMVT[[#This Row],[Matrícula]],Usuarios[#All],3,FALSE)),\"\",VLOOKUP(BMVT[[#This Row],[Matrícula]],Usuarios[#All],3,FALSE))","v":""},{"$f":"IF(ISERROR(VLOOKUP(BMVT[[#This Row],[Matrícula]],Usuarios[#All],4,FALSE)),\"\",VLOOKUP(BMVT[[#This Row],[Matrícula]],Usuarios[#All],4,FALSE))","v":""},{"$f":"IF(ISERROR(VLOOKUP(BMVT[[#This Row],[Matrícula]],Usuarios[#All],5,FALSE)),\"\",VLOOKUP(BMVT[[#This Row],[Matrícula]],Usuarios[#All],5,FALSE))","v":""},null,null,{"$f":"IF(ISERROR(VLOOKUP(BMVT[[#This Row],[Rota]],Rotas[#All],3,FALSE)),\"\",VLOOKUP(BMVT[[#This Row],[Rota]],Rotas[#All],3,FALSE))","v":""},{"$f":"IF(ISERROR(VLOOKUP(BMVT[[#This Row],[Rota]],Rotas[#All],4,FALSE)),\"\",VLOOKUP(BMVT[[#This Row],[Rota]],Rotas[#All],4,FALSE))","v":""},{"$f":"IF(ISERROR(VLOOKUP(BMVT[[#This Row],[Rota]],Rotas[#All],5,FALSE)),\"\",VLOOKUP(BMVT[[#This Row],[Rota]],Rotas[#All],5,FALSE))","v":""},{"$f":"IF(ISERROR(VLOOKUP(BMVT[[#This Row],[Rota]],Rotas[#All],6,FALSE)),\"\",VLOOKUP(BMVT[[#This Row],[Rota]],Rotas[#All],6,FALSE))","v":""},null,0,0,{"$f":"BMVT[[#This Row],[Quant. Apur.]]","v":0},0,{"$f":"IF(ISERROR(VLOOKUP(BMVT[[#This Row],[Rota]],Rotas[#All],7,FALSE)),0,VLOOKUP(BMVT[[#This Row],[Rota]],Rotas[#All],7,FALSE))","v":0},0,null,null,{"$f":"IF(ISERROR(BMVT[[#This Row],[Origem]]&\" - \"&BMVT[[#This Row],[Destino]]),\"\",BMVT[[#This Row],[Origem]]&\" - \"&BMVT[[#This Row],[Destino]])","v":" - "}]
[null,{"$f":"IF(ISERROR(VLOOKUP(BMVT[[#This Row],[Matrícula]],Usuarios[#All],2,FALSE)),\"\",VLOOKUP(BMVT[[#This Row],[Matrícula]],Usuarios[#All],2,FALSE))","v":""},{"$f":"IF(ISERROR(VLOOKUP(BMVT[[#This Row],[Matrícula]],Usuarios[#All],3,FALSE)),\"\",VLOOKUP(BMVT[[#This Row],[Matrícula]],Usuarios[#All],3,FALSE))","v":""},{"$f":"IF(ISERROR(VLOOKUP(BMVT[[#This Row],[Matrícula]],Usuarios[#All],4,FALSE)),\"\",VLOOKUP(BMVT[[#This Row],[Matrícula]],Usuarios[#All],4,FALSE))","v":""},{"$f":"IF(ISERROR(VLOOKUP(BMVT[[#This Row],[Matrícula]],Usuarios[#All],5,FALSE)),\"\",VLOOKUP(BMVT[[#This Row],[Matrícula]],Usuarios[#All],5,FALSE))","v":""},null,null,{"$f":"IF(ISERROR(VLOOKUP(BMVT[[#This Row],[Rota]],Rotas[#All],3,FALSE)),\"\",VLOOKUP(BMVT[[#This Row],[Rota]],Rotas[#All],3,FALSE))","v":""},{"$f":"IF(ISERROR(VLOOKUP(BMVT[[#This Row],[Rota]],Rotas[#All],4,FALSE)),\"\",VLOOKUP(BMVT[[#This Row],[Rota]],Rotas[#All],4,FALSE))","v":""},{"$f":"IF(ISERROR(VLOOKUP(BMVT[[#This Row],[Rota]],Rotas[#All],5,FALSE)),\"\",VLOOKUP(BMVT[[#This Row],[Rota]],Rotas[#All],5,FALSE))","v":""},{"$f":"IF(ISERROR(VLOOKUP(BMVT[[#This Row],[Rota]],Rotas[#All],6,FALSE)),\"\",VLOOKUP(BMVT[[#This Row],[Rota]],Rotas[#All],6,FALSE))","v":""},null,0,0,{"$f":"BMVT[[#This Row],[Quant. Apur.]]","v":0},0,{"$f":"IF(ISERROR(VLOOKUP(BMVT[[#This Row],[Rota]],Rotas[#All],7,FALSE)),0,VLOOKUP(BMVT[[#This Row],[Rota]],Rotas[#All],7,FALSE))","v":0},0,null,null,{"$f":"IF(ISERROR(BMVT[[#This Row],[Origem]]&\" - \"&BMVT[[#This Row],[Destino]]),\"\",BMVT[[#This Row],[Origem]]&\" - \"&BMVT[[#This Row],[Destino]])","v":" - "}]
[null,{"$f":"IF(ISERROR(VLOOKUP(BMVT[[#This Row],[Matrícula]],Usuarios[#All],2,FALSE)),\"\",VLOOKUP(BMVT[[#This Row],[Matrícula]],Usuarios[#All],2,FALSE))","v":""},{"$f":"IF(ISERROR(VLOOKUP(BMVT[[#This Row],[Matrícula]],Usuarios[#All],3,FALSE)),\"\",VLOOKUP(BMVT[[#This Row],[Matrícula]],Usuarios[#All],3,FALSE))","v":""},{"$f":"IF(ISERROR(VLOOKUP(BMVT[[#This Row],[Matrícula]],Usuarios[#All],4,FALSE)),\"\",VLOOKUP(BMVT[[#This Row],[Matrícula]],Usuarios[#All],4,FALSE))","v":""},{"$f":"IF(ISERROR(VLOOKUP(BMVT[[#This Row],[Matrícula]],Usuarios[#All],5,FALSE)),\"\",VLOOKUP(BMVT[[#This Row],[Matrícula]],Usuarios[#All],5,FALSE))","v":""},null,null,{"$f":"IF(ISERROR(VLOOKUP(BMVT[[#This Row],[Rota]],Rotas[#All],3,FALSE)),\"\",VLOOKUP(BMVT[[#This Row],[Rota]],Rotas[#All],3,FALSE))","v":""},{"$f":"IF(ISERROR(VLOOKUP(BMVT[[#This Row],[Rota]],Rotas[#All],4,FALSE)),\"\",VLOOKUP(BMVT[[#This Row],[Rota]],Rotas[#All],4,FALSE))","v":""},{"$f":"IF(ISERROR(VLOOKUP(BMVT[[#This Row],[Rota]],Rotas[#All],5,FALSE)),\"\",VLOOKUP(BMVT[[#This Row],[Rota]],Rotas[#All],5,FALSE))","v":""},{"$f":"IF(ISERROR(VLOOKUP(BMVT[[#This Row],[Rota]],Rotas[#All],6,FALSE)),\"\",VLOOKUP(BMVT[[#This Row],[Rota]],Rotas[#All],6,FALSE))","v":""},null,0,0,{"$f":"BMVT[[#This Row],[Quant. Apur.]]","v":0},0,{"$f":"IF(ISERROR(VLOOKUP(BMVT[[#This Row],[Rota]],Rotas[#All],7,FALSE)),0,VLOOKUP(BMVT[[#This Row],[Rota]],Rotas[#All],7,FALSE))","v":0},0,null,null,{"$f":"IF(ISERROR(BMVT[[#This Row],[Origem]]&\" - \"&BMVT[[#This Row],[Destino]]),\"\",BMVT[[#This Row],[Origem]]&\" - \"&BMVT[[#This Row],[Destino]])","v":" - "}]
[null,{"$f":"IF(ISERROR(VLOOKUP(BMVT[[#This Row],[Matrícula]],Usuarios[#All],2,FALSE)),\"\",VLOOKUP(BMVT[[#This Row],[Matrícula]],Usuarios[#All],2,FALSE))","v":""},{"$f":"IF(ISERROR(VLOOKUP(BMVT[[#This Row],[Matrícula]],Usuarios[#All],3,FALSE)),\"\",VLOOKUP(BMVT[[#This Row],[Matrícula]],Usuarios[#All],3,FALSE))","v":""},{"$f":"IF(ISERROR(VLOOKUP(BMVT[[#This Row],[Matrícula]],Usuarios[#All],4,FALSE)),\"\",VLOOKUP(BMVT[[#This Row],[Matrícula]],Usuarios[#All],4,FALSE))","v":""},{"$f":"IF(ISERROR(VLOOKUP(BMVT[[#This Row],[Matrícula]],Usuarios[#All],5,FALSE)),\"\",VLOOKUP(BMVT[[#This Row],[Matrícula]],Usuarios[#All],5,FALSE))","v":""},null,null,{"$f":"IF(ISERROR(VLOOKUP(BMVT[[#This Row],[Rota]],Rotas[#All],3,FALSE)),\"\",VLOOKUP(BMVT[[#This Row],[Rota]],Rotas[#All],3,FALSE))","v":""},{"$f":"IF(ISERROR(VLOOKUP(BMVT[[#This Row],[Rota]],Rotas[#All],4,FALSE)),\"\",VLOOKUP(BMVT[[#This Row],[Rota]],Rotas[#All],4,FALSE))","v":""},{"$f":"IF(ISERROR(VLOOKUP(BMVT[[#This Row],[Rota]],Rotas[#All],5,FALSE)),\"\",VLOOKUP(BMVT[[#This Row],[Rota]],Rotas[#All],5,FALSE))","v":""},{"$f":"IF(ISERROR(VLOOKUP(BMVT[[#This Row],[Rota]],Rotas[#All],6,FALSE)),\"\",VLOOKUP(BMVT[[#This Row],[Rota]],Rotas[#All],6,FALSE))","v":""},null,0,0,{"$f":"BMVT[[#This Row],[Quant. Apur.]]","v":0},0,{"$f":"IF(ISERROR(VLOOKUP(BMVT[[#This Row],[Rota]],Rotas[#All],7,FALSE)),0,VLOOKUP(BMVT[[#This Row],[Rota]],Rotas[#All],7,FALSE))","v":0},0,null,null,{"$f":"IF(ISERROR(BMVT[[#This Row],[Origem]]&\" - \"&BMVT[[#This Row],[Destino]]),\"\",BMVT[[#This Row],[Origem]]&\" - \"&BMVT[[#This Row],[Destino]])","v":" - "}]
[null,{"$f":"IF(ISERROR(VLOOKUP(BMVT[[#This Row],[Matrícula]],Usuarios[#All],2,FALSE)),\"\",VLOOKUP(BMVT[[#This Row],[Matrícula]],Usuarios[#All],2,FALSE))","v":""},{"$f":"IF(ISERROR(VLOOKUP(BMVT[[#This Row],[Matrícula]],Usuarios[#All],3,FALSE)),\"\",VLOOKUP(BMVT[[#This Row],[Matrícula]],Usuarios[#All],3,FALSE))","v":""},{"$f":"IF(ISERROR(VLOOKUP(BMVT[[#This Row],[Matrícula]],Usuarios[#All],4,FALSE)),\"\",VLOOKUP(BMVT[[#This Row],[Matrícula]],Usuarios[#All],4,FALSE))","v":""},{"$f":"IF(ISERROR(VLOOKUP(BMVT[[#This Row],[Matrícula]],Usuarios[#All],5,FALSE)),\"\",VLOOKUP(BMVT[[#This Row],[Matrícula]],Usuarios[#All],5,FALSE))","v":""},null,null,{"$f":"IF(ISERROR(VLOOKUP(BMVT[[#This Row],[Rota]],Rotas[#All],3,FALSE)),\"\",VLOOKUP(BMVT[[#This Row],[Rota]],Rotas[#All],3,FALSE))","v":""},{"$f":"IF(ISERROR(VLOOKUP(BMVT[[#This Row],[Rota]],Rotas[#All],4,FALSE)),\"\",VLOOKUP(BMVT[[#This Row],[Rota]],Rotas[#All],4,FALSE))","v":""},{"$f":"IF(ISERROR(VLOOKUP(BMVT[[#This Row],[Rota]],Rotas[#All],5,FALSE)),\"\",VLOOKUP(BMVT[[#This Row],[Rota]],Rotas[#All],5,FALSE))","v":""},{"$f":"IF(ISERROR(VLOOKUP(BMVT[[#This Row],[Rota]],Rotas[#All],6,FALSE)),\"\",VLOOKUP(BMVT[[#This Row],[Rota]],Rotas[#All],6,FALSE))","v":""},null,0,0,{"$f":"BMVT[[#This Row],[Quant. Apur.]]","v":0},0,{"$f":"IF(ISERROR(VLOOKUP(BMVT[[#This Row],[Rota]],Rotas[#All],7,FALSE)),0,VLOOKUP(BMVT[[#This Row],[Rota]],Rotas[#All],7,FALSE))","v":0},0,null,null,{"$f":"IF(ISERROR(BMVT[[#This Row],[Origem]]&\" - \"&BMVT[[#This Row],[Destino]]),\"\",BMVT[[#This Row],[Origem]]&\" - \"&BMVT[[#This Row],[Destino]])","v":" - "}]
[null,{"$f":"IF(ISERROR(VLOOKUP(BMVT[[#This Row],[Matrícula]],Usuarios[#All],2,FALSE)),\"\",VLOOKUP(BMVT[[#This Row],[Matrícula]],Usuarios[#All],2,FALSE))","v":""},{"$f":"IF(ISERROR(VLOOKUP(BMVT[[#This Row],[Matrícula]],Usuarios[#All],3,FALSE)),\"\",VLOOKUP(BMVT[[#This Row],[Matrícula]],Usuarios[#All],3,FALSE))","v":""},{"$f":"IF(ISERROR(VLOOKUP(BMVT[[#This Row],[Matrícula]],Usuarios[#All],4,FALSE)),\"\",VLOOKUP(BMVT[[#This Row],[Matrícula]],Usuarios[#All],4,FALSE))","v":""},{"$f":"IF(ISERROR(VLOOKUP(BMVT[[#This Row],[Matrícula]],Usuarios[#All],5,FALSE)),\"\",VLOOKUP(BMVT[[#This Row],[Matrícula]],Usuarios[#All],5,FALSE))","v":""},null,null,{"$f":"IF(ISERROR(VLOOKUP(BMVT[[#This Row],[Rota]],Rotas[#All],3,FALSE)),\"\",VLOOKUP(BMVT[[#This Row],[Rota]],Rotas[#All],3,FALSE))","v":""},{"$f":"IF(ISERROR(VLOOKUP(BMVT[[#This Row],[Rota]],Rotas[#All],4,FALSE)),\"\",VLOOKUP(BMVT[[#This Row],[Rota]],Rotas[#All],4,FALSE))","v":""},{"$f":"IF(ISERROR(VLOOKUP(BMVT[[#This Row],[Rota]],Rotas[#All],5,FALSE)),\"\",VLOOKUP(BMVT[[#This Row],[Rota]],Rotas[#All],5,FALSE))","v":""},{"$f":"IF(ISERROR(VLOOKUP(BMVT[[#This Row],[Rota]],Rotas[#All],6,FALSE)),\"\",VLOOKUP(BMVT[[#This Row],[Rota]],Rotas[#All],6,FALSE))","v":""},null,0,0,{"$f":"BMVT[[#This Row],[Quant. Apur.]]","v":0},0,{"$f":"IF(ISERROR(VLOOKUP(BMVT[[#This Row],[Rota]],Rotas[#All],7,FALSE)),0,VLOOKUP(BMVT[[#This Row],[Rota]],Rotas[#All],7,FALSE))","v":0},0,null,null,{"$f":"IF(ISERROR(BMVT[[#This Row],[Origem]]&\" - \"&BMVT[[#This Row],[Destino]]),\"\",BMVT[[#This Row],[Origem]]&\" - \"&BMVT[[#This Row],[Destino]])","v":" - "}]
[null,{"$f":"IF(ISERROR(VLOOKUP(BMVT[[#This Row],[Matrícula]],Usuarios[#All],2,FALSE)),\"\",VLOOKUP(BMVT[[#This Row],[Matrícula]],Usuarios[#All],2,FALSE))","v":""},{"$f":"IF(ISERROR(VLOOKUP(BMVT[[#This Row],[Matrícula]],Usuarios[#All],3,FALSE)),\"\",VLOOKUP(BMVT[[#This Row],[Matrícula]],Usuarios[#All],3,FALSE))","v":""},{"$f":"IF(ISERROR(VLOOKUP(BMVT[[#This Row],[Matrícula]],Usuarios[#All],4,FALSE)),\"\",VLOOKUP(BMVT[[#This Row],[Matrícula]],Usuarios[#All],4,FALSE))","v":""},{"$f":"IF(ISERROR(VLOOKUP(BMVT[[#This Row],[Matrícula]],Usuarios[#All],5,FALSE)),\"\",VLOOKUP(BMVT[[#This Row],[Matrícula]],Usuarios[#All],5,FALSE))","v":""},null,null,{"$f":"IF(ISERROR(VLOOKUP(BMVT[[#This Row],[Rota]],Rotas[#All],3,FALSE)),\"\",VLOOKUP(BMVT[[#This Row],[Rota]],Rotas[#All],3,FALSE))","v":""},{"$f":"IF(ISERROR(VLOOKUP(BMVT[[#This Row],[Rota]],Rotas[#All],4,FALSE)),\"\",VLOOKUP(BMVT[[#This Row],[Rota]],Rotas[#All],4,FALSE))","v":""},{"$f":"IF(ISERROR(VLOOKUP(BMVT[[#This Row],[Rota]],Rotas[#All],5,FALSE)),\"\",VLOOKUP(BMVT[[#This Row],[Rota]],Rotas[#All],5,FALSE))","v":""},{"$f":"IF(ISERROR(VLOOKUP(BMVT[[#This Row],[Rota]],Rotas[#All],6,FALSE)),\"\",VLOOKUP(BMVT[[#This Row],[Rota]],Rotas[#All],6,FALSE))","v":""},null,0,0,{"$f":"BMVT[[#This Row],[Quant. Apur.]]","v":0},0,{"$f":"IF(ISERROR(VLOOKUP(BMVT[[#This Row],[Rota]],Rotas[#All],7,FALSE)),0,VLOOKUP(BMVT[[#This Row],[Rota]],Rotas[#All],7,FALSE))","v":0},0,null,null,{"$f":"IF(ISERROR(BMVT[[#This Row],[Origem]]&\" - \"&BMVT[[#This Row],[Destino]]),\"\",BMVT[[#This Row],[Origem]]&\" - \"&BMVT[[#This Row],[Destino]])","v":" - "}]
[null,{"$f":"IF(ISERROR(VLOOKUP(BMVT[[#This Row],[Matrícula]],Usuarios[#All],2,FALSE)),\"\",VLOOKUP(BMVT[[#This Row],[Matrícula]],Usuarios[#All],2,FALSE))","v":""},{"$f":"IF(ISERROR(VLOOKUP(BMVT[[#This Row],[Matrícula]],Usuarios[#All],3,FALSE)),\"\",VLOOKUP(BMVT[[#This Row],[Matrícula]],Usuarios[#All],3,FALSE))","v":""},{"$f":"IF(ISERROR(VLOOKUP(BMVT[[#This Row],[Matrícula]],Usuarios[#All],4,FALSE)),\"\",VLOOKUP(BMVT[[#This Row],[Matrícula]],Usuarios[#All],4,FALSE))","v":""},{"$f":"IF(ISERROR(VLOOKUP(BMVT[[#This Row],[Matrícula]],Usuarios[#All],5,FALSE)),\"\",VLOOKUP(BMVT[[#This Row],[Matrícula]],Usuarios[#All],5,FALSE))","v":""},null,null,{"$f":"IF(ISERROR(VLOOKUP(BMVT[[#This Row],[Rota]],Rotas[#All],3,FALSE)),\"\",VLOOKUP(BMVT[[#This Row],[Rota]],Rotas[#All],3,FALSE))","v":""},{"$f":"IF(ISERROR(VLOOKUP(BMVT[[#This Row],[Rota]],Rotas[#All],4,FALSE)),\"\",VLOOKUP(BMVT[[#This Row],[Rota]],Rotas[#All],4,FALSE))","v":""},{"$f":"IF(ISERROR(VLOOKUP(BMVT[[#This Row],[Rota]],Rotas[#All],5,FALSE)),\"\",VLOOKUP(BMVT[[#This Row],[Rota]],Rotas[#All],5,FALSE))","v":""},{"$f":"IF(ISERROR(VLOOKUP(BMVT[[#This Row],[Rota]],Rotas[#All],6,FALSE)),\"\",VLOOKUP(BMVT[[#This Row],[Rota]],Rotas[#All],6,FALSE))","v":""},null,0,0,{"$f":"BMVT[[#This Row],[Quant. Apur.]]","v":0},0,{"$f":"IF(ISERROR(VLOOKUP(BMVT[[#This Row],[Rota]],Rotas[#All],7,FALSE)),0,VLOOKUP(BMVT[[#This Row],[Rota]],Rotas[#All],7,FALSE))","v":0},0,null,null,{"$f":"IF(ISERROR(BMVT[[#This Row],[Origem]]&\" - \"&BMVT[[#This Row],[Destino]]),\"\",BMVT[[#This Row],[Origem]]&\" - \"&BMVT[[#This Row],[Destino]])","v":" - "}]
[null,{"$f":"IF(ISERROR(VLOOKUP(BMVT[[#This Row],[Matrícula]],Usuarios[#All],2,FALSE)),\"\",VLOOKUP(BMVT[[#This Row],[Matrícula]],Usuarios[#All],2,FALSE))","v":""},{"$f":"IF(ISERROR(VLOOKUP(BMVT[[#This Row],[Matrícula]],Usuarios[#All],3,FALSE)),\"\",VLOOKUP(BMVT[[#This Row],[Matrícula]],Usuarios[#All],3,FALSE))","v":""},{"$f":"IF(ISERROR(VLOOKUP(BMVT[[#This Row],[Matrícula]],Usuarios[#All],4,FALSE)),\"\",VLOOKUP(BMVT[[#This Row],[Matrícula]],Usuarios[#All],4,FALSE))","v":""},{"$f":"IF(ISERROR(VLOOKUP(BMVT[[#This Row],[Matrícula]],Usuarios[#All],5,FALSE)),\"\",VLOOKUP(BMVT[[#This Row],[Matrícula]],Usuarios[#All],5,FALSE))","v":""},null,null,{"$f":"IF(ISERROR(VLOOKUP(BMVT[[#This Row],[Rota]],Rotas[#All],3,FALSE)),\"\",VLOOKUP(BMVT[[#This Row],[Rota]],Rotas[#All],3,FALSE))","v":""},{"$f":"IF(ISERROR(VLOOKUP(BMVT[[#This Row],[Rota]],Rotas[#All],4,FALSE)),\"\",VLOOKUP(BMVT[[#This Row],[Rota]],Rotas[#All],4,FALSE))","v":""},{"$f":"IF(ISERROR(VLOOKUP(BMVT[[#This Row],[Rota]],Rotas[#All],5,FALSE)),\"\",VLOOKUP(BMVT[[#This Row],[Rota]],Rotas[#All],5,FALSE))","v":""},{"$f":"IF(ISERROR(VLOOKUP(BMVT[[#This Row],[Rota]],Rotas[#All],6,FALSE)),\"\",VLOOKUP(BMVT[[#This Row],[Rota]],Rotas[#All],6,FALSE))","v":""},null,0,0,{"$f":"BMVT[[#This Row],[Quant. Apur.]]","v":0},0,{"$f":"IF(ISERROR(VLOOKUP(BMVT[[#This Row],[Rota]],Rotas[#All],7,FALSE)),0,VLOOKUP(BMVT[[#This Row],[Rota]],Rotas[#All],7,FALSE))","v":0},{"$f":"O53*Q53","v":0},null,null,{"$f":"IF(ISERROR(BMVT[[#This Row],[Origem]]&\" - \"&BMVT[[#This Row],[Destino]]),\"\",BMVT[[#This Row],[Origem]]&\" - \"&BMVT[[#This Row],[Destino]])","v":" - "}]
[null,{"$f":"IF(ISERROR(VLOOKUP(BMVT[[#This Row],[Matrícula]],Usuarios[#All],2,FALSE)),\"\",VLOOKUP(BMVT[[#This Row],[Matrícula]],Usuarios[#All],2,FALSE))","v":""},{"$f":"IF(ISERROR(VLOOKUP(BMVT[[#This Row],[Matrícula]],Usuarios[#All],3,FALSE)),\"\",VLOOKUP(BMVT[[#This Row],[Matrícula]],Usuarios[#All],3,FALSE))","v":""},{"$f":"IF(ISERROR(VLOOKUP(BMVT[[#This Row],[Matrícula]],Usuarios[#All],4,FALSE)),\"\",VLOOKUP(BMVT[[#This Row],[Matrícula]],Usuarios[#All],4,FALSE))","v":""},{"$f":"IF(ISERROR(VLOOKUP(BMVT[[#This Row],[Matrícula]],Usuarios[#All],5,FALSE)),\"\",VLOOKUP(BMVT[[#This Row],[Matrícula]],Usuarios[#All],5,FALSE))","v":""},null,null,{"$f":"IF(ISERROR(VLOOKUP(BMVT[[#This Row],[Rota]],Rotas[#All],3,FALSE)),\"\",VLOOKUP(BMVT[[#This Row],[Rota]],Rotas[#All],3,FALSE))","v":""},{"$f":"IF(ISERROR(VLOOKUP(BMVT[[#This Row],[Rota]],Rotas[#All],4,FALSE)),\"\",VLOOKUP(BMVT[[#This Row],[Rota]],Rotas[#All],4,FALSE))","v":""},{"$f":"IF(ISERROR(VLOOKUP(BMVT[[#This Row],[Rota]],Rotas[#All],5,FALSE)),\"\",VLOOKUP(BMVT[[#This Row],[Rota]],Rotas[#All],5,FALSE))","v":""},{"$f":"IF(ISERROR(VLOOKUP(BMVT[[#This Row],[Rota]],Rotas[#All],6,FALSE)),\"\",VLOOKUP(BMVT[[#This Row],[Rota]],Rotas[#All],6,FALSE))","v":""},null,0,0,{"$f":"BMVT[[#This Row],[Quant. Apur.]]","v":0},0,{"$f":"IF(ISERROR(VLOOKUP(BMVT[[#This Row],[Rota]],Rotas[#All],7,FALSE)),0,VLOOKUP(BMVT[[#This Row],[Rota]],Rotas[#All],7,FALSE))","v":0},0,null,null,{"$f":"IF(ISERROR(BMVT[[#This Row],[Origem]]&\" - \"&BMVT[[#This Row],[Destino]]),\"\",BMVT[[#This Row],[Origem]]&\" - \"&BMVT[[#This Row],[Destino]])","v":" - "}]
[null,{"$f":"IF(ISERROR(VLOOKUP(BMVT[[#This Row],[Matrícula]],Usuarios[#All],2,FALSE)),\"\",VLOOKUP(BMVT[[#This Row],[Matrícula]],Usuarios[#All],2,FALSE))","v":""},{"$f":"IF(ISERROR(VLOOKUP(BMVT[[#This Row],[Matrícula]],Usuarios[#All],3,FALSE)),\"\",VLOOKUP(BMVT[[#This Row],[Matrícula]],Usuarios[#All],3,FALSE))","v":""},{"$f":"IF(ISERROR(VLOOKUP(BMVT[[#This Row],[Matrícula]],Usuarios[#All],4,FALSE)),\"\",VLOOKUP(BMVT[[#This Row],[Matrícula]],Usuarios[#All],4,FALSE))","v":""},{"$f":"IF(ISERROR(VLOOKUP(BMVT[[#This Row],[Matrícula]],Usuarios[#All],5,FALSE)),\"\",VLOOKUP(BMVT[[#This Row],[Matrícula]],Usuarios[#All],5,FALSE))","v":""},null,null,{"$f":"IF(ISERROR(VLOOKUP(BMVT[[#This Row],[Rota]],Rotas[#All],3,FALSE)),\"\",VLOOKUP(BMVT[[#This Row],[Rota]],Rotas[#All],3,FALSE))","v":""},{"$f":"IF(ISERROR(VLOOKUP(BMVT[[#This Row],[Rota]],Rotas[#All],4,FALSE)),\"\",VLOOKUP(BMVT[[#This Row],[Rota]],Rotas[#All],4,FALSE))","v":""},{"$f":"IF(ISERROR(VLOOKUP(BMVT[[#This Row],[Rota]],Rotas[#All],5,FALSE)),\"\",VLOOKUP(BMVT[[#This Row],[Rota]],Rotas[#All],5,FALSE))","v":""},{"$f":"IF(ISERROR(VLOOKUP(BMVT[[#This Row],[Rota]],Rotas[#All],6,FALSE)),\"\",VLOOKUP(BMVT[[#This Row],[Rota]],Rotas[#All],6,FALSE))","v":""},null,0,0,{"$f":"BMVT[[#This Row],[Quant. Apur.]]","v":0},0,{"$f":"IF(ISERROR(VLOOKUP(BMVT[[#This Row],[Rota]],Rotas[#All],7,FALSE)),0,VLOOKUP(BMVT[[#This Row],[Rota]],Rotas[#All],7,FALSE))","v":0},0,null,null,{"$f":"IF(ISERROR(BMVT[[#This Row],[Origem]]&\" - \"&BMVT[[#This Row],[Destino]]),\"\",BMVT[[#This Row],[Origem]]&\" - \"&BMVT[[#This Row],[Destino]])","v":" - "}]
[null,{"$f":"IF(ISERROR(VLOOKUP(BMVT[[#This Row],[Matrícula]],Usuarios[#All],2,FALSE)),\"\",VLOOKUP(BMVT[[#This Row],[Matrícula]],Usuarios[#All],2,FALSE))","v":""},{"$f":"IF(ISERROR(VLOOKUP(BMVT[[#This Row],[Matrícula]],Usuarios[#All],3,FALSE)),\"\",VLOOKUP(BMVT[[#This Row],[Matrícula]],Usuarios[#All],3,FALSE))","v":""},{"$f":"IF(ISERROR(VLOOKUP(BMVT[[#This Row],[Matrícula]],Usuarios[#All],4,FALSE)),\"\",VLOOKUP(BMVT[[#This Row],[Matrícula]],Usuarios[#All],4,FALSE))","v":""},{"$f":"IF(ISERROR(VLOOKUP(BMVT[[#This Row],[Matrícula]],Usuarios[#All],5,FALSE)),\"\",VLOOKUP(BMVT[[#This Row],[Matrícula]],Usuarios[#All],5,FALSE))","v":""},null,null,{"$f":"IF(ISERROR(VLOOKUP(BMVT[[#This Row],[Rota]],Rotas[#All],3,FALSE)),\"\",VLOOKUP(BMVT[[#This Row],[Rota]],Rotas[#All],3,FALSE))","v":""},{"$f":"IF(ISERROR(VLOOKUP(BMVT[[#This Row],[Rota]],Rotas[#All],4,FALSE)),\"\",VLOOKUP(BMVT[[#This Row],[Rota]],Rotas[#All],4,FALSE))","v":""},{"$f":"IF(ISERROR(VLOOKUP(BMVT[[#This Row],[Rota]],Rotas[#All],5,FALSE)),\"\",VLOOKUP(BMVT[[#This Row],[Rota]],Rotas[#All],5,FALSE))","v":""},{"$f":"IF(ISERROR(VLOOKUP(BMVT[[#This Row],[Rota]],Rotas[#All],6,FALSE)),\"\",VLOOKUP(BMVT[[#This Row],[Rota]],Rotas[#All],6,FALSE))","v":""},null,0,0,{"$f":"BMVT[[#This Row],[Quant. Apur.]]","v":0},0,{"$f":"IF(ISERROR(VLOOKUP(BMVT[[#This Row],[Rota]],Rotas[#All],7,FALSE)),0,VLOOKUP(BMVT[[#This Row],[Rota]],Rotas[#All],7,FALSE))","v":0},0,null,null,{"$f":"IF(ISERROR(BMVT[[#This Row],[Origem]]&\" - \"&BMVT[[#This Row],[Destino]]),\"\",BMVT[[#This Row],[Origem]]&\" - \"&BMVT[[#This Row],[Destino]])","v":" - "}]
[null,{"$f":"IF(ISERROR(VLOOKUP(BMVT[[#This Row],[Matrícula]],Usuarios[#All],2,FALSE)),\"\",VLOOKUP(BMVT[[#This Row],[Matrícula]],Usuarios[#All],2,FALSE))","v":""},{"$f":"IF(ISERROR(VLOOKUP(BMVT[[#This Row],[Matrícula]],Usuarios[#All],3,FALSE)),\"\",VLOOKUP(BMVT[[#This Row],[Matrícula]],Usuarios[#All],3,FALSE))","v":""},{"$f":"IF(ISERROR(VLOOKUP(BMVT[[#This Row],[Matrícula]],Usuarios[#All],4,FALSE)),\"\",VLOOKUP(BMVT[[#This Row],[Matrícula]],Usuarios[#All],4,FALSE))","v":""},{"$f":"IF(ISERROR(VLOOKUP(BMVT[[#This Row],[Matrícula]],Usuarios[#All],5,FALSE)),\"\",VLOOKUP(BMVT[[#This Row],[Matrícula]],Usuarios[#All],5,FALSE))","v":""},null,null,{"$f":"IF(ISERROR(VLOOKUP(BMVT[[#This Row],[Rota]],Rotas[#All],3,FALSE)),\"\",VLOOKUP(BMVT[[#This Row],[Rota]],Rotas[#All],3,FALSE))","v":""},{"$f":"IF(ISERROR(VLOOKUP(BMVT[[#This Row],[Rota]],Rotas[#All],4,FALSE)),\"\",VLOOKUP(BMVT[[#This Row],[Rota]],Rotas[#All],4,FALSE))","v":""},{"$f":"IF(ISERROR(VLOOKUP(BMVT[[#This Row],[Rota]],Rotas[#All],5,FALSE)),\"\",VLOOKUP(BMVT[[#This Row],[Rota]],Rotas[#All],5,FALSE))","v":""},{"$f":"IF(ISERROR(VLOOKUP(BMVT[[#This Row],[Rota]],Rotas[#All],6,FALSE)),\"\",VLOOKUP(BMVT[[#This Row],[Rota]],Rotas[#All],6,FALSE))","v":""},null,0,0,{"$f":"BMVT[[#This Row],[Quant. Apur.]]","v":0},0,{"$f":"IF(ISERROR(VLOOKUP(BMVT[[#This Row],[Rota]],Rotas[#All],7,FALSE)),0,VLOOKUP(BMVT[[#This Row],[Rota]],Rotas[#All],7,FALSE))","v":0},0,null,null,{"$f":"IF(ISERROR(BMVT[[#This Row],[Origem]]&\" - \"&BMVT[[#This Row],[Destino]]),\"\",BMVT[[#This Row],[Origem]]&\" - \"&BMVT[[#This Row],[Destino]])","v":" - "}]
[null,{"$f":"IF(ISERROR(VLOOKUP(BMVT[[#This Row],[Matrícula]],Usuarios[#All],2,FALSE)),\"\",VLOOKUP(BMVT[[#This Row],[Matrícula]],Usuarios[#All],2,FALSE))","v":""},{"$f":"IF(ISERROR(VLOOKUP(BMVT[[#This Row],[Matrícula]],Usuarios[#All],3,FALSE)),\"\",VLOOKUP(BMVT[[#This Row],[Matrícula]],Usuarios[#All],3,FALSE))","v":""},{"$f":"IF(ISERROR(VLOOKUP(BMVT[[#This Row],[Matrícula]],Usuarios[#All],4,FALSE)),\"\",VLOOKUP(BMVT[[#This Row],[Matrícula]],Usuarios[#All],4,FALSE))","v":""},{"$f":"IF(ISERROR(VLOOKUP(BMVT[[#This Row],[Matrícula]],Usuarios[#All],5,FALSE)),\"\",VLOOKUP(BMVT[[#This Row],[Matrícula]],Usuarios[#All],5,FALSE))","v":""},null,null,{"$f":"IF(ISERROR(VLOOKUP(BMVT[[#This Row],[Rota]],Rotas[#All],3,FALSE)),\"\",VLOOKUP(BMVT[[#This Row],[Rota]],Rotas[#All],3,FALSE))","v":""},{"$f":"IF(ISERROR(VLOOKUP(BMVT[[#This Row],[Rota]],Rotas[#All],4,FALSE)),\"\",VLOOKUP(BMVT[[#This Row],[Rota]],Rotas[#All],4,FALSE))","v":""},{"$f":"IF(ISERROR(VLOOKUP(BMVT[[#This Row],[Rota]],Rotas[#All],5,FALSE)),\"\",VLOOKUP(BMVT[[#This Row],[Rota]],Rotas[#All],5,FALSE))","v":""},{"$f":"IF(ISERROR(VLOOKUP(BMVT[[#This Row],[Rota]],Rotas[#All],6,FALSE)),\"\",VLOOKUP(BMVT[[#This Row],[Rota]],Rotas[#All],6,FALSE))","v":""},null,0,0,{"$f":"BMVT[[#This Row],[Quant. Apur.]]","v":0},0,{"$f":"IF(ISERROR(VLOOKUP(BMVT[[#This Row],[Rota]],Rotas[#All],7,FALSE)),0,VLOOKUP(BMVT[[#This Row],[Rota]],Rotas[#All],7,FALSE))","v":0},0,null,null,{"$f":"IF(ISERROR(BMVT[[#This Row],[Origem]]&\" - \"&BMVT[[#This Row],[Destino]]),\"\",BMVT[[#This Row],[Origem]]&\" - \"&BMVT[[#This Row],[Destino]])","v":" - "}]
[null,{"$f":"IF(ISERROR(VLOOKUP(BMVT[[#This Row],[Matrícula]],Usuarios[#All],2,FALSE)),\"\",VLOOKUP(BMVT[[#This Row],[Matrícula]],Usuarios[#All],2,FALSE))","v":""},{"$f":"IF(ISERROR(VLOOKUP(BMVT[[#This Row],[Matrícula]],Usuarios[#All],3,FALSE)),\"\",VLOOKUP(BMVT[[#This Row],[Matrícula]],Usuarios[#All],3,FALSE))","v":""},{"$f":"IF(ISERROR(VLOOKUP(BMVT[[#This Row],[Matrícula]],Usuarios[#All],4,FALSE)),\"\",VLOOKUP(BMVT[[#This Row],[Matrícula]],Usuarios[#All],4,FALSE))","v":""},{"$f":"IF(ISERROR(VLOOKUP(BMVT[[#This Row],[Matrícula]],Usuarios[#All],5,FALSE)),\"\",VLOOKUP(BMVT[[#This Row],[Matrícula]],Usuarios[#All],5,FALSE))","v":""},null,null,{"$f":"IF(ISERROR(VLOOKUP(BMVT[[#This Row],[Rota]],Rotas[#All],3,FALSE)),\"\",VLOOKUP(BMVT[[#This Row],[Rota]],Rotas[#All],3,FALSE))","v":""},{"$f":"IF(ISERROR(VLOOKUP(BMVT[[#This Row],[Rota]],Rotas[#All],4,FALSE)),\"\",VLOOKUP(BMVT[[#This Row],[Rota]],Rotas[#All],4,FALSE))","v":""},{"$f":"IF(ISERROR(VLOOKUP(BMVT[[#This Row],[Rota]],Rotas[#All],5,FALSE)),\"\",VLOOKUP(BMVT[[#This Row],[Rota]],Rotas[#All],5,FALSE))","v":""},{"$f":"IF(ISERROR(VLOOKUP(BMVT[[#This Row],[Rota]],Rotas[#All],6,FALSE)),\"\",VLOOKUP(BMVT[[#This Row],[Rota]],Rotas[#All],6,FALSE))","v":""},null,0,0,{"$f":"BMVT[[#This Row],[Quant. Apur.]]","v":0},0,{"$f":"IF(ISERROR(VLOOKUP(BMVT[[#This Row],[Rota]],Rotas[#All],7,FALSE)),0,VLOOKUP(BMVT[[#This Row],[Rota]],Rotas[#All],7,FALSE))","v":0},{"$f":"O59*Q59","v":0},null,null,{"$f":"IF(ISERROR(BMVT[[#This Row],[Origem]]&\" - \"&BMVT[[#This Row],[Destino]]),\"\",BMVT[[#This Row],[Origem]]&\" - \"&BMVT[[#This Row],[Destino]])","v":" - "}]
[null,{"$f":"IF(ISERROR(VLOOKUP(BMVT[[#This Row],[Matrícula]],Usuarios[#All],2,FALSE)),\"\",VLOOKUP(BMVT[[#This Row],[Matrícula]],Usuarios[#All],2,FALSE))","v":""},{"$f":"IF(ISERROR(VLOOKUP(BMVT[[#This Row],[Matrícula]],Usuarios[#All],3,FALSE)),\"\",VLOOKUP(BMVT[[#This Row],[Matrícula]],Usuarios[#All],3,FALSE))","v":""},{"$f":"IF(ISERROR(VLOOKUP(BMVT[[#This Row],[Matrícula]],Usuarios[#All],4,FALSE)),\"\",VLOOKUP(BMVT[[#This Row],[Matrícula]],Usuarios[#All],4,FALSE))","v":""},{"$f":"IF(ISERROR(VLOOKUP(BMVT[[#This Row],[Matrícula]],Usuarios[#All],5,FALSE)),\"\",VLOOKUP(BMVT[[#This Row],[Matrícula]],Usuarios[#All],5,FALSE))","v":""},null,null,{"$f":"IF(ISERROR(VLOOKUP(BMVT[[#This Row],[Rota]],Rotas[#All],3,FALSE)),\"\",VLOOKUP(BMVT[[#This Row],[Rota]],Rotas[#All],3,FALSE))","v":""},{"$f":"IF(ISERROR(VLOOKUP(BMVT[[#This Row],[Rota]],Rotas[#All],4,FALSE)),\"\",VLOOKUP(BMVT[[#This Row],[Rota]],Rotas[#All],4,FALSE))","v":""},{"$f":"IF(ISERROR(VLOOKUP(BMVT[[#This Row],[Rota]],Rotas[#All],5,FALSE)),\"\",VLOOKUP(BMVT[[#This Row],[Rota]],Rotas[#All],5,FALSE))","v":""},{"$f":"IF(ISERROR(VLOOKUP(BMVT[[#This Row],[Rota]],Rotas[#All],6,FALSE)),\"\",VLOOKUP(BMVT[[#This Row],[Rota]],Rotas[#All],6,FALSE))","v":""},null,0,0,{"$f":"BMVT[[#This Row],[Quant. Apur.]]","v":0},0,{"$f":"IF(ISERROR(VLOOKUP(BMVT[[#This Row],[Rota]],Rotas[#All],7,FALSE)),0,VLOOKUP(BMVT[[#This Row],[Rota]],Rotas[#All],7,FALSE))","v":0},0,null,null,{"$f":"IF(ISERROR(BMVT[[#This Row],[Origem]]&\" - \"&BMVT[[#This Row],[Destino]]),\"\",BMVT[[#This Row],[Origem]]&\" - \"&BMVT[[#This Row],[Destino]])","v":" - "}]
[null,{"$f":"IF(ISERROR(VLOOKUP(BMVT[[#This Row],[Matrícula]],Usuarios[#All],2,FALSE)),\"\",VLOOKUP(BMVT[[#This Row],[Matrícula]],Usuarios[#All],2,FALSE))","v":""},{"$f":"IF(ISERROR(VLOOKUP(BMVT[[#This Row],[Matrícula]],Usuarios[#All],3,FALSE)),\"\",VLOOKUP(BMVT[[#This Row],[Matrícula]],Usuarios[#All],3,FALSE))","v":""},{"$f":"IF(ISERROR(VLOOKUP(BMVT[[#This Row],[Matrícula]],Usuarios[#All],4,FALSE)),\"\",VLOOKUP(BMVT[[#This Row],[Matrícula]],Usuarios[#All],4,FALSE))","v":""},{"$f":"IF(ISERROR(VLOOKUP(BMVT[[#This Row],[Matrícula]],Usuarios[#All],5,FALSE)),\"\",VLOOKUP(BMVT[[#This Row],[Matrícula]],Usuarios[#All],5,FALSE))","v":""},null,null,{"$f":"IF(ISERROR(VLOOKUP(BMVT[[#This Row],[Rota]],Rotas[#All],3,FALSE)),\"\",VLOOKUP(BMVT[[#This Row],[Rota]],Rotas[#All],3,FALSE))","v":""},{"$f":"IF(ISERROR(VLOOKUP(BMVT[[#This Row],[Rota]],Rotas[#All],4,FALSE)),\"\",VLOOKUP(BMVT[[#This Row],[Rota]],Rotas[#All],4,FALSE))","v":""},{"$f":"IF(ISERROR(VLOOKUP(BMVT[[#This Row],[Rota]],Rotas[#All],5,FALSE)),\"\",VLOOKUP(BMVT[[#This Row],[Rota]],Rotas[#All],5,FALSE))","v":""},{"$f":"IF(ISERROR(VLOOKUP(BMVT[[#This Row],[Rota]],Rotas[#All],6,FALSE)),\"\",VLOOKUP(BMVT[[#This Row],[Rota]],Rotas[#All],6,FALSE))","v":""},null,0,0,{"$f":"BMVT[[#This Row],[Quant. Apur.]]","v":0},0,{"$f":"IF(ISERROR(VLOOKUP(BMVT[[#This Row],[Rota]],Rotas[#All],7,FALSE)),0,VLOOKUP(BMVT[[#This Row],[Rota]],Rotas[#All],7,FALSE))","v":0},0,null,null,{"$f":"IF(ISERROR(BMVT[[#This Row],[Origem]]&\" - \"&BMVT[[#This Row],[Destino]]),\"\",BMVT[[#This Row],[Origem]]&\" - \"&BMVT[[#This Row],[Destino]])","v":" - "}]
[null,{"$f":"IF(ISERROR(VLOOKUP(BMVT[[#This Row],[Matrícula]],Usuarios[#All],2,FALSE)),\"\",VLOOKUP(BMVT[[#This Row],[Matrícula]],Usuarios[#All],2,FALSE))","v":""},{"$f":"IF(ISERROR(VLOOKUP(BMVT[[#This Row],[Matrícula]],Usuarios[#All],3,FALSE)),\"\",VLOOKUP(BMVT[[#This Row],[Matrícula]],Usuarios[#All],3,FALSE))","v":""},{"$f":"IF(ISERROR(VLOOKUP(BMVT[[#This Row],[Matrícula]],Usuarios[#All],4,FALSE)),\"\",VLOOKUP(BMVT[[#This Row],[Matrícula]],Usuarios[#All],4,FALSE))","v":""},{"$f":"IF(ISERROR(VLOOKUP(BMVT[[#This Row],[Matrícula]],Usuarios[#All],5,FALSE)),\"\",VLOOKUP(BMVT[[#This Row],[Matrícula]],Usuarios[#All],5,FALSE))","v":""},null,null,{"$f":"IF(ISERROR(VLOOKUP(BMVT[[#This Row],[Rota]],Rotas[#All],3,FALSE)),\"\",VLOOKUP(BMVT[[#This Row],[Rota]],Rotas[#All],3,FALSE))","v":""},{"$f":"IF(ISERROR(VLOOKUP(BMVT[[#This Row],[Rota]],Rotas[#All],4,FALSE)),\"\",VLOOKUP(BMVT[[#This Row],[Rota]],Rotas[#All],4,FALSE))","v":""},{"$f":"IF(ISERROR(VLOOKUP(BMVT[[#This Row],[Rota]],Rotas[#All],5,FALSE)),\"\",VLOOKUP(BMVT[[#This Row],[Rota]],Rotas[#All],5,FALSE))","v":""},{"$f":"IF(ISERROR(VLOOKUP(BMVT[[#This Row],[Rota]],Rotas[#All],6,FALSE)),\"\",VLOOKUP(BMVT[[#This Row],[Rota]],Rotas[#All],6,FALSE))","v":""},null,0,0,{"$f":"BMVT[[#This Row],[Quant. Apur.]]","v":0},0,{"$f":"IF(ISERROR(VLOOKUP(BMVT[[#This Row],[Rota]],Rotas[#All],7,FALSE)),0,VLOOKUP(BMVT[[#This Row],[Rota]],Rotas[#All],7,FALSE))","v":0},0,null,null,{"$f":"IF(ISERROR(BMVT[[#This Row],[Origem]]&\" - \"&BMVT[[#This Row],[Destino]]),\"\",BMVT[[#This Row],[Origem]]&\" - \"&BMVT[[#This Row],[Destino]])","v":" - "}]
[null,{"$f":"IF(ISERROR(VLOOKUP(BMVT[[#This Row],[Matrícula]],Usuarios[#All],2,FALSE)),\"\",VLOOKUP(BMVT[[#This Row],[Matrícula]],Usuarios[#All],2,FALSE))","v":""},{"$f":"IF(ISERROR(VLOOKUP(BMVT[[#This Row],[Matrícula]],Usuarios[#All],3,FALSE)),\"\",VLOOKUP(BMVT[[#This Row],[Matrícula]],Usuarios[#All],3,FALSE))","v":""},{"$f":"IF(ISERROR(VLOOKUP(BMVT[[#This Row],[Matrícula]],Usuarios[#All],4,FALSE)),\"\",VLOOKUP(BMVT[[#This Row],[Matrícula]],Usuarios[#All],4,FALSE))","v":""},{"$f":"IF(ISERROR(VLOOKUP(BMVT[[#This Row],[Matrícula]],Usuarios[#All],5,FALSE)),\"\",VLOOKUP(BMVT[[#This Row],[Matrícula]],Usuarios[#All],5,FALSE))","v":""},null,null,{"$f":"IF(ISERROR(VLOOKUP(BMVT[[#This Row],[Rota]],Rotas[#All],3,FALSE)),\"\",VLOOKUP(BMVT[[#This Row],[Rota]],Rotas[#All],3,FALSE))","v":""},{"$f":"IF(ISERROR(VLOOKUP(BMVT[[#This Row],[Rota]],Rotas[#All],4,FALSE)),\"\",VLOOKUP(BMVT[[#This Row],[Rota]],Rotas[#All],4,FALSE))","v":""},{"$f":"IF(ISERROR(VLOOKUP(BMVT[[#This Row],[Rota]],Rotas[#All],5,FALSE)),\"\",VLOOKUP(BMVT[[#This Row],[Rota]],Rotas[#All],5,FALSE))","v":""},{"$f":"IF(ISERROR(VLOOKUP(BMVT[[#This Row],[Rota]],Rotas[#All],6,FALSE)),\"\",VLOOKUP(BMVT[[#This Row],[Rota]],Rotas[#All],6,FALSE))","v":""},null,0,0,{"$f":"BMVT[[#This Row],[Quant. Apur.]]","v":0},{"$f":"IF(ISERROR(O63/M63),0,O63/M63)","v":0},{"$f":"IF(ISERROR(VLOOKUP(BMVT[[#This Row],[Rota]],Rotas[#All],7,FALSE)),0,VLOOKUP(BMVT[[#This Row],[Rota]],Rotas[#All],7,FALSE))","v":0},0,null,null,{"$f":"IF(ISERROR(BMVT[[#This Row],[Origem]]&\" - \"&BMVT[[#This Row],[Destino]]),\"\",BMVT[[#This Row],[Origem]]&\" - \"&BMVT[[#This Row],[Destino]])","v":" - "}]
[null,{"$f":"IF(ISERROR(VLOOKUP(BMVT[[#This Row],[Matrícula]],Usuarios[#All],2,FALSE)),\"\",VLOOKUP(BMVT[[#This Row],[Matrícula]],Usuarios[#All],2,FALSE))","v":""},{"$f":"IF(ISERROR(VLOOKUP(BMVT[[#This Row],[Matrícula]],Usuarios[#All],3,FALSE)),\"\",VLOOKUP(BMVT[[#This Row],[Matrícula]],Usuarios[#All],3,FALSE))","v":""},{"$f":"IF(ISERROR(VLOOKUP(BMVT[[#This Row],[Matrícula]],Usuarios[#All],4,FALSE)),\"\",VLOOKUP(BMVT[[#This Row],[Matrícula]],Usuarios[#All],4,FALSE))","v":""},{"$f":"IF(ISERROR(VLOOKUP(BMVT[[#This Row],[Matrícula]],Usuarios[#All],5,FALSE)),\"\",VLOOKUP(BMVT[[#This Row],[Matrícula]],Usuarios[#All],5,FALSE))","v":""},null,null,{"$f":"IF(ISERROR(VLOOKUP(BMVT[[#This Row],[Rota]],Rotas[#All],3,FALSE)),\"\",VLOOKUP(BMVT[[#This Row],[Rota]],Rotas[#All],3,FALSE))","v":""},{"$f":"IF(ISERROR(VLOOKUP(BMVT[[#This Row],[Rota]],Rotas[#All],4,FALSE)),\"\",VLOOKUP(BMVT[[#This Row],[Rota]],Rotas[#All],4,FALSE))","v":""},{"$f":"IF(ISERROR(VLOOKUP(BMVT[[#This Row],[Rota]],Rotas[#All],5,FALSE)),\"\",VLOOKUP(BMVT[[#This Row],[Rota]],Rotas[#All],5,FALSE))","v":""},{"$f":"IF(ISERROR(VLOOKUP(BMVT[[#This Row],[Rota]],Rotas[#All],6,FALSE)),\"\",VLOOKUP(BMVT[[#This Row],[Rota]],Rotas[#All],6,FALSE))","v":""},null,0,{"$f":"L64*$G$1","v":0},{"$f":"BMVT[[#This Row],[Quant. Apur.]]","v":0},0,{"$f":"IF(ISERROR(VLOOKUP(BMVT[[#This Row],[Rota]],Rotas[#All],7,FALSE)),0,VLOOKUP(BMVT[[#This Row],[Rota]],Rotas[#All],7,FALSE))","v":0},0,null,null,{"$f":"IF(ISERROR(BMVT[[#This Row],[Origem]]&\" - \"&BMVT[[#This Row],[Destino]]),\"\",BMVT[[#This Row],[Origem]]&\" - \"&BMVT[[#This Row],[Destino]])","v":" - "}]
[null,{"$f":"IF(ISERROR(VLOOKUP(BMVT[[#This Row],[Matrícula]],Usuarios[#All],2,FALSE)),\"\",VLOOKUP(BMVT[[#This Row],[Matrícula]],Usuarios[#All],2,FALSE))","v":""},{"$f":"IF(ISERROR(VLOOKUP(BMVT[[#This Row],[Matrícula]],Usuarios[#All],3,FALSE)),\"\",VLOOKUP(BMVT[[#This Row],[Matrícula]],Usuarios[#All],3,FALSE))","v":""},{"$f":"IF(ISERROR(VLOOKUP(BMVT[[#This Row],[Matrícula]],Usuarios[#All],4,FALSE)),\"\",VLOOKUP(BMVT[[#This Row],[Matrícula]],Usuarios[#All],4,FALSE))","v":""},{"$f":"IF(ISERROR(VLOOKUP(BMVT[[#This Row],[Matrícula]],Usuarios[#All],5,FALSE)),\"\",VLOOKUP(BMVT[[#This Row],[Matrícula]],Usuarios[#All],5,FALSE))","v":""},null,null,{"$f":"IF(ISERROR(VLOOKUP(BMVT[[#This Row],[Rota]],Rotas[#All],3,FALSE)),\"\",VLOOKUP(BMVT[[#This Row],[Rota]],Rotas[#All],3,FALSE))","v":""},{"$f":"IF(ISERROR(VLOOKUP(BMVT[[#This Row],[Rota]],Rotas[#All],4,FALSE)),\"\",VLOOKUP(BMVT[[#This Row],[Rota]],Rotas[#All],4,FALSE))","v":""},{"$f":"IF(ISERROR(VLOOKUP(BMVT[[#This Row],[Rota]],Rotas[#All],5,FALSE)),\"\",VLOOKUP(BMVT[[#This Row],[Rota]],Rotas[#All],5,FALSE))","v":""},{"$f":"IF(ISERROR(VLOOKUP(BMVT[[#This Row],[Rota]],Rotas[#All],6,FALSE)),\"\",VLOOKUP(BMVT[[#This Row],[Rota]],Rotas[#All],6,FALSE))","v":""},null,0,0,{"$f":"BMVT[[#This Row],[Quant. Apur.]]","v":0},0,{"$f":"IF(ISERROR(VLOOKUP(BMVT[[#This Row],[Rota]],Rotas[#All],7,FALSE)),0,VLOOKUP(BMVT[[#This Row],[Rota]],Rotas[#All],7,FALSE))","v":0},0,null,null,{"$f":"IF(ISERROR(BMVT[[#This Row],[Origem]]&\" - \"&BMVT[[#This Row],[Destino]]),\"\",BMVT[[#This Row],[Origem]]&\" - \"&BMVT[[#This Row],[Destino]])","v":" - "}]
[null,{"$f":"IF(ISERROR(VLOOKUP(BMVT[[#This Row],[Matrícula]],Usuarios[#All],2,FALSE)),\"\",VLOOKUP(BMVT[[#This Row],[Matrícula]],Usuarios[#All],2,FALSE))","v":""},{"$f":"IF(ISERROR(VLOOKUP(BMVT[[#This Row],[Matrícula]],Usuarios[#All],3,FALSE)),\"\",VLOOKUP(BMVT[[#This Row],[Matrícula]],Usuarios[#All],3,FALSE))","v":""},{"$f":"IF(ISERROR(VLOOKUP(BMVT[[#This Row],[Matrícula]],Usuarios[#All],4,FALSE)),\"\",VLOOKUP(BMVT[[#This Row],[Matrícula]],Usuarios[#All],4,FALSE))","v":""},{"$f":"IF(ISERROR(VLOOKUP(BMVT[[#This Row],[Matrícula]],Usuarios[#All],5,FALSE)),\"\",VLOOKUP(BMVT[[#This Row],[Matrícula]],Usuarios[#All],5,FALSE))","v":""},null,null,{"$f":"IF(ISERROR(VLOOKUP(BMVT[[#This Row],[Rota]],Rotas[#All],3,FALSE)),\"\",VLOOKUP(BMVT[[#This Row],[Rota]],Rotas[#All],3,FALSE))","v":""},{"$f":"IF(ISERROR(VLOOKUP(BMVT[[#This Row],[Rota]],Rotas[#All],4,FALSE)),\"\",VLOOKUP(BMVT[[#This Row],[Rota]],Rotas[#All],4,FALSE))","v":""},{"$f":"IF(ISERROR(VLOOKUP(BMVT[[#This Row],[Rota]],Rotas[#All],5,FALSE)),\"\",VLOOKUP(BMVT[[#This Row],[Rota]],Rotas[#All],5,FALSE))","v":""},{"$f":"IF(ISERROR(VLOOKUP(BMVT[[#This Row],[Rota]],Rotas[#All],6,FALSE)),\"\",VLOOKUP(BMVT[[#This Row],[Rota]],Rotas[#All],6,FALSE))","v":""},null,{"$f":"L66","v":0},0,{"$f":"BMVT[[#This Row],[Quant. Apur.]]","v":0},0,{"$f":"IF(ISERROR(VLOOKUP(BMVT[[#This Row],[Rota]],Rotas[#All],7,FALSE)),0,VLOOKUP(BMVT[[#This Row],[Rota]],Rotas[#All],7,FALSE))","v":0},0,null,null,{"$f":"IF(ISERROR(BMVT[[#This Row],[Origem]]&\" - \"&BMVT[[#This Row],[Destino]]),\"\",BMVT[[#This Row],[Origem]]&\" - \"&BMVT[[#This Row],[Destino]])","v":" - "}]
[null,{"$f":"IF(ISERROR(VLOOKUP(BMVT[[#This Row],[Matrícula]],Usuarios[#All],2,FALSE)),\"\",VLOOKUP(BMVT[[#This Row],[Matrícula]],Usuarios[#All],2,FALSE))","v":""},{"$f":"IF(ISERROR(VLOOKUP(BMVT[[#This Row],[Matrícula]],Usuarios[#All],3,FALSE)),\"\",VLOOKUP(BMVT[[#This Row],[Matrícula]],Usuarios[#All],3,FALSE))","v":""},{"$f":"IF(ISERROR(VLOOKUP(BMVT[[#This Row],[Matrícula]],Usuarios[#All],4,FALSE)),\"\",VLOOKUP(BMVT[[#This Row],[Matrícula]],Usuarios[#All],4,FALSE))","v":""},{"$f":"IF(ISERROR(VLOOKUP(BMVT[[#This Row],[Matrícula]],Usuarios[#All],5,FALSE)),\"\",VLOOKUP(BMVT[[#This Row],[Matrícula]],Usuarios[#All],5,FALSE))","v":""},null,null,{"$f":"IF(ISERROR(VLOOKUP(BMVT[[#This Row],[Rota]],Rotas[#All],3,FALSE)),\"\",VLOOKUP(BMVT[[#This Row],[Rota]],Rotas[#All],3,FALSE))","v":""},{"$f":"IF(ISERROR(VLOOKUP(BMVT[[#This Row],[Rota]],Rotas[#All],4,FALSE)),\"\",VLOOKUP(BMVT[[#This Row],[Rota]],Rotas[#All],4,FALSE))","v":""},{"$f":"IF(ISERROR(VLOOKUP(BMVT[[#This Row],[Rota]],Rotas[#All],5,FALSE)),\"\",VLOOKUP(BMVT[[#This Row],[Rota]],Rotas[#All],5,FALSE))","v":""},{"$f":"IF(ISERROR(VLOOKUP(BMVT[[#This Row],[Rota]],Rotas[#All],6,FALSE)),\"\",VLOOKUP(BMVT[[#This Row],[Rota]],Rotas[#All],6,FALSE))","v":""},null,0,0,{"$f":"BMVT[[#This Row],[Quant. Apur.]]","v":0},0,{"$f":"IF(ISERROR(VLOOKUP(BMVT[[#This Row],[Rota]],Rotas[#All],7,FALSE)),0,VLOOKUP(BMVT[[#This Row],[Rota]],Rotas[#All],7,FALSE))","v":0},0,null,null,{"$f":"IF(ISERROR(BMVT[[#This Row],[Origem]]&\" - \"&BMVT[[#This Row],[Destino]]),\"\",BMVT[[#This Row],[Origem]]&\" - \"&BMVT[[#This Row],[Destino]])","v":" - "}]
[null,{"$f":"IF(ISERROR(VLOOKUP(BMVT[[#This Row],[Matrícula]],Usuarios[#All],2,FALSE)),\"\",VLOOKUP(BMVT[[#This Row],[Matrícula]],Usuarios[#All],2,FALSE))","v":""},{"$f":"IF(ISERROR(VLOOKUP(BMVT[[#This Row],[Matrícula]],Usuarios[#All],3,FALSE)),\"\",VLOOKUP(BMVT[[#This Row],[Matrícula]],Usuarios[#All],3,FALSE))","v":""},{"$f":"IF(ISERROR(VLOOKUP(BMVT[[#This Row],[Matrícula]],Usuarios[#All],4,FALSE)),\"\",VLOOKUP(BMVT[[#This Row],[Matrícula]],Usuarios[#All],4,FALSE))","v":""},{"$f":"IF(ISERROR(VLOOKUP(BMVT[[#This Row],[Matrícula]],Usuarios[#All],5,FALSE)),\"\",VLOOKUP(BMVT[[#This Row],[Matrícula]],Usuarios[#All],5,FALSE))","v":""},null,null,{"$f":"IF(ISERROR(VLOOKUP(BMVT[[#This Row],[Rota]],Rotas[#All],3,FALSE)),\"\",VLOOKUP(BMVT[[#This Row],[Rota]],Rotas[#All],3,FALSE))","v":""},{"$f":"IF(ISERROR(VLOOKUP(BMVT[[#This Row],[Rota]],Rotas[#All],4,FALSE)),\"\",VLOOKUP(BMVT[[#This Row],[Rota]],Rotas[#All],4,FALSE))","v":""},{"$f":"IF(ISERROR(VLOOKUP(BMVT[[#This Row],[Rota]],Rotas[#All],5,FALSE)),\"\",VLOOKUP(BMVT[[#This Row],[Rota]],Rotas[#All],5,FALSE))","v":""},{"$f":"IF(ISERROR(VLOOKUP(BMVT[[#This Row],[Rota]],Rotas[#All],6,FALSE)),\"\",VLOOKUP(BMVT[[#This Row],[Rota]],Rotas[#All],6,FALSE))","v":""},null,0,0,{"$f":"BMVT[[#This Row],[Quant. Apur.]]","v":0},0,{"$f":"IF(ISERROR(VLOOKUP(BMVT[[#This Row],[Rota]],Rotas[#All],7,FALSE)),0,VLOOKUP(BMVT[[#This Row],[Rota]],Rotas[#All],7,FALSE))","v":0},0,null,null,{"$f":"IF(ISERROR(BMVT[[#This Row],[Origem]]&\" - \"&BMVT[[#This Row],[Destino]]),\"\",BMVT[[#This Row],[Origem]]&\" - \"&BMVT[[#This Row],[Destino]])","v":" - "}]
[null,{"$f":"IF(ISERROR(VLOOKUP(BMVT[[#This Row],[Matrícula]],Usuarios[#All],2,FALSE)),\"\",VLOOKUP(BMVT[[#This Row],[Matrícula]],Usuarios[#All],2,FALSE))","v":""},{"$f":"IF(ISERROR(VLOOKUP(BMVT[[#This Row],[Matrícula]],Usuarios[#All],3,FALSE)),\"\",VLOOKUP(BMVT[[#This Row],[Matrícula]],Usuarios[#All],3,FALSE))","v":""},{"$f":"IF(ISERROR(VLOOKUP(BMVT[[#This Row],[Matrícula]],Usuarios[#All],4,FALSE)),\"\",VLOOKUP(BMVT[[#This Row],[Matrícula]],Usuarios[#All],4,FALSE))","v":""},{"$f":"IF(ISERROR(VLOOKUP(BMVT[[#This Row],[Matrícula]],Usuarios[#All],5,FALSE)),\"\",VLOOKUP(BMVT[[#This Row],[Matrícula]],Usuarios[#All],5,FALSE))","v":""},null,null,{"$f":"IF(ISERROR(VLOOKUP(BMVT[[#This Row],[Rota]],Rotas[#All],3,FALSE)),\"\",VLOOKUP(BMVT[[#This Row],[Rota]],Rotas[#All],3,FALSE))","v":""},{"$f":"IF(ISERROR(VLOOKUP(BMVT[[#This Row],[Rota]],Rotas[#All],4,FALSE)),\"\",VLOOKUP(BMVT[[#This Row],[Rota]],Rotas[#All],4,FALSE))","v":""},{"$f":"IF(ISERROR(VLOOKUP(BMVT[[#This Row],[Rota]],Rotas[#All],5,FALSE)),\"\",VLOOKUP(BMVT[[#This Row],[Rota]],Rotas[#All],5,FALSE))","v":""},{"$f":"IF(ISERROR(VLOOKUP(BMVT[[#This Row],[Rota]],Rotas[#All],6,FALSE)),\"\",VLOOKUP(BMVT[[#This Row],[Rota]],Rotas[#All],6,FALSE))","v":""},null,0,0,{"$f":"BMVT[[#This Row],[Quant. Apur.]]","v":0},0,{"$f":"IF(ISERROR(VLOOKUP(BMVT[[#This Row],[Rota]],Rotas[#All],7,FALSE)),0,VLOOKUP(BMVT[[#This Row],[Rota]],Rotas[#All],7,FALSE))","v":0},0,null,null,{"$f":"IF(ISERROR(BMVT[[#This Row],[Origem]]&\" - \"&BMVT[[#This Row],[Destino]]),\"\",BMVT[[#This Row],[Origem]]&\" - \"&BMVT[[#This Row],[Destino]])","v":" - "}]
[null,{"$f":"IF(ISERROR(VLOOKUP(BMVT[[#This Row],[Matrícula]],Usuarios[#All],2,FALSE)),\"\",VLOOKUP(BMVT[[#This Row],[Matrícula]],Usuarios[#All],2,FALSE))","v":""},{"$f":"IF(ISERROR(VLOOKUP(BMVT[[#This Row],[Matrícula]],Usuarios[#All],3,FALSE)),\"\",VLOOKUP(BMVT[[#This Row],[Matrícula]],Usuarios[#All],3,FALSE))","v":""},{"$f":"IF(ISERROR(VLOOKUP(BMVT[[#This Row],[Matrícula]],Usuarios[#All],4,FALSE)),\"\",VLOOKUP(BMVT[[#This Row],[Matrícula]],Usuarios[#All],4,FALSE))","v":""},{"$f":"IF(ISERROR(VLOOKUP(BMVT[[#This Row],[Matrícula]],Usuarios[#All],5,FALSE)),\"\",VLOOKUP(BMVT[[#This Row],[Matrícula]],Usuarios[#All],5,FALSE))","v":""},null,null,{"$f":"IF(ISERROR(VLOOKUP(BMVT[[#This Row],[Rota]],Rotas[#All],3,FALSE)),\"\",VLOOKUP(BMVT[[#This Row],[Rota]],Rotas[#All],3,FALSE))","v":""},{"$f":"IF(ISERROR(VLOOKUP(BMVT[[#This Row],[Rota]],Rotas[#All],4,FALSE)),\"\",VLOOKUP(BMVT[[#This Row],[Rota]],Rotas[#All],4,FALSE))","v":""},{"$f":"IF(ISERROR(VLOOKUP(BMVT[[#This Row],[Rota]],Rotas[#All],5,FALSE)),\"\",VLOOKUP(BMVT[[#This Row],[Rota]],Rotas[#All],5,FALSE))","v":""},{"$f":"IF(ISERROR(VLOOKUP(BMVT[[#This Row],[Rota]],Rotas[#All],6,FALSE)),\"\",VLOOKUP(BMVT[[#This Row],[Rota]],Rotas[#All],6,FALSE))","v":""},null,0,0,{"$f":"BMVT[[#This Row],[Quant. Apur.]]","v":0},0,{"$f":"IF(ISERROR(VLOOKUP(BMVT[[#This Row],[Rota]],Rotas[#All],7,FALSE)),0,VLOOKUP(BMVT[[#This Row],[Rota]],Rotas[#All],7,FALSE))","v":0},0,null,null,{"$f":"IF(ISERROR(BMVT[[#This Row],[Origem]]&\" - \"&BMVT[[#This Row],[Destino]]),\"\",BMVT[[#This Row],[Origem]]&\" - \"&BMVT[[#This Row],[Destino]])","v":" - "}]
[null,{"$f":"IF(ISERROR(VLOOKUP(BMVT[[#This Row],[Matrícula]],Usuarios[#All],2,FALSE)),\"\",VLOOKUP(BMVT[[#This Row],[Matrícula]],Usuarios[#All],2,FALSE))","v":""},{"$f":"IF(ISERROR(VLOOKUP(BMVT[[#This Row],[Matrícula]],Usuarios[#All],3,FALSE)),\"\",VLOOKUP(BMVT[[#This Row],[Matrícula]],Usuarios[#All],3,FALSE))","v":""},{"$f":"IF(ISERROR(VLOOKUP(BMVT[[#This Row],[Matrícula]],Usuarios[#All],4,FALSE)),\"\",VLOOKUP(BMVT[[#This Row],[Matrícula]],Usuarios[#All],4,FALSE))","v":""},{"$f":"IF(ISERROR(VLOOKUP(BMVT[[#This Row],[Matrícula]],Usuarios[#All],5,FALSE)),\"\",VLOOKUP(BMVT[[#This Row],[Matrícula]],Usuarios[#All],5,FALSE))","v":""},null,null,{"$f":"IF(ISERROR(VLOOKUP(BMVT[[#This Row],[Rota]],Rotas[#All],3,FALSE)),\"\",VLOOKUP(BMVT[[#This Row],[Rota]],Rotas[#All],3,FALSE))","v":""},{"$f":"IF(ISERROR(VLOOKUP(BMVT[[#This Row],[Rota]],Rotas[#All],4,FALSE)),\"\",VLOOKUP(BMVT[[#This Row],[Rota]],Rotas[#All],4,FALSE))","v":""},{"$f":"IF(ISERROR(VLOOKUP(BMVT[[#This Row],[Rota]],Rotas[#All],5,FALSE)),\"\",VLOOKUP(BMVT[[#This Row],[Rota]],Rotas[#All],5,FALSE))","v":""},{"$f":"IF(ISERROR(VLOOKUP(BMVT[[#This Row],[Rota]],Rotas[#All],6,FALSE)),\"\",VLOOKUP(BMVT[[#This Row],[Rota]],Rotas[#All],6,FALSE))","v":""},null,0,{"$f":"L71*$G$1","v":0},{"$f":"BMVT[[#This Row],[Quant. Apur.]]","v":0},{"$f":"IF(ISERROR(O71/M71),0,O71/M71)","v":0},{"$f":"IF(ISERROR(VLOOKUP(BMVT[[#This Row],[Rota]],Rotas[#All],7,FALSE)),0,VLOOKUP(BMVT[[#This Row],[Rota]],Rotas[#All],7,FALSE))","v":0},{"$f":"O71*Q71","v":0},null,null,{"$f":"IF(ISERROR(BMVT[[#This Row],[Origem]]&\" - \"&BMVT[[#This Row],[Destino]]),\"\",BMVT[[#This Row],[Origem]]&\" - \"&BMVT[[#This Row],[Destino]])","v":" - "}]
[null,{"$f":"IF(ISERROR(VLOOKUP(BMVT[[#This Row],[Matrícula]],Usuarios[#All],2,FALSE)),\"\",VLOOKUP(BMVT[[#This Row],[Matrícula]],Usuarios[#All],2,FALSE))","v":""},{"$f":"IF(ISERROR(VLOOKUP(BMVT[[#This Row],[Matrícula]],Usuarios[#All],3,FALSE)),\"\",VLOOKUP(BMVT[[#This Row],[Matrícula]],Usuarios[#All],3,FALSE))","v":""},{"$f":"IF(ISERROR(VLOOKUP(BMVT[[#This Row],[Matrícula]],Usuarios[#All],4,FALSE)),\"\",VLOOKUP(BMVT[[#This Row],[Matrícula]],Usuarios[#All],4,FALSE))","v":""},{"$f":"IF(ISERROR(VLOOKUP(BMVT[[#This Row],[Matrícula]],Usuarios[#All],5,FALSE)),\"\",VLOOKUP(BMVT[[#This Row],[Matrícula]],Usuarios[#All],5,FALSE))","v":""},null,null,{"$f":"IF(ISERROR(VLOOKUP(BMVT[[#This Row],[Rota]],Rotas[#All],3,FALSE)),\"\",VLOOKUP(BMVT[[#This Row],[Rota]],Rotas[#All],3,FALSE))","v":""},{"$f":"IF(ISERROR(VLOOKUP(BMVT[[#This Row],[Rota]],Rotas[#All],4,FALSE)),\"\",VLOOKUP(BMVT[[#This Row],[Rota]],Rotas[#All],4,FALSE))","v":""},{"$f":"IF(ISERROR(VLOOKUP(BMVT[[#This Row],[Rota]],Rotas[#All],5,FALSE)),\"\",VLOOKUP(BMVT[[#This Row],[Rota]],Rotas[#All],5,FALSE))","v":""},{"$f":"IF(ISERROR(VLOOKUP(BMVT[[#This Row],[Rota]],Rotas[#All],6,FALSE)),\"\",VLOOKUP(BMVT[[#This Row],[Rota]],Rotas[#All],6,FALSE))","v":""},null,0,{"$f":"L72*$G$1","v":0},{"$f":"BMVT[[#This Row],[Quant. Apur.]]","v":0},{"$f":"IF(ISERROR(O72/M72),0,O72/M72)","v":0},{"$f":"IF(ISERROR(VLOOKUP(BMVT[[#This Row],[Rota]],Rotas[#All],7,FALSE)),0,VLOOKUP(BMVT[[#This Row],[Rota]],Rotas[#All],7,FALSE))","v":0},{"$f":"O72*Q72","v":0},null,null,{"$f":"IF(ISERROR(BMVT[[#This Row],[Origem]]&\" - \"&BMVT[[#This Row],[Destino]]),\"\",BMVT[[#This Row],[Origem]]&\" - \"&BMVT[[#This Row],[Destino]])","v":" - "}]
["Total",null,null,null,null,null,null,null,null,null,null,null,{"$f":"SUBTOTAL(109,BMVT[Chipagem])","v":50},{"$f":"SUBTOTAL(109,BMVT[Quant. Apur.])","v":1008},{"$f":"SUBTOTAL(109,BMVT[Qtd. Solic.])","v":835},{"$f":"SUBTOTAL(109,BMVT[Dias Lanc Sist.])","v":386},null,{"$f":"SUBTOTAL(109,BMVT[Vlr. Total])","v":5932.1600000000017},null,null,{"$f":"IF(ISERROR(BMVT[[#This Row],[Origem]]&\" - \"&BMVT[[#This Row],[Destino]]),\"\",BMVT[[#This Row],[Origem]]&\" - \"&BMVT[[#This Row],[Destino]])","v":""}]
[null,null,null,null,null,null,null,null,null,null,null,null,null,null,null,null,null,null,null,null,{"$f":"IF(ISERROR(BMVT[[#This Row],[Origem]]&\" - \"&BMVT[[#This Row],[Destino]]),\"\",BMVT[[#This Row],[Origem]]&\" - \"&BMVT[[#This Row],[Destino]])","v":""}]
[null,null,null,null,null,null,null,null,null,null,null,null,null,null,null,null,null,null,null,null,{"$f":"IF(ISERROR(BMVT[[#This Row],[Origem]]&\" - \"&BMVT[[#This Row],[Destino]]),\"\",BMVT[[#This Row],[Origem]]&\" - \"&BMVT[[#This Row],[Destino]])","v":""}]
[null,null,null,null,null,null,null,null,null,null,null,null,null,null,null,null,null,null,null,null,{"$f":"IF(ISERROR(BMVT[[#This Row],[Origem]]&\" - \"&BMVT[[#This Row],[Destino]]),\"\",BMVT[[#This Row],[Origem]]&\" - \"&BMVT[[#This Row],[Destino]])","v":""}]
[{"$f":"\"Salvador, \"&TEXT(TODAY(),\"dd/mm/aaaa\")","v":"Salvador, 29/06/2016"},null,null,null,null,null,{"$f":"A77","v":"Salvador, 29/06/2016"},null,null,null,null,null,null,null,null,null,null,null,null,null,{"$f":"IF(ISERROR(BMVT[[#This Row],[Origem]]&\" - \"&BMVT[[#This Row],[Destino]]),\"\",BMVT[[#This Row],[Origem]]&\" - \"&BMVT[[#This Row],[Destino]])","v":""}]
[null,null,null,null,null,null,null,null,null,null,null,null,null,null,null,null,null,null,null,null,{"$f":"IF(ISERROR(BMVT[[#This Row],[Origem]]&\" - \"&BMVT[[#This Row],[Destino]]),\"\",BMVT[[#This Row],[Origem]]&\" - \"&BMVT[[#This Row],[Destino]])","v":""}]
[null,null,null,null,null,null,null,null,null,null,null,null,null,null,null,null,null,null,null,null,{"$f":"IF(ISERROR(BMVT[[#This Row],[Origem]]&\" - \"&BMVT[[#This Row],[Destino]]),\"\",BMVT[[#This Row],[Origem]]&\" - \"&BMVT[[#This Row],[Destino]])","v":""}]
[]
["Responsável pelo Boletim de Medição",null,null,null,null,null,"Gerente Serviço de Pessoal de Salvador -SSPE"]

{"sheet":"Recibo","index":1,"n_rows":99,"n_cols":17,"rows_kept":99,"cut":false,"hidden":false,"merged":[[42,1,42,2],[15,1,18,11],[10,1,10,11],[42,4,42,11],[52,1,52,2]]}
[]
[null,null,null,null,null,14]
[{"$f":"LOOKUP(9.99999999999999E+307,$A$5:A97)","v":0}]
[null,"Empresa",{"$f":"VLOOKUP(INDEX(Empresas!$A$4:$J$17,Recibo!$F$2,1),Empresas!$A$4:$J$17,2,FALSE)","v":"Vera Cruz Transportes"}]
[0,"CNPJ",{"$f":"VLOOKUP(INDEX(Empresas!$A$4:$J$17,Recibo!$F$2,1),Empresas!$A$4:$J$17,6,FALSE)","v":"00.613.277/0001-90"},null,null,null,null,null,null,null,null,null,null,null,null,null,"Trechos"]
[{"$f":"IF(ISNUMBER(MATCH(BMVT[[#This Row],[Empresa]],$C$4,0)),LOOKUP(9.99999999999999E+307,$A$5:A5)+1,\"\")","v":""},"Endereço",{"$f":"VLOOKUP(INDEX(Empresas!$A$4:$J$17,Recibo!$F$2,1),Empresas!$A$4:$J$17,3,FALSE)","v":"Rua José Eloi, 14, Jaburu"},null,null,null,null,null,null,null,null,null,null,null,null,null,{"$f":"IF(COUNTA($A$6:A6)>$A$3,\"\",LOOKUP(COUNTA($A$6:A6),A6:$A$80,BMVT!U6:$U$78))","v":""}]
[{"$f":"IF(ISNUMBER(MATCH(BMVT[[#This Row],[Empresa]],$C$4,0)),LOOKUP(9.99999999999999E+307,$A$5:A6)+1,\"\")","v":""},"Cidade",{"$f":"VLOOKUP(INDEX(Empresas!$A$4:$J$17,Recibo!$F$2,1),Empresas!$A$4:$J$17,4,FALSE)","v":"Vera Cruz"},null,null,null,null,null,null,null,null,null,null,null,null,null,{"$f":"IF(COUNTA($A$6:A7)>$A$3,\"\",LOOKUP(COUNTA($A$6:A7),A7:$A$80,BMVT!U7:$U$78))","v":""}]
[{"$f":"IF(ISNUMBER(MATCH(BMVT[[#This Row],[Empresa]],$C$4,0)),LOOKUP(9.99999999999999E+307,$A$5:A7)+1,\"\")","v":""},"UF",{"$f":"VLOOKUP(INDEX(Empresas!$A$4:$J$17,Recibo!$F$2,1),Empresas!$A$4:$J$17,5,FALSE)","v":"Bahia"},null,null,null,null,null,null,null,null,null,null,null,null,null,{"$f":"IF(COUNTA($A$6:A8)>$A$3,\"\",LOOKUP(COUNTA($A$6:A8),A8:$A$80,BMVT!U8:$U$78))","v":""}]
[{"$f":"IF(ISNUMBER(MATCH(BMVT[[#This Row],[Empresa]],$C$4,0)),LOOKUP(9.99999999999999E+307,$A$5:A8)+1,\"\")","v":""},null,null,null,null,null,null,null,null,null,null,null,null,null,null,null,{"$f":"IF(COUNTA($A$6:A9)>$A$3,\"\",LOOKUP(COUNTA($A$6:A9),A9:$A$80,BMVT!U9:$U$78))","v":""}]
[{"$f":"IF(ISNUMBER(MATCH(BMVT[[#This Row],[Empresa]],$C$4,0)),LOOKUP(9.99999999999999E+307,$A$5:A9)+1,\"\")","v":""},null,null,null,null,null,null,null,null,null,null,null,null,null,null,null,{"$f":"IF(COUNTA($A$6:A10)>$A$3,\"\",LOOKUP(COUNTA($A$6:A10),A10:$A$80,BMVT!U10:$U$78))","v":""}]
[{"$f":"IF(ISNUMBER(MATCH(BMVT[[#This Row],[Empresa]],$C$4,0)),LOOKUP(9.99999999999999E+307,$A$5:A10)+1,\"\")","v":""},"Recibo Provisório",null,null,null,null,null,null,null,null,null,null,null,null,null,null,{"$f":"IF(COUNTA($A$6:A11)>$A$3,\"\",LOOKUP(COUNTA($A$6:A11),A11:$A$80,BMVT!U11:$U$78))","v":""}]
[{"$f":"IF(ISNUMBER(MATCH(BMVT[[#This Row],[Empresa]],$C$4,0)),LOOKUP(9.99999999999999E+307,$A$5:A11)+1,\"\")","v":""},null,null,null,null,null,null,null,null,null,null,null,null,null,null,null,{"$f":"IF(COUNTA($A$6:A12)>$A$3,\"\",LOOKUP(COUNTA($A$6:A12),A12:$A$80,BMVT!U12:$U$78))","v":""}]
[{"$f":"IF(ISNUMBER(MATCH(BMVT[[#This Row],[Empresa]],$C$4,0)),LOOKUP(9.99999999999999E+307,$A$5:A12)+1,\"\")","v":""},null,null,null,null,null,null,null,null,null,null,null,null,null,null,null,{"$f":"IF(COUNTA($A$6:A13)>$A$3,\"\",LOOKUP(COUNTA($A$6:A13),A13:$A$80,BMVT!U13:$U$78))","v":""}]
[{"$f":"IF(ISNUMBER(MATCH(BMVT[[#This Row],[Empresa]],$C$4,0)),LOOKUP(9.99999999999999E+307,$A$5:A13)+1,\"\")","v":""},"A receber de:",null,null,null,null,null,null,null,null,null,null,null,null,null,null,{"$f":"IF(COUNTA($A$6:A14)>$A$3,\"\",LOOKUP(COUNTA($A$6:A14),A14:$A$80,BMVT!U14:$U$78))","v":""}]
[{"$f":"IF(ISNUMBER(MATCH(BMVT[[#This Row],[Empresa]],$C$4,0)),LOOKUP(9.99999999999999E+307,$A$5:A14)+1,\"\")","v":""},null,null,null,null,null,null,null,null,null,null,null,null,null,null,null,{"$f":"IF(COUNTA($A$6:A15)>$A$3,\"\",LOOKUP(COUNTA($A$6:A15),A15:$A$80,BMVT!U15:$U$78))","v":""}]
[{"$f":"IF(ISNUMBER(MATCH(BMVT[[#This Row],[Empresa]],$C$4,0)),LOOKUP(9.99999999999999E+307,$A$5:A15)+1,\"\")","v":""},{"$f":"\"Companhia Hidro Elétrica do São Francisco - Chesf, situada na Avenida São Rafael s/n, bairro de São Marcos, inscrita sob o CNPJ 33.541.368.0004/69, a importância equivalente a \"&TEXT(B76,\"R$ #.##0,00\")&\" (\"&Extenso_Valor(SUMIF(BMVT[[#All],[Empresa]],C4,BMVT[[#All],[Vlr. Total]]))&\") referente a compra de \"&SUMIF(BMVT[[#All],[Empresa]],C4,BMVT[[#All],[Qtd. Solic.]])&\" vales destinados ao mês de \"&TEXT(BMVT!D2,\"mmmm/aaaa\")&\" \"&YEAR(TODAY())&\" para as seguintes linhas:\"","v":"Companhia Hidro Elétrica do São Francisco - Chesf, situada na Avenida São Rafael s/n, bairro de São Marcos, inscrita sob o CNPJ 33.541.368.0004/69, a importância equivalente a R$ 0,00 () referente a compra de 0 vales destinados ao mês de Julho 2016 para as seguintes linhas:"},null,null,null,null,null,null,null,null,null,null,null,null,null,null,{"$f":"IF(COUNTA($A$6:A16)>$A$3,\"\",LOOKUP(COUNTA($A$6:A16),A16:$A$80,BMVT!U16:$U$78))","v":""}]
[{"$f":"IF(ISNUMBER(MATCH(BMVT[[#This Row],[Empresa]],$C$4,0)),LOOKUP(9.99999999999999E+307,$A$5:A16)+1,\"\")","v":""},null,null,null,null,null,null,null,null,null,null,null,null,null,null,null,{"$f":"IF(COUNTA($A$6:A17)>$A$3,\"\",LOOKUP(COUNTA($A$6:A17),A17:$A$80,BMVT!U17:$U$78))","v":""}]
[{"$f":"IF(ISNUMBER(MATCH(BMVT[[#This Row],[Empresa]],$C$4,0)),LOOKUP(9.99999999999999E+307,$A$5:A17)+1,\"\")","v":""},null,null,null,null,null,null,null,null,null,null,null,null,null,null,null,{"$f":"IF(COUNTA($A$6:A18)>$A$3,\"\",LOOKUP(COUNTA($A$6:A18),A18:$A$80,BMVT!U17:$U$78))","v":""}]
[{"$f":"IF(ISNUMBER(MATCH(BMVT[[#This Row],[Empresa]],$C$4,0)),LOOKUP(9.99999999999999E+307,$A$5:A18)+1,\"\")","v":""},null,null,null,null,null,null,null,null,null,null,null,null,null,null,null,{"$f":"IF(COUNTA($A$6:A19)>$A$3,\"\",LOOKUP(COUNTA($A$6:A19),A19:$A$80,BMVT!U18:$U$78))","v":""}]
[{"$f":"IF(ISNUMBER(MATCH(BMVT[[#This Row],[Empresa]],$C$4,0)),LOOKUP(9.99999999999999E+307,$A$5:A19)+1,\"\")","v":""},"Origem - Destino",null,null,null,null,null,null,null,null,null,null,null,null,{"$f":"IF(ISNUMBER(MATCH(BMVT[[#This Row],[Empresa]],$C$4,0)),LOOKUP(9.99999999999999E+307,$A$6:A16)+1,\"\")","v":""},null,{"$f":"IF(COUNTA($A$6:A20)>$A$3,\"\",LOOKUP(COUNTA($A$6:A20),A20:$A$80,BMVT!U19:$U$78))","v":""}]
[{"$f":"IF(ISNUMBER(MATCH(BMVT[[#This Row],[Empresa]],$C$4,0)),LOOKUP(9.99999999999999E+307,$A$5:A20)+1,\"\")","v":""},{"$f":"IFERROR(INDEX($Q$6:$Q$80, MATCH(0, COUNTIF($B$20:B20, $Q$6:$Q$80), 0)),\"\")","v":""},null,null,null,null,null,null,null,null,null,null,null,null,{"$f":"IF(ISNUMBER(MATCH(BMVT[[#This Row],[Empresa]],$C$4,0)),LOOKUP(9.99999999999999E+307,$A$6:A17)+1,\"\")","v":""},{"$f":"IF(COUNTA($A$6:A6)>$A$4,\"\",LOOKUP(COUNTA($A$6:A6),A6:$A$21,BMVT!T6:$T$19))","v":""},{"$f":"IF(COUNTA($A$6:A21)>$A$3,\"\",LOOKUP(COUNTA($A$6:A21),A21:$A$80,BMVT!U20:$U$78))","v":""}]
[{"$f":"IF(ISNUMBER(MATCH(BMVT[[#This Row],[Empresa]],$C$4,0)),LOOKUP(9.99999999999999E+307,$A$5:A21)+1,\"\")","v":""},{"$f":"IFERROR(INDEX($Q$6:$Q$80, MATCH(0, COUNTIF($B$20:B21, $Q$6:$Q$80), 0)),\"\")","v":""},null,null,null,null,null,null,null,null,null,null,null,null,{"$f":"IF(ISNUMBER(MATCH(BMVT[[#This Row],[Empresa]],$C$4,0)),LOOKUP(9.99999999999999E+307,$A$6:A18)+1,\"\")","v":""},{"$f":"IF(COUNTA($A$6:A7)>$A$4,\"\",LOOKUP(COUNTA($A$6:A7),A7:$A$21,BMVT!T7:$T$19))","v":""},{"$f":"IF(COUNTA($A$6:A22)>$A$3,\"\",LOOKUP(COUNTA($A$6:A22),A22:$A$80,BMVT!U21:$U$78))","v":""}]
[{"$f":"IF(ISNUMBER(MATCH(BMVT[[#This Row],[Empresa]],$C$4,0)),LOOKUP(9.99999999999999E+307,$A$5:A22)+1,\"\")","v":""},{"$f":"IFERROR(INDEX($Q$6:$Q$80, MATCH(0, COUNTIF($B$20:B22, $Q$6:$Q$80), 0)),\"\")","v":""},null,null,null,null,null,null,null,null,null,null,null,null,{"$f":"IF(ISNUMBER(MATCH(BMVT[[#This Row],[Empresa]],$C$4,0)),LOOKUP(9.99999999999999E+307,$A$6:A19)+1,\"\")","v":""},{"$f":"IF(COUNTA($A$6:A8)>$A$4,\"\",LOOKUP(COUNTA($A$6:A8),A8:$A$21,BMVT!T8:$T$19))","v":""},{"$f":"IF(COUNTA($A$6:A23)>$A$3,\"\",LOOKUP(COUNTA($A$6:A23),A23:$A$80,BMVT!U22:$U$78))","v":""}]
[{"$f":"IF(ISNUMBER(MATCH(BMVT[[#This Row],[Empresa]],$C$4,0)),LOOKUP(9.99999999999999E+307,$A$5:A23)+1,\"\")","v":""},{"$f":"IFERROR(INDEX($Q$6:$Q$80, MATCH(0, COUNTIF($B$20:B23, $Q$6:$Q$80), 0)),\"\")","v":""},null,null,null,null,null,null,null,null,null,null,null,null,{"$f":"IF(ISNUMBER(MATCH(BMVT[[#This Row],[Empresa]],$C$4,0)),LOOKUP(9.99999999999999E+307,$A$6:A20)+1,\"\")","v":""},{"$f":"IF(COUNTA($A$6:A9)>$A$4,\"\",LOOKUP(COUNTA($A$6:A9),A9:$A$21,BMVT!T9:$T$19))","v":""},{"$f":"IF(COUNTA($A$6:A24)>$A$3,\"\",LOOKUP(COUNTA($A$6:A24),A24:$A$80,BMVT!U23:$U$78))","v":""}]
[{"$f":"IF(ISNUMBER(MATCH(BMVT[[#This Row],[Empresa]],$C$4,0)),LOOKUP(9.99999999999999E+307,$A$5:A24)+1,\"\")","v":""},{"$f":"IFERROR(INDEX($Q$6:$Q$80, MATCH(0, COUNTIF($B$20:B24, $Q$6:$Q$80), 0)),\"\")","v":""},null,null,null,null,null,null,null,null,null,null,null,null,{"$f":"IF(ISNUMBER(MATCH(BMVT[[#This Row],[Empresa]],$C$4,0)),LOOKUP(9.99999999999999E+307,$A$6:A21)+1,\"\")","v":""},{"$f":"IF(COUNTA($A$6:A10)>$A$4,\"\",LOOKUP(COUNTA($A$6:A10),A10:$A$21,BMVT!T10:$T$19))","v":""},{"$f":"IF(COUNTA($A$6:A25)>$A$3,\"\",LOOKUP(COUNTA($A$6:A25),A25:$A$80,BMVT!U24:$U$78))","v":""}]
[{"$f":"IF(ISNUMBER(MATCH(BMVT[[#This Row],[Empresa]],$C$4,0)),LOOKUP(9.99999999999999E+307,$A$5:A25)+1,\"\")","v":""},{"$f":"IFERROR(INDEX($Q$6:$Q$80, MATCH(0, COUNTIF($B$20:B25, $Q$6:$Q$80), 0)),\"\")","v":""},null,{"$f":"IF(COUNTA($A$6:A11)>$A$4,\"\",LOOKUP(COUNTA($A$6:A11),A11:$A$21,BMVT!I9:$I$17))","v":""},null,null,null,null,null,null,null,null,null,null,{"$f":"IF(ISNUMBER(MATCH(BMVT[[#This Row],[Empresa]],$C$4,0)),LOOKUP(9.99999999999999E+307,$A$6:A22)+1,\"\")","v":""},{"$f":"IF(COUNTA($A$6:A11)>$A$4,\"\",LOOKUP(COUNTA($A$6:A11),A11:$A$21,BMVT!T11:$T$19))","v":""},{"$f":"IF(COUNTA($A$6:A26)>$A$3,\"\",LOOKUP(COUNTA($A$6:A26),A26:$A$80,BMVT!U25:$U$78))","v":""}]
[{"$f":"IF(ISNUMBER(MATCH(BMVT[[#This Row],[Empresa]],$C$4,0)),LOOKUP(9.99999999999999E+307,$A$5:A26)+1,\"\")","v":""},{"$f":"IFERROR(INDEX($Q$6:$Q$80, MATCH(0, COUNTIF($B$20:B26, $Q$6:$Q$80), 0)),\"\")","v":""},null,{"$f":"IF(COUNTA($A$6:A12)>$A$4,\"\",LOOKUP(COUNTA($A$6:A12),A12:$A$21,BMVT!I10:$I$17))","v":""},null,null,null,null,null,null,null,null,null,null,{"$f":"IF(ISNUMBER(MATCH(BMVT[[#This Row],[Empresa]],$C$4,0)),LOOKUP(9.99999999999999E+307,$A$6:A23)+1,\"\")","v":""},{"$f":"IF(COUNTA($A$6:A12)>$A$4,\"\",LOOKUP(COUNTA($A$6:A12),A12:$A$21,BMVT!T12:$T$19))","v":""},{"$f":"IF(COUNTA($A$6:A27)>$A$3,\"\",LOOKUP(COUNTA($A$6:A27),A27:$A$80,BMVT!U26:$U$78))","v":""}]
[{"$f":"IF(ISNUMBER(MATCH(BMVT[[#This Row],[Empresa]],$C$4,0)),LOOKUP(9.99999999999999E+307,$A$5:A27)+1,\"\")","v":""},"O pagamento deverá ser efetuado através de depósito bancário na conta corrente descrita",null,null,null,null,null,null,null,null,null,null,null,null,null,null,{"$f":"IF(COUNTA($A$6:A28)>$A$3,\"\",LOOKUP(COUNTA($A$6:A28),A28:$A$80,BMVT!U27:$U$78))","v":""}]
[{"$f":"IF(ISNUMBER(MATCH(BMVT[[#This Row],[Empresa]],$C$4,0)),LOOKUP(9.99999999999999E+307,$A$5:A28)+1,\"\")","v":""}," abaixo:",null,null,null,null,null,null,null,null,null,null,null,null,null,null,{"$f":"IF(COUNTA($A$6:A29)>$A$3,\"\",LOOKUP(COUNTA($A$6:A29),A29:$A$80,BMVT!U28:$U$78))","v":""}]
[{"$f":"IF(ISNUMBER(MATCH(BMVT[[#This Row],[Empresa]],$C$4,0)),LOOKUP(9.99999999999999E+307,$A$5:A29)+1,\"\")","v":""},"Titular",{"$f":"VLOOKUP(INDEX(Empresas!$A$4:$J$17,Recibo!$F$2,1),Empresas!$A$4:$J$17,7,FALSE)","v":"Vera Cruz Transportes e Serviços Marítimos Ltda"},null,null,null,null,null,null,null,null,null,null,null,null,null,{"$f":"IF(COUNTA($A$6:A30)>$A$3,\"\",LOOKUP(COUNTA($A$6:A30),A30:$A$80,BMVT!U29:$U$78))","v":""}]
[{"$f":"IF(ISNUMBER(MATCH(BMVT[[#This Row],[Empresa]],$C$4,0)),LOOKUP(9.99999999999999E+307,$A$5:A30)+1,\"\")","v":""},"Banco",{"$f":"VLOOKUP(INDEX(Empresas!$A$4:$J$17,Recibo!$F$2,1),Empresas!$A$4:$J$17,8,FALSE)","v":"Banco do Brasil"},null,null,null,null,null,null,null,null,null,null,null,null,null,{"$f":"IF(COUNTA($A$6:A31)>$A$3,\"\",LOOKUP(COUNTA($A$6:A31),A31:$A$80,BMVT!U30:$U$78))","v":""}]
[{"$f":"IF(ISNUMBER(MATCH(BMVT[[#This Row],[Empresa]],$C$4,0)),LOOKUP(9.99999999999999E+307,$A$5:A31)+1,\"\")","v":""},"Agência",{"$f":"VLOOKUP(INDEX(Empresas!$A$4:$J$17,Recibo!$F$2,1),Empresas!$A$4:$J$17,9,FALSE)","v":"3921-7"},null,null,null,null,null,null,null,null,null,null,null,null,null,{"$f":"IF(COUNTA($A$6:A32)>$A$3,\"\",LOOKUP(COUNTA($A$6:A32),A32:$A$80,BMVT!U31:$U$78))","v":""}]
[{"$f":"IF(ISNUMBER(MATCH(BMVT[[#This Row],[Empresa]],$C$4,0)),LOOKUP(9.99999999999999E+307,$A$5:A32)+1,\"\")","v":""},"C/C",{"$f":"VLOOKUP(INDEX(Empresas!$A$4:$J$17,Recibo!$F$2,1),Empresas!$A$4:$J$17,10,FALSE)","v":"5738-X"},null,null,null,null,null,null,null,null,null,null,null,null,null,{"$f":"IF(COUNTA($A$6:A33)>$A$3,\"\",LOOKUP(COUNTA($A$6:A33),A33:$A$80,BMVT!U32:$U$78))","v":""}]
[{"$f":"IF(ISNUMBER(MATCH(BMVT[[#This Row],[Empresa]],$C$4,0)),LOOKUP(9.99999999999999E+307,$A$5:A33)+1,\"\")","v":""},null,null,null,null,null,null,null,null,null,null,null,null,null,null,null,{"$f":"IF(COUNTA($A$6:A34)>$A$3,\"\",LOOKUP(COUNTA($A$6:A34),A34:$A$80,BMVT!U33:$U$78))","v":""}]
[{"$f":"IF(ISNUMBER(MATCH(BMVT[[#This Row],[Empresa]],$C$4,0)),LOOKUP(9.99999999999999E+307,$A$5:A34)+1,\"\")","v":""},"Obs.O recibo definitivo será retirado quando da comprovação de efetivo pagamento.",null,null,null,null,null,null,null,null,null,null,null,null,null,null,{"$f":"IF(COUNTA($A$6:A35)>$A$3,\"\",LOOKUP(COUNTA($A$6:A35),A35:$A$80,BMVT!U34:$U$78))","v":""}]
[{"$f":"IF(ISNUMBER(MATCH(BMVT[[#This Row],[Empresa]],$C$4,0)),LOOKUP(9.99999999999999E+307,$A$5:A35)+1,\"\")","v":""},null,null,null,null,null,null,null,null,null,null,null,null,null,null,null,{"$f":"IF(COUNTA($A$6:A36)>$A$3,\"\",LOOKUP(COUNTA($A$6:A36),A36:$A$80,BMVT!U35:$U$78))","v":""}]
[{"$f":"IF(ISNUMBER(MATCH(BMVT[[#This Row],[Empresa]],$C$4,0)),LOOKUP(9.99999999999999E+307,$A$5:A36)+1,\"\")","v":""},null,null,null,null,null,null,null,null,null,null,null,null,null,null,null,{"$f":"IF(COUNTA($A$6:A37)>$A$3,\"\",LOOKUP(COUNTA($A$6:A37),A37:$A$80,BMVT!U36:$U$78))","v":""}]
[{"$f":"IF(ISNUMBER(MATCH(BMVT[[#This Row],[Empresa]],$C$4,0)),LOOKUP(9.99999999999999E+307,$A$5:A37)+1,\"\")","v":""},null,null,null,null,null,null,null,null,null,null,null,null,null,null,null,{"$f":"IF(COUNTA($A$6:A38)>$A$3,\"\",LOOKUP(COUNTA($A$6:A38),A38:$A$80,BMVT!U37:$U$78))","v":""}]
[{"$f":"IF(ISNUMBER(MATCH(BMVT[[#This Row],[Empresa]],$C$4,0)),LOOKUP(9.99999999999999E+307,$A$5:A38)+1,\"\")","v":""},"Salvador,",{"$f":"TODAY()","v":"2016-06-29"},null,null,null,null,null,null,null,null,null,null,null,null,null,{"$f":"IF(COUNTA($A$6:A39)>$A$3,\"\",LOOKUP(COUNTA($A$6:A39),A39:$A$80,BMVT!U38:$U$78))","v":""}]
[{"$f":"IF(ISNUMBER(MATCH(BMVT[[#This Row],[Empresa]],$C$4,0)),LOOKUP(9.99999999999999E+307,$A$5:A39)+1,\"\")","v":""},null,null,null,null,null,null,null,null,null,null,null,null,null,null,null,{"$f":"IF(COUNTA($A$6:A40)>$A$3,\"\",LOOKUP(COUNTA($A$6:A40),A40:$A$80,BMVT!U39:$U$78))","v":""}]
[{"$f":"IF(ISNUMBER(MATCH(BMVT[[#This Row],[Empresa]],$C$4,0)),LOOKUP(9.99999999999999E+307,$A$5:A40)+1,\"\")","v":""},null,null,null,null,null,null,null,null,null,null,null,null,null,null,null,{"$f":"IF(COUNTA($A$6:A41)>$A$3,\"\",LOOKUP(COUNTA($A$6:A41),A41:$A$80,BMVT!U40:$U$78))","v":""}]
[{"$f":"IF(ISNUMBER(MATCH(BMVT[[#This Row],[Empresa]],$C$4,0)),LOOKUP(9.99999999999999E+307,$A$5:A41)+1,\"\")","v":""},null,null,null,null,null,null,null,null,null,null,null,null,null,null,null,{"$f":"IF(COUNTA($A$6:A42)>$A$3,\"\",LOOKUP(COUNTA($A$6:A42),A42:$A$80,BMVT!U41:$U$78))","v":""}]
[{"$f":"IF(ISNUMBER(MATCH(BMVT[[#This Row],[Empresa]],$C$4,0)),LOOKUP(9.99999999999999E+307,$A$5:A42)+1,\"\")","v":""},"Responsável pelo Boletim de Medição",null,null,"Gerente Serviço de Pessoal de Salvador -SSPE",null,null,null,null,null,null,null,null,null,null,null,{"$f":"IF(COUNTA($A$6:A43)>$A$3,\"\",LOOKUP(COUNTA($A$6:A43),A43:$A$80,BMVT!U42:$U$78))","v":""}]
[{"$f":"IF(ISNUMBER(MATCH(BMVT[[#This Row],[Empresa]],$C$4,0)),LOOKUP(9.99999999999999E+307,$A$5:A43)+1,\"\")","v":""},null,null,null,null,null,null,null,null,null,null,null,null,null,null,null,{"$f":"IF(COUNTA($A$6:A44)>$A$3,\"\",LOOKUP(COUNTA($A$6:A44),A44:$A$80,BMVT!U43:$U$78))","v":""}]
[{"$f":"IF(ISNUMBER(MATCH(BMVT[[#This Row],[Empresa]],$C$4,0)),LOOKUP(9.99999999999999E+307,$A$5:A44)+1,\"\")","v":""},null,null,null,null,null,null,null,null,null,null,null,null,null,null,null,{"$f":"IF(COUNTA($A$6:A45)>$A$3,\"\",LOOKUP(COUNTA($A$6:A45),A45:$A$80,BMVT!U44:$U$78))","v":""}]
[{"$f":"IF(ISNUMBER(MATCH(BMVT[[#This Row],[Empresa]],$C$4,0)),LOOKUP(9.99999999999999E+307,$A$5:A45)+1,\"\")","v":""},null,null,null,null,null,null,null,null,null,null,null,null,null,null,null,{"$f":"IF(COUNTA($A$6:A46)>$A$3,\"\",LOOKUP(COUNTA($A$6:A46),A46:$A$80,BMVT!U45:$U$78))","v":""}]
[{"$f":"IF(ISNUMBER(MATCH(BMVT[[#This Row],[Empresa]],$C$4,0)),LOOKUP(9.99999999999999E+307,$A$5:A46)+1,\"\")","v":""},null,null,null,null,null,null,null,null,null,null,null,null,null,null,null,{"$f":"IF(COUNTA($A$6:A47)>$A$3,\"\",LOOKUP(COUNTA($A$6:A47),A47:$A$80,BMVT!U46:$U$78))","v":""}]
[{"$f":"IF(ISNUMBER(MATCH(BMVT[[#This Row],[Empresa]],$C$4,0)),LOOKUP(9.99999999999999E+307,$A$5:A47)+1,\"\")","v":""},null,null,null,null,null,null,null,null,null,null,null,null,null,null,null,{"$f":"IF(COUNTA($A$6:A48)>$A$3,\"\",LOOKUP(COUNTA($A$6:A48),A48:$A$80,BMVT!U47:$U$78))","v":""}]
[{"$f":"IF(ISNUMBER(MATCH(BMVT[[#This Row],[Empresa]],$C$4,0)),LOOKUP(9.99999999999999E+307,$A$5:A48)+1,\"\")","v":""},null,null,null,null,null,null,null,null,null,null,null,null,null,null,null,{"$f":"IF(COUNTA($A$6:A49)>$A$3,\"\",LOOKUP(COUNTA($A$6:A49),A49:$A$80,BMVT!U48:$U$78))","v":""}]
[{"$f":"IF(ISNUMBER(MATCH(BMVT[[#This Row],[Empresa]],$C$4,0)),LOOKUP(9.99999999999999E+307,$A$5:A49)+1,\"\")","v":""},null,null,null,null,null,null,null,null,null,null,null,null,null,null,null,{"$f":"IF(COUNTA($A$6:A50)>$A$3,\"\",LOOKUP(COUNTA($A$6:A50),A50:$A$80,BMVT!U49:$U$78))","v":""}]
[{"$f":"IF(ISNUMBER(MATCH(BMVT[[#This Row],[Empresa]],$C$4,0)),LOOKUP(9.99999999999999E+307,$A$5:A50)+1,\"\")","v":""},"À",null,null,null,null,null,null,null,null,null,null,null,null,null,null,{"$f":"IF(COUNTA($A$6:A51)>$A$3,\"\",LOOKUP(COUNTA($A$6:A51),A51:$A$80,BMVT!U50:$U$78))","v":""}]
[{"$f":"IF(ISNUMBER(MATCH(BMVT[[#This Row],[Empresa]],$C$4,0)),LOOKUP(9.99999999999999E+307,$A$5:A51)+1,\"\")","v":""},"ASV",null,null,null,null,null,null,null,null,null,null,null,null,null,null,{"$f":"IF(COUNTA($A$6:A52)>$A$3,\"\",LOOKUP(COUNTA($A$6:A52),A52:$A$80,BMVT!U51:$U$78))","v":""}]
[{"$f":"IF(ISNUMBER(MATCH(BMVT[[#This Row],[Empresa]],$C$4,0)),LOOKUP(9.99999999999999E+307,$A$5:A52)+1,\"\")","v":""},{"$f":"\"Pagamento de vales transportes da Rota \"&(B21)&\" para Empregado da Regional Sul, mês de  \"&BMVT!D2&\" \"&YEAR(TODAY())&\", conforme BMM anexo\"","v":"Pagamento de vales transportes da Rota  para Empregado da Regional Sul, mês de  Julho 2016, conforme BMM anexo"},null,null,null,null,null,null,null,null,null,null,null,null,null,null,{"$f":"IF(COUNTA($A$6:A53)>$A$3,\"\",LOOKUP(COUNTA($A$6:A53),A53:$A$80,BMVT!U52:$U$78))","v":""}]
[{"$f":"IF(ISNUMBER(MATCH(BMVT[[#This Row],[Empresa]],$C$4,0)),LOOKUP(9.99999999999999E+307,$A$5:A53)+1,\"\")","v":""},"IO – SSPE",null,null,null,null,null,null,null,null,null,null,null,null,null,null,{"$f":"IF(COUNTA($A$6:A54)>$A$3,\"\",LOOKUP(COUNTA($A$6:A54),A54:$A$80,BMVT!U53:$U$78))","v":""}]
[{"$f":"IF(ISNUMBER(MATCH(BMVT[[#This Row],[Empresa]],$C$4,0)),LOOKUP(9.99999999999999E+307,$A$5:A54)+1,\"\")","v":""},"CC – 157",null,null,null,null,null,null,null,null,null,null,null,null,null,null,{"$f":"IF(COUNTA($A$6:A55)>$A$3,\"\",LOOKUP(COUNTA($A$6:A55),A55:$A$80,BMVT!U54:$U$78))","v":""}]
[{"$f":"IF(ISNUMBER(MATCH(BMVT[[#This Row],[Empresa]],$C$4,0)),LOOKUP(9.99999999999999E+307,$A$5:A55)+1,\"\")","v":""},"NO - 06020000",null,null,null,null,null,null,null,null,null,null,null,null,null,null,{"$f":"IF(COUNTA($A$6:A56)>$A$3,\"\",LOOKUP(COUNTA($A$6:A56),A56:$A$80,BMVT!U55:$U$78))","v":""}]
[{"$f":"IF(ISNUMBER(MATCH(BMVT[[#This Row],[Empresa]],$C$4,0)),LOOKUP(9.99999999999999E+307,$A$5:A56)+1,\"\")","v":""},null,null,null,null,null,null,null,null,null,null,null,null,null,null,null,{"$f":"IF(COUNTA($A$6:A57)>$A$3,\"\",LOOKUP(COUNTA($A$6:A57),A57:$A$80,BMVT!U56:$U$78))","v":""}]
[{"$f":"IF(ISNUMBER(MATCH(BMVT[[#This Row],[Empresa]],$C$4,0)),LOOKUP(9.99999999999999E+307,$A$5:A57)+1,\"\")","v":""},null,null,null,null,null,null,null,null,null,null,null,null,null,null,null,{"$f":"IF(COUNTA($A$6:A58)>$A$3,\"\",LOOKUP(COUNTA($A$6:A58),A58:$A$80,BMVT!U57:$U$78))","v":""}]
[{"$f":"IF(ISNUMBER(MATCH(BMVT[[#This Row],[Empresa]],$C$4,0)),LOOKUP(9.99999999999999E+307,$A$5:A58)+1,\"\")","v":""},null,null,null,null,null,null,null,null,null,null,null,null,null,null,null,{"$f":"IF(COUNTA($A$6:A59)>$A$3,\"\",LOOKUP(COUNTA($A$6:A59),A59:$A$80,BMVT!U58:$U$78))","v":""}]
[{"$f":"IF(ISNUMBER(MATCH(BMVT[[#This Row],[Empresa]],$C$4,0)),LOOKUP(9.99999999999999E+307,$A$5:A59)+1,\"\")","v":""},null,null,null,null,null,null,null,null,null,null,null,null,null,null,null,{"$f":"IF(COUNTA($A$6:A60)>$A$3,\"\",LOOKUP(COUNTA($A$6:A60),A60:$A$80,BMVT!U59:$U$78))","v":""}]
[{"$f":"IF(ISNUMBER(MATCH(BMVT[[#This Row],[Empresa]],$C$4,0)),LOOKUP(9.99999999999999E+307,$A$5:A60)+1,\"\")","v":""},null,null,null,null,null,null,null,null,null,null,null,null,null,null,null,{"$f":"IF(COUNTA($A$6:A61)>$A$3,\"\",LOOKUP(COUNTA($A$6:A61),A61:$A$80,BMVT!U60:$U$78))","v":""}]
[{"$f":"IF(ISNUMBER(MATCH(BMVT[[#This Row],[Empresa]],$C$4,0)),LOOKUP(9.99999999999999E+307,$A$5:A61)+1,\"\")","v":""},null,null,null,null,null,null,null,null,null,null,null,null,null,null,null,{"$f":"IF(COUNTA($A$6:A62)>$A$3,\"\",LOOKUP(COUNTA($A$6:A62),A62:$A$80,BMVT!U61:$U$78))","v":""}]
[{"$f":"IF(ISNUMBER(MATCH(BMVT[[#This Row],[Empresa]],$C$4,0)),LOOKUP(9.99999999999999E+307,$A$5:A62)+1,\"\")","v":""},null,null,null,null,null,null,null,null,null,null,null,null,null,null,null,{"$f":"IF(COUNTA($A$6:A63)>$A$3,\"\",LOOKUP(COUNTA($A$6:A63),A63:$A$80,BMVT!U62:$U$78))","v":""}]
[{"$f":"IF(ISNUMBER(MATCH(BMVT[[#This Row],[Empresa]],$C$4,0)),LOOKUP(9.99999999999999E+307,$A$5:A63)+1,\"\")","v":""},null,null,null,null,null,null,null,null,null,null,null,null,null,null,null,{"$f":"IF(COUNTA($A$6:A64)>$A$3,\"\",LOOKUP(COUNTA($A$6:A64),A64:$A$80,BMVT!U63:$U$78))","v":""}]
[{"$f":"IF(ISNUMBER(MATCH(BMVT[[#This Row],[Empresa]],$C$4,0)),LOOKUP(9.99999999999999E+307,$A$5:A64)+1,\"\")","v":""},null,null,null,null,null,null,null,null,null,null,null,null,null,null,null,{"$f":"IF(COUNTA($A$6:A65)>$A$3,\"\",LOOKUP(COUNTA($A$6:A65),A65:$A$80,BMVT!U64:$U$78))","v":""}]
[{"$f":"IF(ISNUMBER(MATCH(BMVT[[#This Row],[Empresa]],$C$4,0)),LOOKUP(9.99999999999999E+307,$A$5:A65)+1,\"\")","v":""},null,null,null,null,null,null,null,null,null,null,null,null,null,null,null,{"$f":"IF(COUNTA($A$6:A66)>$A$3,\"\",LOOKUP(COUNTA($A$6:A66),A66:$A$80,BMVT!U65:$U$78))","v":""}]
[{"$f":"IF(ISNUMBER(MATCH(BMVT[[#This Row],[Empresa]],$C$4,0)),LOOKUP(9.99999999999999E+307,$A$5:A66)+1,\"\")","v":""},null,null,null,null,null,null,null,null,null,null,null,null,null,null,null,{"$f":"IF(COUNTA($A$6:A67)>$A$3,\"\",LOOKUP(COUNTA($A$6:A67),A67:$A$80,BMVT!U66:$U$78))","v":""}]
[{"$f":"IF(ISNUMBER(MATCH(BMVT[[#This Row],[Empresa]],$C$4,0)),LOOKUP(9.99999999999999E+307,$A$5:A67)+1,\"\")","v":""},null,null,null,null,null,null,null,null,null,null,null,null,null,null,null,{"$f":"IF(COUNTA($A$6:A68)>$A$3,\"\",LOOKUP(COUNTA($A$6:A68),A68:$A$80,BMVT!U67:$U$78))","v":""}]
[{"$f":"IF(ISNUMBER(MATCH(BMVT[[#This Row],[Empresa]],$C$4,0)),LOOKUP(9.99999999999999E+307,$A$5:A68)+1,\"\")","v":""},null,null,null,null,null,null,null,null,null,null,null,null,null,null,null,{"$f":"IF(COUNTA($A$6:A69)>$A$3,\"\",LOOKUP(COUNTA($A$6:A69),A69:$A$80,BMVT!U68:$U$78))","v":""}]
[{"$f":"IF(ISNUMBER(MATCH(BMVT[[#This Row],[Empresa]],$C$4,0)),LOOKUP(9.99999999999999E+307,$A$5:A69)+1,\"\")","v":""},null,null,null,null,null,null,null,null,null,null,null,null,null,null,null,{"$f":"IF(COUNTA($A$6:A70)>$A$3,\"\",LOOKUP(COUNTA($A$6:A70),A70:$A$80,BMVT!U69:$U$78))","v":""}]
[{"$f":"IF(ISNUMBER(MATCH(BMVT[[#This Row],[Empresa]],$C$4,0)),LOOKUP(9.99999999999999E+307,$A$5:A70)+1,\"\")","v":""},null,null,null,null,null,null,null,null,null,null,null,null,null,null,null,{"$f":"IF(COUNTA($A$6:A71)>$A$3,\"\",LOOKUP(COUNTA($A$6:A71),A71:$A$80,BMVT!U70:$U$78))","v":""}]
[{"$f":"IF(ISNUMBER(MATCH(BMVT[[#This Row],[Empresa]],$C$4,0)),LOOKUP(9.99999999999999E+307,$A$5:A71)+1,\"\")","v":""},null,null,null,null,null,null,null,null,null,null,null,null,null,null,null,{"$f":"IF(COUNTA($A$6:A72)>$A$3,\"\",LOOKUP(COUNTA($A$6:A72),A72:$A$80,BMVT!U71:$U$78))","v":""}]
[{"$f":"IF(ISNUMBER(MATCH(BMVT[[#This Row],[Empresa]],$C$4,0)),LOOKUP(9.99999999999999E+307,$A$5:A72)+1,\"\")","v":""},null,null,null,null,null,null,null,null,null,null,null,null,null,null,null,{"$f":"IF(COUNTA($A$6:A73)>$A$3,\"\",LOOKUP(COUNTA($A$6:A73),A73:$A$80,BMVT!U72:$U$78))","v":""}]
[{"$f":"IF(ISNUMBER(MATCH(BMVT[[#This Row],[Empresa]],$C$4,0)),LOOKUP(9.99999999999999E+307,$A$5:A73)+1,\"\")","v":""},null,null,null,null,null,null,null,null,null,null,null,null,null,null,null,{"$f":"IF(COUNTA($A$6:A74)>$A$3,\"\",LOOKUP(COUNTA($A$6:A74),A74:$A$80,BMVT!U73:$U$78))","v":""}]
[{"$f":"IF(ISNUMBER(MATCH(BMVT[[#This Row],[Empresa]],$C$4,0)),LOOKUP(9.99999999999999E+307,$A$5:A74)+1,\"\")","v":""},null,null,null,null,null,null,null,null,null,null,null,null,null,null,null,{"$f":"IF(COUNTA($A$6:A75)>$A$3,\"\",LOOKUP(COUNTA($A$6:A75),A75:$A$80,BMVT!U74:$U$78))","v":""}]
[{"$f":"IF(ISNUMBER(MATCH(BMVT[[#This Row],[Empresa]],$C$4,0)),LOOKUP(9.99999999999999E+307,$A$5:A75)+1,\"\")","v":""},{"$f":"SUMIF(BMVT[[#All],[Empresa]],C4,BMVT[[#All],[Vlr. Total]])","v":0},null,null,null,null,null,null,null,null,null,null,null,null,null,null,{"$f":"IF(COUNTA($A$6:A76)>$A$3,\"\",LOOKUP(COUNTA($A$6:A76),A76:$A$80,BMVT!U75:$U$78))","v":""}]
[{"$f":"IF(ISNUMBER(MATCH(BMVT[[#This Row],[Empresa]],$C$4,0)),LOOKUP(9.99999999999999E+307,$A$5:A76)+1,\"\")","v":""},null,null,null,null,null,null,null,null,null,null,null,null,null,null,null,{"$f":"IF(COUNTA($A$6:A77)>$A$3,\"\",LOOKUP(COUNTA($A$6:A77),A77:$A$80,BMVT!U76:$U$78))","v":""}]
[{"$f":"IF(ISNUMBER(MATCH(BMVT[[#This Row],[Empresa]],$C$4,0)),LOOKUP(9.99999999999999E+307,$A$5:A77)+1,\"\")","v":""},null,null,null,null,null,null,null,null,null,null,null,null,null,null,null,{"$f":"IF(COUNTA($A$6:A78)>$A$3,\"\",LOOKUP(COUNTA($A$6:A78),A78:$A$80,BMVT!U77:$U$78))","v":""}]
[{"$f":"IF(ISNUMBER(MATCH(BMVT[[#This Row],[Empresa]],$C$4,0)),LOOKUP(9.99999999999999E+307,$A$5:A78)+1,\"\")","v":""},null,null,null,null,null,null,null,null,null,null,null,null,null,null,null,{"$f":"IF(COUNTA($A$6:A79)>$A$3,\"\",LOOKUP(COUNTA($A$6:A79),A79:$A$80,BMVT!U78:$U$78))","v":""}]
[{"$f":"IF(ISNUMBER(MATCH(BMVT[[#This Row],[Empresa]],$C$4,0)),LOOKUP(9.99999999999999E+307,$A$5:A79)+1,\"\")","v":""},null,null,null,null,null,null,null,null,null,null,null,null,null,null,null,{"$f":"IF(COUNTA($A$6:A80)>$A$3,\"\",LOOKUP(COUNTA($A$6:A80),A80:$A$80,BMVT!U$78:$U79))","v":""}]
[null,null,null,null,null,null,null,null,null,null,null,null,null,null,null,null,{"$f":"IF(COUNTA($A$6:A66)>$A$3,\"\",LOOKUP(COUNTA($A$6:A66),A$20:$A66,BMVT!U65:$U$78))","v":""}]
[null,null,null,null,null,null,null,null,null,null,null,null,null,null,null,null,{"$f":"IF(COUNTA($A$6:A67)>$A$3,\"\",LOOKUP(COUNTA($A$6:A67),A$20:$A67,BMVT!U66:$U$78))","v":""}]
[null,null,null,null,null,null,null,null,null,null,null,null,null,null,null,null,{"$f":"IF(COUNTA($A$6:A68)>$A$3,\"\",LOOKUP(COUNTA($A$6:A68),A$20:$A68,BMVT!U67:$U$78))","v":""}]
[null,null,null,null,null,null,null,null,null,null,null,null,null,null,null,null,{"$f":"IF(COUNTA($A$6:A69)>$A$3,\"\",LOOKUP(COUNTA($A$6:A69),A$20:$A69,BMVT!U68:$U$78))","v":""}]
[null,null,null,null,null,null,null,null,null,null,null,null,null,null,null,null,{"$f":"IF(COUNTA($A$6:A70)>$A$3,\"\",LOOKUP(COUNTA($A$6:A70),A$20:$A70,BMVT!U69:$U$78))","v":""}]
[null,null,null,null,null,null,null,null,null,null,null,null,null,null,null,null,{"$f":"IF(COUNTA($A$6:A71)>$A$3,\"\",LOOKUP(COUNTA($A$6:A71),A$20:$A71,BMVT!U70:$U$78))","v":""}]
[null,null,null,null,null,null,null,null,null,null,null,null,null,null,null,null,{"$f":"IF(COUNTA($A$6:A72)>$A$3,\"\",LOOKUP(COUNTA($A$6:A72),A$20:$A72,BMVT!U71:$U$78))","v":""}]
[null,null,null,null,null,null,null,null,null,null,null,null,null,null,null,null,{"$f":"IF(COUNTA($A$6:A73)>$A$3,\"\",LOOKUP(COUNTA($A$6:A73),A$20:$A73,BMVT!U72:$U$78))","v":""}]
[null,null,null,null,null,null,null,null,null,null,null,null,null,null,null,null,{"$f":"IF(COUNTA($A$6:A74)>$A$3,\"\",LOOKUP(COUNTA($A$6:A74),A$20:$A74,BMVT!U73:$U$78))","v":""}]
[null,null,null,null,null,null,null,null,null,null,null,null,null,null,null,null,{"$f":"IF(COUNTA($A$6:A75)>$A$3,\"\",LOOKUP(COUNTA($A$6:A75),A$20:$A75,BMVT!U74:$U$78))","v":""}]
[null,null,null,null,null,null,null,null,null,null,null,null,null,null,null,null,{"$f":"IF(COUNTA($A$6:A76)>$A$3,\"\",LOOKUP(COUNTA($A$6:A76),A$20:$A76,BMVT!U75:$U$78))","v":""}]
[null,null,null,null,null,null,null,null,null,null,null,null,null,null,null,null,{"$f":"IF(COUNTA($A$6:A77)>$A$3,\"\",LOOKUP(COUNTA($A$6:A77),A$20:$A77,BMVT!U76:$U$78))","v":""}]
[null,null,null,null,null,null,null,null,null,null,null,null,null,null,null,null,{"$f":"IF(COUNTA($A$6:A78)>$A$3,\"\",LOOKUP(COUNTA($A$6:A78),A$20:$A78,BMVT!U77:$U$78))","v":""}]
[null,null,null,null,null,null,null,null,null,null,null,null,null,null,null,null,{"$f":"IF(COUNTA($A$6:A79)>$A$3,\"\",LOOKUP(COUNTA($A$6:A79),A$20:$A79,BMVT!U78:$U$78))","v":""}]
[null,null,null,null,null,null,null,null,null,null,null,null,null,null,null,null,{"$f":"IF(COUNTA($A$6:A80)>$A$3,\"\",LOOKUP(COUNTA($A$6:A80),A$20:$A80,BMVT!U$78:$U79))","v":""}]
[null,null,null,null,null,null,null,null,null,null,null,null,null,null,null,null,{"$f":"IF(COUNTA($A$6:A81)>$A$3,\"\",LOOKUP(COUNTA($A$6:A81),A$20:$A81,BMVT!U$78:$U80))","v":""}]
[null,null,null,null,null,null,null,null,null,null,null,null,null,null,null,null,{"$f":"IF(COUNTA($A$6:A82)>$A$3,\"\",LOOKUP(COUNTA($A$6:A82),A$20:$A82,BMVT!U$78:$U81))","v":""}]
[null,null,null,null,null,null,null,null,null,null,null,null,null,null,null,null,{"$f":"IF(COUNTA($A$6:A83)>$A$3,\"\",LOOKUP(COUNTA($A$6:A83),A$20:$A83,BMVT!U$78:$U82))","v":""}]
[null,null,null,null,null,null,null,null,null,null,null,null,null,null,null,null,{"$f":"IF(COUNTA($A$6:A84)>$A$3,\"\",LOOKUP(COUNTA($A$6:A84),A$20:$A84,BMVT!U$78:$U83))","v":""}]

{"sheet":"Julho","index":2,"n_rows":82,"n_cols":32,"rows_kept":82,"cut":false,"hidden":false,"merged":[[4,25,4,26],[4,27,4,29],[77,0,77,2],[0,0,2,2],[0,14,0,15],[1,3,2,3],[1,14,1,15],[2,14,2,15],[4,23,4,24]]}
["Boletim Mensal de Vales Transporte",null,null,"Competência:",null,"Dias Úteis (Mês):",{"$f":"VLOOKUP(INDEX($W$6:$AF$16,$W$5,1),$W$6:$AF$16,9,FALSE)","v":21},null,"SC (Empregado):",0,{"$f":"(SUMIFS(BMVT9[Vlr. Total],BMVT9[Vínculo],\"<>Aprendiz\",BMVT9[Empresa], \"Salvador Card\"))-J1","v":1300.2},null,null,"Qtd Usuários",{"$f":"SUMPRODUCT(SUBTOTAL(3,OFFSET(BMVT9[Matrícula],ROW(BMVT9[Matrícula])-ROW(A6),0,1)),--(BMVT9[Situação]=\"Regular\"))","v":24}]
[null,null,null,{"$f":"VLOOKUP(INDEX($W$6:$AF$16,$W$5,1),$W$6:$AF$16,1,FALSE)","v":"Julho"},null,"Compesações:",{"$f":"VLOOKUP(INDEX($W$6:$AF$16,$W$5,1),$W$6:$AF$16,10,FALSE)","v":0},null,"SC (Aprendiz):",0,{"$f":"(SUMIFS(BMVT9[Vlr. Total],BMVT9[Vínculo],\"Aprendiz\",BMVT9[Empresa],\"Salvador Card\"))-J2","v":0},null,null,"Qtd VT :",{"$f":"SUMPRODUCT(SUBTOTAL(9,OFFSET(BMVT9[Qtd. Solic.],ROW(BMVT9[Qtd. Solic.])-ROW(O6),0,1)),--(BMVT9[Situação]=\"Regular\"))","v":835}]
[null,null,null,null,null,"Desconto :",0,null,"Metropasse:",132,{"$f":"(SUMIF(BMVT9[Empresa],\"Metropasse\",BMVT9[Vlr. Total]))-J3","v":283.79999999999995},null,null,"Valor Total:",{"$f":"SUMPRODUCT(SUBTOTAL(9,OFFSET(BMVT9[Vlr. Total],ROW(BMVT9[Vlr. Total])-ROW(R6),0,1)),--(BMVT9[Situação]=\"Regular\"))","v":5932.1600000000017}]
[]
["Matrícula","Empregado","Vínculo","Lotação","Setor","Rota","Situação","Origem","Destino","Tipo","Empresa","Vales/Trecho","Chipagem","Quant. Apur.","Qtd. Solic.","Dias Lanc Sist.","Vlr. Unit.","Vlr. Total",null,null,"Trechos",null,7,"Período",null,"Feriados",null,"Compensações",null,null,"DU"]
["000.001","João","Anistiado","Salvador","ADMINISTRATIVO","xxxxx-Y","Regular","Dias D'Ávila","Camaçari","Intermunicipal","Cidade das Águas",2,2,42,42,21,2.8,117.6,null,null,{"$f":"IF(ISERROR(BMVT9[[#This Row],[Origem]]&\" - \"&BMVT9[[#This Row],[Destino]]),\"\",BMVT9[[#This Row],[Origem]]&\" - \"&BMVT9[[#This Row],[Destino]])","v":"Dias D'Ávila - Camaçari"},null,"Janeiro","2016-01-01","2016-01-31","2016-01-01",null,null,null,null,{"$f":"NETWORKDAYS(X6,Y6,Z6:AD6)","v":20},{"$f":"COUNTA(AB6:AD6)","v":0}]
["000.002","Maria","Anistiado","Salvador","ADMINISTRATIVO",23196,"Regular","Alagoinhas","Salvador","Intermunicipal","Cidade Sol",2,2,42,42,21,28.35,1190.7,null,null,{"$f":"IF(ISERROR(BMVT9[[#This Row],[Origem]]&\" - \"&BMVT9[[#This Row],[Destino]]),\"\",BMVT9[[#This Row],[Origem]]&\" - \"&BMVT9[[#This Row],[Destino]])","v":"Alagoinhas - Salvador"},null,"Fevereiro","2016-02-01","2016-02-29","2016-02-08",null,"2016-02-09","2016-02-10",null,{"$f":"NETWORKDAYS(X7,Y7,Z7:AD7)","v":18},{"$f":"COUNTA(AB7:AD7)","v":2}]
["000.003","Francisco","Anistiado","Salvador","ADMINISTRATIVO",23184,"Regular","Jequié","Ipiaú","Intermunicipal","Cidade Sol",2,2,42,48,24,10.65,511.20000000000005,null,null,{"$f":"IF(ISERROR(BMVT9[[#This Row],[Origem]]&\" - \"&BMVT9[[#This Row],[Destino]]),\"\",BMVT9[[#This Row],[Origem]]&\" - \"&BMVT9[[#This Row],[Destino]])","v":"Jequié - Ipiaú"},null,"Março","2016-03-01","2016-03-31","2016-03-25",null,"2016-03-24",null,null,{"$f":"NETWORKDAYS(X8,Y8,Z8:AD8)","v":21},1]
["000.004","Ricardo","Empregado","Salvador","ADMINISTRATIVO",23183,"Regular","Feira de Santana","Feira de Santana","Urbano","Via Feira",2,2,42,0,0,3.1,0,null,null,{"$f":"IF(ISERROR(BMVT9[[#This Row],[Origem]]&\" - \"&BMVT9[[#This Row],[Destino]]),\"\",BMVT9[[#This Row],[Origem]]&\" - \"&BMVT9[[#This Row],[Destino]])","v":"Feira de Santana - Feira de Santana"},null,"Abril","2016-04-01","2016-04-30","2016-04-21",null,"2016-01-22",null,null,20,1]
["000.005","Mauro","Empregado","Salvador","ADMINISTRATIVO",23183,"Regular","Feira de Santana","Feira de Santana","Urbano","Via Feira",2,2,42,42,21,3.1,130.20000000000002,null,null,{"$f":"IF(ISERROR(BMVT9[[#This Row],[Origem]]&\" - \"&BMVT9[[#This Row],[Destino]]),\"\",BMVT9[[#This Row],[Origem]]&\" - \"&BMVT9[[#This Row],[Destino]])","v":"Feira de Santana - Feira de Santana"},null,"Maio","2016-05-01","2016-05-31","2016-05-26",null,"2016-05-27",null,null,20,1]
["000.006","Marcio","Empregado","Salvador","ADMINISTRATIVO","23125-M","Regular","Conceição de Feira","Salvador","Intermunicipal","Viação Jauá",2,2,42,10,5,23.03,230.3,null,null,{"$f":"IF(ISERROR(BMVT9[[#This Row],[Origem]]&\" - \"&BMVT9[[#This Row],[Destino]]),\"\",BMVT9[[#This Row],[Origem]]&\" - \"&BMVT9[[#This Row],[Destino]])","v":"Conceição de Feira - Salvador"},null,"Junho","2016-06-01","2016-06-30",null,null,null,null,null,22,0]
["000.007","Carla","Empregado","Salvador","ADMINISTRATIVO","23125-M","Regular","Conceição de Feira","Salvador","Intermunicipal","Viação Jauá",2,2,42,42,21,23.03,967.26,null,null,{"$f":"IF(ISERROR(BMVT9[[#This Row],[Origem]]&\" - \"&BMVT9[[#This Row],[Destino]]),\"\",BMVT9[[#This Row],[Origem]]&\" - \"&BMVT9[[#This Row],[Destino]])","v":"Conceição de Feira - Salvador"},null,"Julho","2016-07-01","2016-07-31",null,null,null,null,null,21,0]
["000.008","Caroline","Empregado","Salvador","COMERCIAL","23190-V","Regular","Lauro de Freitas","Salvador","Intermunicipal","Metropasse",2,2,42,42,21,3.3,138.6,null,null,{"$f":"IF(ISERROR(BMVT9[[#This Row],[Origem]]&\" - \"&BMVT9[[#This Row],[Destino]]),\"\",BMVT9[[#This Row],[Origem]]&\" - \"&BMVT9[[#This Row],[Destino]])","v":"Lauro de Freitas - Salvador"},null,"Agosto","2016-08-01","2016-08-31",null,null,null,null,null,23,0]
["000.009","Pedro","Empregado","Salvador","COMERCIAL","23190-V","Regular","Lauro de Freitas","Salvador","Intermunicipal","Metropasse",2,2,42,0,0,3.3,0,null,null,{"$f":"IF(ISERROR(BMVT9[[#This Row],[Origem]]&\" - \"&BMVT9[[#This Row],[Destino]]),\"\",BMVT9[[#This Row],[Origem]]&\" - \"&BMVT9[[#This Row],[Destino]])","v":"Lauro de Freitas - Salvador"},null,"Setembro","2016-09-01","2016-09-30","2016-09-07",null,null,null,null,21,0]
["000.010","Paulo","Empregado","Salvador","COMERCIAL","23190-V","Regular","Lauro de Freitas","Salvador","Intermunicipal","Metropasse",2,2,42,42,21,3.3,138.6,null,null,{"$f":"IF(ISERROR(BMVT9[[#This Row],[Origem]]&\" - \"&BMVT9[[#This Row],[Destino]]),\"\",BMVT9[[#This Row],[Origem]]&\" - \"&BMVT9[[#This Row],[Destino]])","v":"Lauro de Freitas - Salvador"},null,"Outubro","2016-10-01","2016-10-31","2016-10-12",null,null,null,null,20,0]
["000.011","Rafael","Empregado","Salvador","COMERCIAL","23190-V","Regular","Lauro de Freitas","Salvador","Intermunicipal","Metropasse",2,2,42,42,21,3.3,138.6,null,null,{"$f":"IF(ISERROR(BMVT9[[#This Row],[Origem]]&\" - \"&BMVT9[[#This Row],[Destino]]),\"\",BMVT9[[#This Row],[Origem]]&\" - \"&BMVT9[[#This Row],[Destino]])","v":"Lauro de Freitas - Salvador"},null,"Novembro","2016-11-01","2016-11-30","2016-11-02","2016-11-15","2016-11-14",null,null,{"$f":"NETWORKDAYS(X16,Y16,Z16:AD16)","v":19},1]
["000.012","Ricardo","Empregado","Salvador","COMERCIAL","23170-I","Regular","Aracaju","Aracaju","Urbano","Aracaju Card",2,2,42,54,27,3.1,167.4,null,null,{"$f":"IF(ISERROR(BMVT9[[#This Row],[Origem]]&\" - \"&BMVT9[[#This Row],[Destino]]),\"\",BMVT9[[#This Row],[Origem]]&\" - \"&BMVT9[[#This Row],[Destino]])","v":"Aracaju - Aracaju"}]
["000.013","Jose","Empregado","Salvador","COMERCIAL","xxxxx-Y (Pool)","Regular","Feira de Santana","Camaçari","Intermunicipal","Lis Transportes",2,2,42,10,5,650,650,null,null,{"$f":"IF(ISERROR(BMVT9[[#This Row],[Origem]]&\" - \"&BMVT9[[#This Row],[Destino]]),\"\",BMVT9[[#This Row],[Origem]]&\" - \"&BMVT9[[#This Row],[Destino]])","v":"Feira de Santana - Camaçari"}]
["000.014","Felipe","Empregado","Salvador","COMERCIAL",23182,"Regular","Amélia Rodrigues","Governador Mangabeira","Intermunicipal","RD Transportes",2,2,42,25,12.5,10.06,251.5,null,null,{"$f":"IF(ISERROR(BMVT9[[#This Row],[Origem]]&\" - \"&BMVT9[[#This Row],[Destino]]),\"\",BMVT9[[#This Row],[Origem]]&\" - \"&BMVT9[[#This Row],[Destino]])","v":"Amélia Rodrigues - Governador Mangabeira"}]
["000.015","Julio","Empregado","Salvador","COMERCIAL","23101-A (09096)","Regular","Salvador","Salvador","Urbano","Salvador Card",2,4,42,42,10.5,3.3,138.6,null,null,{"$f":"IF(ISERROR(BMVT9[[#This Row],[Origem]]&\" - \"&BMVT9[[#This Row],[Destino]]),\"\",BMVT9[[#This Row],[Origem]]&\" - \"&BMVT9[[#This Row],[Destino]])","v":"Salvador - Salvador"}]
["000.016","Lucia","Empregado","Salvador","PESSOAL","23101-A (09096)","Regular","Salvador","Salvador","Urbano","Salvador Card",2,2,42,44,22,3.3,145.19999999999999,null,null,{"$f":"IF(ISERROR(BMVT9[[#This Row],[Origem]]&\" - \"&BMVT9[[#This Row],[Destino]]),\"\",BMVT9[[#This Row],[Origem]]&\" - \"&BMVT9[[#This Row],[Destino]])","v":"Salvador - Salvador"}]
["000.017","Luciano","Empregado","Salvador","PESSOAL","23101-A (09096)","Regular","Salvador","Salvador","Urbano","Salvador Card",0,0,0,0,0,3.3,0,null,null,{"$f":"IF(ISERROR(BMVT9[[#This Row],[Origem]]&\" - \"&BMVT9[[#This Row],[Destino]]),\"\",BMVT9[[#This Row],[Origem]]&\" - \"&BMVT9[[#This Row],[Destino]])","v":"Salvador - Salvador"}]
["000.018","Bruno","Empregado","Salvador","PESSOAL","23101-A (09096)","Regular","Salvador","Salvador","Urbano","Salvador Card",2,2,42,42,21,3.3,138.6,null,null,{"$f":"IF(ISERROR(BMVT9[[#This Row],[Origem]]&\" - \"&BMVT9[[#This Row],[Destino]]),\"\",BMVT9[[#This Row],[Origem]]&\" - \"&BMVT9[[#This Row],[Destino]])","v":"Salvador - Salvador"}]
["000.019","Vinicius","Anistiado","Salvador","PESSOAL","23101-A (09096)","Regular","Salvador","Salvador","Urbano","Salvador Card",2,2,42,42,21,3.3,138.6]
["000.020","José Carlos","Empregado","Salvador","LOGISTICA","23101-A (09096)","Regular","Salvador","Salvador","Urbano","Salvador Card",2,2,42,42,21,3.3,138.6,null,null,{"$f":"IF(ISERROR(BMVT9[[#This Row],[Origem]]&\" - \"&BMVT9[[#This Row],[Destino]]),\"\",BMVT9[[#This Row],[Origem]]&\" - \"&BMVT9[[#This Row],[Destino]])","v":"Salvador - Salvador"}]
["000.021","Carlos","Empregado","Salvador","LOGISTICA","23101-A (09096)","Regular","Salvador","Salvador","Urbano","Salvador Card",2,2,42,42,21,3.3,138.6,null,null,{"$f":"IF(ISERROR(BMVT9[[#This Row],[Origem]]&\" - \"&BMVT9[[#This Row],[Destino]]),\"\",BMVT9[[#This Row],[Origem]]&\" - \"&BMVT9[[#This Row],[Destino]])","v":"Salvador - Salvador"}]
["000.022","Miguel","Empregado","Salvador","LOGISTICA","23101-A (09096)","Regular","Salvador","Salvador","Urbano","Salvador Card",2,2,42,42,21,3.3,138.6,null,null,{"$f":"IF(ISERROR(BMVT9[[#This Row],[Origem]]&\" - \"&BMVT9[[#This Row],[Destino]]),\"\",BMVT9[[#This Row],[Origem]]&\" - \"&BMVT9[[#This Row],[Destino]])","v":"Salvador - Salvador"}]
["000.023","Gustavo","Empregado","Salvador","FINANCEIRO","23101-A (09096)","Regular","Salvador","Salvador","Urbano","Salvador Card",4,4,84,84,21,3.3,277.2,null,null,{"$f":"IF(ISERROR(BMVT9[[#This Row],[Origem]]&\" - \"&BMVT9[[#This Row],[Destino]]),\"\",BMVT9[[#This Row],[Origem]]&\" - \"&BMVT9[[#This Row],[Destino]])","v":"Salvador - Salvador"}]
["000.024","Guilherme","Empregado","Salvador","FINANCEIRO","23101-A (09096)","Irregular","Salvador","Salvador","Urbano","Salvador Card",0,0,0,0,0,3.3,0,null,null,{"$f":"IF(ISERROR(BMVT9[[#This Row],[Origem]]&\" - \"&BMVT9[[#This Row],[Destino]]),\"\",BMVT9[[#This Row],[Origem]]&\" - \"&BMVT9[[#This Row],[Destino]])","v":"Salvador - Salvador"}]
["000.025","Bruno Brito","Empregado","Salvador","FINANCEIRO","23101-A (09096)","Regular","Salvador","Salvador","Urbano","Salvador Card",2,2,42,14,7,3.3,46.199999999999996,null,null,{"$f":"IF(ISERROR(BMVT9[[#This Row],[Origem]]&\" - \"&BMVT9[[#This Row],[Destino]]),\"\",BMVT9[[#This Row],[Origem]]&\" - \"&BMVT9[[#This Row],[Destino]])","v":"Salvador - Salvador"}]
[null,"","","","",null,null,"","","","",null,0,0,0,0,0,0,null,null,{"$f":"IF(ISERROR(BMVT9[[#This Row],[Origem]]&\" - \"&BMVT9[[#This Row],[Destino]]),\"\",BMVT9[[#This Row],[Origem]]&\" - \"&BMVT9[[#This Row],[Destino]])","v":" - "}]
[null,"","","","",null,null,"","","","",null,0,0,0,0,0,0,null,null,{"$f":"IF(ISERROR(BMVT9[[#This Row],[Origem]]&\" - \"&BMVT9[[#This Row],[Destino]]),\"\",BMVT9[[#This Row],[Origem]]&\" - \"&BMVT9[[#This Row],[Destino]])","v":" - "}]
[null,"","","","",null,null,"","","","",null,0,0,0,0,0,0,null,null,{"$f":"IF(ISERROR(BMVT9[[#This Row],[Origem]]&\" - \"&BMVT9[[#This Row],[Destino]]),\"\",BMVT9[[#This Row],[Origem]]&\" - \"&BMVT9[[#This Row],[Destino]])","v":" - "}]
[null,"","","","",null,null,"","","","",null,0,0,0,0,0,0,null,null,{"$f":"IF(ISERROR(BMVT9[[#This Row],[Origem]]&\" - \"&BMVT9[[#This Row],[Destino]]),\"\",BMVT9[[#This Row],[Origem]]&\" - \"&BMVT9[[#This Row],[Destino]])","v":" - "}]
[null,"","","","",null,null,"","","","",null,0,0,0,0,0,0,null,null,{"$f":"IF(ISERROR(BMVT9[[#This Row],[Origem]]&\" - \"&BMVT9[[#This Row],[Destino]]),\"\",BMVT9[[#This Row],[Origem]]&\" - \"&BMVT9[[#This Row],[Destino]])","v":" - "}]
[null,"","","","",null,null,"","","","",null,0,0,0,0,0,0,null,null,{"$f":"IF(ISERROR(BMVT9[[#This Row],[Origem]]&\" - \"&BMVT9[[#This Row],[Destino]]),\"\",BMVT9[[#This Row],[Origem]]&\" - \"&BMVT9[[#This Row],[Destino]])","v":" - "}]
[null,"","","","",null,null,"","","","",null,0,0,0,0,0,0,null,null,{"$f":"IF(ISERROR(BMVT9[[#This Row],[Origem]]&\" - \"&BMVT9[[#This Row],[Destino]]),\"\",BMVT9[[#This Row],[Origem]]&\" - \"&BMVT9[[#This Row],[Destino]])","v":" - "}]
[null,"","","","",null,null,"","","","",null,0,0,0,0,0,0,null,null,{"$f":"IF(ISERROR(BMVT9[[#This Row],[Origem]]&\" - \"&BMVT9[[#This Row],[Destino]]),\"\",BMVT9[[#This Row],[Origem]]&\" - \"&BMVT9[[#This Row],[Destino]])","v":" - "}]
[null,"","","","",null,null,"","","","",null,0,0,0,0,0,0,null,null,{"$f":"IF(ISERROR(BMVT9[[#This Row],[Origem]]&\" - \"&BMVT9[[#This Row],[Destino]]),\"\",BMVT9[[#This Row],[Origem]]&\" - \"&BMVT9[[#This Row],[Destino]])","v":" - "}]
[null,"","","","",null,null,"","","","",null,0,0,0,0,0,0,null,null,{"$f":"IF(ISERROR(BMVT9[[#This Row],[Origem]]&\" - \"&BMVT9[[#This Row],[Destino]]),\"\",BMVT9[[#This Row],[Origem]]&\" - \"&BMVT9[[#This Row],[Destino]])","v":" - "}]
[null,"","","","",null,null,"","","","",null,0,0,0,0,0,0,null,null,{"$f":"IF(ISERROR(BMVT9[[#This Row],[Origem]]&\" - \"&BMVT9[[#This Row],[Destino]]),\"\",BMVT9[[#This Row],[Origem]]&\" - \"&BMVT9[[#This Row],[Destino]])","v":" - "}]
[null,"","","","",null,null,"","","","",null,0,0,0,0,0,0,null,null,{"$f":"IF(ISERROR(BMVT9[[#This Row],[Origem]]&\" - \"&BMVT9[[#This Row],[Destino]]),\"\",BMVT9[[#This Row],[Origem]]&\" - \"&BMVT9[[#This Row],[Destino]])","v":" - "}]
[null,"","","","",null,null,"","","","",null,0,0,0,0,0,0,null,null,{"$f":"IF(ISERROR(BMVT9[[#This Row],[Origem]]&\" - \"&BMVT9[[#This Row],[Destino]]),\"\",BMVT9[[#This Row],[Origem]]&\" - \"&BMVT9[[#This Row],[Destino]])","v":" - "}]
[null,"","","","",null,null,"","","","",null,0,0,0,0,0,0,null,null,{"$f":"IF(ISERROR(BMVT9[[#This Row],[Origem]]&\" - \"&BMVT9[[#This Row],[Destino]]),\"\",BMVT9[[#This Row],[Origem]]&\" - \"&BMVT9[[#This Row],[Destino]])","v":" - "}]
[null,"","","","",null,null,"","","","",null,0,0,0,0,0,0,null,null,{"$f":"IF(ISERROR(BMVT9[[#This Row],[Origem]]&\" - \"&BMVT9[[#This Row],[Destino]]),\"\",BMVT9[[#This Row],[Origem]]&\" - \"&BMVT9[[#This Row],[Destino]])","v":" - "}]
[null,"","","","",null,null,"","","","",null,0,0,0,0,0,0,null,null,{"$f":"IF(ISERROR(BMVT9[[#This Row],[Origem]]&\" - \"&BMVT9[[#This Row],[Destino]]),\"\",BMVT9[[#This Row],[Origem]]&\" - \"&BMVT9[[#This Row],[Destino]])","v":" - "}]
[null,"","","","",null,null,"","","","",null,0,0,0,0,0,0,null,null,{"$f":"IF(ISERROR(BMVT9[[#This Row],[Origem]]&\" - \"&BMVT9[[#This Row],[Destino]]),\"\",BMVT9[[#This Row],[Origem]]&\" - \"&BMVT9[[#This Row],[Destino]])","v":" - "}]
[null,"","","","",null,null,"","","","",null,0,0,0,0,0,0,null,null,{"$f":"IF(ISERROR(BMVT9[[#This Row],[Origem]]&\" - \"&BMVT9[[#This Row],[Destino]]),\"\",BMVT9[[#This Row],[Origem]]&\" - \"&BMVT9[[#This Row],[Destino]])","v":" - "}]
[null,"","","","",null,null,"","","","",null,0,0,0,0,0,0,null,null,{"$f":"IF(ISERROR(BMVT9[[#This Row],[Origem]]&\" - \"&BMVT9[[#This Row],[Destino]]),\"\",BMVT9[[#This Row],[Origem]]&\" - \"&BMVT9[[#This Row],[Destino]])","v":" - "}]
[null,"","","","",null,null,"","","","",null,0,0,0,0,0,0,null,null,{"$f":"IF(ISERROR(BMVT9[[#This Row],[Origem]]&\" - \"&BMVT9[[#This Row],[Destino]]),\"\",BMVT9[[#This Row],[Origem]]&\" - \"&BMVT9[[#This Row],[Destino]])","v":" - "}]
[null,"","","","",null,null,"","","","",null,0,0,0,0,0,0,null,null,{"$f":"IF(ISERROR(BMVT9[[#This Row],[Origem]]&\" - \"&BMVT9[[#This Row],[Destino]]),\"\",BMVT9[[#This Row],[Origem]]&\" - \"&BMVT9[[#This Row],[Destino]])","v":" - "}]
[null,"","","","",null,null,"","","","",null,0,0,0,0,0,0,null,null,{"$f":"IF(ISERROR(BMVT9[[#This Row],[Origem]]&\" - \"&BMVT9[[#This Row],[Destino]]),\"\",BMVT9[[#This Row],[Origem]]&\" - \"&BMVT9[[#This Row],[Destino]])","v":" - "}]
[null,"","","","",null,null,"","","","",null,0,0,0,0,0,0,null,null,{"$f":"IF(ISERROR(BMVT9[[#This Row],[Origem]]&\" - \"&BMVT9[[#This Row],[Destino]]),\"\",BMVT9[[#This Row],[Origem]]&\" - \"&BMVT9[[#This Row],[Destino]])","v":" - "}]
[null,"","","","",null,null,"","","","",null,0,0,0,0,0,0,null,null,{"$f":"IF(ISERROR(BMVT9[[#This Row],[Origem]]&\" - \"&BMVT9[[#This Row],[Destino]]),\"\",BMVT9[[#This Row],[Origem]]&\" - \"&BMVT9[[#This Row],[Destino]])","v":" - "}]
[null,"","","","",null,null,"","","","",null,0,0,0,0,0,0,null,null,{"$f":"IF(ISERROR(BMVT9[[#This Row],[Origem]]&\" - \"&BMVT9[[#This Row],[Destino]]),\"\",BMVT9[[#This Row],[Origem]]&\" - \"&BMVT9[[#This Row],[Destino]])","v":" - "}]
[null,"","","","",null,null,"","","","",null,0,0,0,0,0,0,null,null,{"$f":"IF(ISERROR(BMVT9[[#This Row],[Origem]]&\" - \"&BMVT9[[#This Row],[Destino]]),\"\",BMVT9[[#This Row],[Origem]]&\" - \"&BMVT9[[#This Row],[Destino]])","v":" - "}]
[null,"","","","",null,null,"","","","",null,0,0,0,0,0,0,null,null,{"$f":"IF(ISERROR(BMVT9[[#This Row],[Origem]]&\" - \"&BMVT9[[#This Row],[Destino]]),\"\",BMVT9[[#This Row],[Origem]]&\" - \"&BMVT9[[#This Row],[Destino]])","v":" - "}]
[null,"","","","",null,null,"","","","",null,0,0,0,0,0,0,null,null,{"$f":"IF(ISERROR(BMVT9[[#This Row],[Origem]]&\" - \"&BMVT9[[#This Row],[Destino]]),\"\",BMVT9[[#This Row],[Origem]]&\" - \"&BMVT9[[#This Row],[Destino]])","v":" - "}]
[null,"","","","",null,null,"","","","",null,0,0,0,0,0,0,null,null,{"$f":"IF(ISERROR(BMVT9[[#This Row],[Origem]]&\" - \"&BMVT9[[#This Row],[Destino]]),\"\",BMVT9[[#This Row],[Origem]]&\" - \"&BMVT9[[#This Row],[Destino]])","v":" - "}]
[null,"","","","",null,null,"","","","",null,0,0,0,0,0,0,null,null,{"$f":"IF(ISERROR(BMVT9[[#This Row],[Origem]]&\" - \"&BMVT9[[#This Row],[Destino]]),\"\",BMVT9[[#This Row],[Origem]]&\" - \"&BMVT9[[#This Row],[Destino]])","v":" - "}]
[null,"","","","",null,null,"","","","",null,0,0,0,0,0,0,null,null,{"$f":"IF(ISERROR(BMVT9[[#This Row],[Origem]]&\" - \"&BMVT9[[#This Row],[Destino]]),\"\",BMVT9[[#This Row],[Origem]]&\" - \"&BMVT9[[#This Row],[Destino]])","v":" - "}]
[null,"","","","",null,null,"","","","",null,0,0,0,0,0,0,null,null,{"$f":"IF(ISERROR(BMVT9[[#This Row],[Origem]]&\" - \"&BMVT9[[#This Row],[Destino]]),\"\",BMVT9[[#This Row],[Origem]]&\" - \"&BMVT9[[#This Row],[Destino]])","v":" - "}]
[null,"","","","",null,null,"","","","",null,0,0,0,0,0,0,null,null,{"$f":"IF(ISERROR(BMVT9[[#This Row],[Origem]]&\" - \"&BMVT9[[#This Row],[Destino]]),\"\",BMVT9[[#This Row],[Origem]]&\" - \"&BMVT9[[#This Row],[Destino]])","v":" - "}]
[null,"","","","",null,null,"","","","",null,0,0,0,0,0,0,null,null,{"$f":"IF(ISERROR(BMVT9[[#This Row],[Origem]]&\" - \"&BMVT9[[#This Row],[Destino]]),\"\",BMVT9[[#This Row],[Origem]]&\" - \"&BMVT9[[#This Row],[Destino]])","v":" - "}]
[null,"","","","",null,null,"","","","",null,0,0,0,0,0,0,null,null,{"$f":"IF(ISERROR(BMVT9[[#This Row],[Origem]]&\" - \"&BMVT9[[#This Row],[Destino]]),\"\",BMVT9[[#This Row],[Origem]]&\" - \"&BMVT9[[#This Row],[Destino]])","v":" - "}]
[null,"","","","",null,null,"","","","",null,0,0,0,0,0,0,null,null,{"$f":"IF(ISERROR(BMVT9[[#This Row],[Origem]]&\" - \"&BMVT9[[#This Row],[Destino]]),\"\",BMVT9[[#This Row],[Origem]]&\" - \"&BMVT9[[#This Row],[Destino]])","v":" - "}]
[null,"","","","",null,null,"","","","",null,0,0,0,0,0,0,null,null,{"$f":"IF(ISERROR(BMVT9[[#This Row],[Origem]]&\" - \"&BMVT9[[#This Row],[Destino]]),\"\",BMVT9[[#This Row],[Origem]]&\" - \"&BMVT9[[#This Row],[Destino]])","v":" - "}]
[null,"","","","",null,null,"","","","",null,0,0,0,0,0,0,null,null,{"$f":"IF(ISERROR(BMVT9[[#This Row],[Origem]]&\" - \"&BMVT9[[#This Row],[Destino]]),\"\",BMVT9[[#This Row],[Origem]]&\" - \"&BMVT9[[#This Row],[Destino]])","v":" - "}]
[null,"","","","",null,null,"","","","",null,0,0,0,0,0,0,null,null,{"$f":"IF(ISERROR(BMVT9[[#This Row],[Origem]]&\" - \"&BMVT9[[#This Row],[Destino]]),\"\",BMVT9[[#This Row],[Origem]]&\" - \"&BMVT9[[#This Row],[Destino]])","v":" - "}]
[null,"","","","",null,null,"","","","",null,0,0,0,0,0,0,null,null,{"$f":"IF(ISERROR(BMVT9[[#This Row],[Origem]]&\" - \"&BMVT9[[#This Row],[Destino]]),\"\",BMVT9[[#This Row],[Origem]]&\" - \"&BMVT9[[#This Row],[Destino]])","v":" - "}]
[null,"","","","",null,null,"","","","",null,0,0,0,0,0,0,null,null,{"$f":"IF(ISERROR(BMVT9[[#This Row],[Origem]]&\" - \"&BMVT9[[#This Row],[Destino]]),\"\",BMVT9[[#This Row],[Origem]]&\" - \"&BMVT9[[#This Row],[Destino]])","v":" - "}]
[null,"","","","",null,null,"","","","",null,0,0,0,0,0,0,null,null,{"$f":"IF(ISERROR(BMVT9[[#This Row],[Origem]]&\" - \"&BMVT9[[#This Row],[Destino]]),\"\",BMVT9[[#This Row],[Origem]]&\" - \"&BMVT9[[#This Row],[Destino]])","v":" - "}]
[null,"","","","",null,null,"","","","",null,0,0,0,0,0,0,null,null,{"$f":"IF(ISERROR(BMVT9[[#This Row],[Origem]]&\" - \"&BMVT9[[#This Row],[Destino]]),\"\",BMVT9[[#This Row],[Origem]]&\" - \"&BMVT9[[#This Row],[Destino]])","v":" - "}]
["Total",null,null,null,null,null,null,null,null,null,null,null,{"$f":"SUBTOTAL(109,BMVT9[Chipagem])","v":50},{"$f":"SUBTOTAL(109,BMVT9[Quant. Apur.])","v":1008},{"$f":"SUBTOTAL(109,BMVT9[Qtd. Solic.])","v":835},{"$f":"SUBTOTAL(109,BMVT9[Dias Lanc Sist.])","v":386},null,{"$f":"SUBTOTAL(109,BMVT9[Vlr. Total])","v":5932.1600000000017},null,null,{"$f":"IF(ISERROR(BMVT9[[#This Row],[Origem]]&\" - \"&BMVT9[[#This Row],[Destino]]),\"\",BMVT9[[#This Row],[Origem]]&\" - \"&BMVT9[[#This Row],[Destino]])","v":""}]
[null,null,null,null,null,null,null,null,null,null,null,null,null,null,null,null,null,null,null,null,{"$f":"IF(ISERROR(BMVT9[[#This Row],[Origem]]&\" - \"&BMVT9[[#This Row],[Destino]]),\"\",BMVT9[[#This Row],[Origem]]&\" - \"&BMVT9[[#This Row],[Destino]])","v":""}]
[null,null,null,null,null,null,null,null,null,null,null,null,null,null,null,null,null,null,null,null,{"$f":"IF(ISERROR(BMVT9[[#This Row],[Origem]]&\" - \"&BMVT9[[#This Row],[Destino]]),\"\",BMVT9[[#This Row],[Origem]]&\" - \"&BMVT9[[#This Row],[Destino]])","v":""}]
[null,null,null,null,null,null,null,null,null,null,null,null,null,null,null,null,null,null,null,null,{"$f":"IF(ISERROR(BMVT9[[#This Row],[Origem]]&\" - \"&BMVT9[[#This Row],[Destino]]),\"\",BMVT9[[#This Row],[Origem]]&\" - \"&BMVT9[[#This Row],[Destino]])","v":""}]
[{"$f":"\"Salvador, \"&TEXT(TODAY(),\"dd/mm/aaaa\")","v":"Salvador, 29/06/2016"},null,null,null,null,null,{"$f":"A78","v":"Salvador, 29/06/2016"},null,null,null,null,null,null,null,null,null,null,null,null,null,{"$f":"IF(ISERROR(BMVT9[[#This Row],[Origem]]&\" - \"&BMVT9[[#This Row],[Destino]]),\"\",BMVT9[[#This Row],[Origem]]&\" - \"&BMVT9[[#This Row],[Destino]])","v":""}]
[null,null,null,null,null,null,null,null,null,null,null,null,null,null,null,null,null,null,null,null,{"$f":"IF(ISERROR(BMVT9[[#This Row],[Origem]]&\" - \"&BMVT9[[#This Row],[Destino]]),\"\",BMVT9[[#This Row],[Origem]]&\" - \"&BMVT9[[#This Row],[Destino]])","v":""}]
[]
[]
["Responsável pelo Boletim de Medição",null,null,null,null,null,"Gerente Serviço de Pessoal de Salvador -SSPE"]

{"sheet":"Junho","index":3,"n_rows":81,"n_cols":32,"rows_kept":81,"cut":false,"hidden":false,"merged":[[4,25,4,26],[4,27,4,29],[76,0,76,2],[0,0,2,2],[0,14,0,15],[1,3,2,3],[1,14,1,15],[2,14,2,15],[4,23,4,24]]}
["Boletim Mensal de Vales Transporte",null,null,"Competência:",null,"Dias Úteis (Mês):",{"$f":"VLOOKUP(INDEX($W$6:$AF$16,$W$5,1),$W$6:$AF$16,9,FALSE)","v":21},null,"SC (Empregado):",0,{"$f":"(SUMIFS(BMVT11[Vlr. Total],BMVT11[Vínculo],\"<>Aprendiz\",BMVT11[Empresa], \"Salvador Card\"))-J1","v":1300.2},null,null,"Qtd Usuários",{"$f":"SUMPRODUCT(SUBTOTAL(3,OFFSET(BMVT11[Matrícula],ROW(BMVT11[Matrícula])-ROW(A6),0,1)),--(BMVT11[Situação]=\"Regular\"))","v":24}]
[null,null,null,{"$f":"VLOOKUP(INDEX($W$6:$AF$16,$W$5,1),$W$6:$AF$16,1,FALSE)","v":"Junho"},null,"Compesações:",{"$f":"VLOOKUP(INDEX($W$6:$AF$16,$W$5,1),$W$6:$AF$16,10,FALSE)","v":1},null,"SC (Aprendiz):",0,{"$f":"(SUMIFS(BMVT11[Vlr. Total],BMVT11[Vínculo],\"Aprendiz\",BMVT11[Empresa],\"Salvador Card\"))-J2","v":0},null,null,"Qtd VT :",{"$f":"SUMPRODUCT(SUBTOTAL(9,OFFSET(BMVT11[Qtd. Solic.],ROW(BMVT11[Qtd. Solic.])-ROW(O6),0,1)),--(BMVT11[Situação]=\"Regular\"))","v":835}]
[null,null,null,null,null,"Desconto :",0,null,"Metropasse:",250.8,{"$f":"(SUMIF(BMVT11[Empresa],\"Metropasse\",BMVT11[Vlr. Total]))-J3","v":164.99999999999994},null,null,"Valor Total:",{"$f":"SUMPRODUCT(SUBTOTAL(9,OFFSET(BMVT11[Vlr. Total],ROW(BMVT11[Vlr. Total])-ROW(R6),0,1)),--(BMVT11[Situação]=\"Regular\"))","v":5932.1600000000017}]
[]
["Matrícula","Empregado","Vínculo","Lotação","Setor","Rota","Situação","Origem","Destino","Tipo","Empresa","Vales/Trecho","Chipagem","Quant. Apur.","Qtd. Solic.","Dias Lanc Sist.","Vlr. Unit.","Vlr. Total",null,null,"Trechos",null,6,"Período",null,"Feriados",null,"Compensações",null,null,"DU"]
["000.001","João","Anistiado","Salvador","ADMINISTRATIVO","xxxxx-Y","Regular","Dias D'Ávila","Camaçari","Intermunicipal","Cidade das Águas",2,2,42,42,21,2.8,117.6,null,null,{"$f":"IF(ISERROR(BMVT11[[#This Row],[Origem]]&\" - \"&BMVT11[[#This Row],[Destino]]),\"\",BMVT11[[#This Row],[Origem]]&\" - \"&BMVT11[[#This Row],[Destino]])","v":"Dias D'Ávila - Camaçari"},null,"Janeiro","2016-01-01","2016-01-31","2016-01-01",null,null,null,null,{"$f":"NETWORKDAYS(X6,Y6,Z6:AD6)","v":20},{"$f":"COUNTA(AB6:AD6)","v":0}]
["000.002","Maria","Anistiado","Salvador","ADMINISTRATIVO",23196,"Regular","Alagoinhas","Salvador","Intermunicipal","Cidade Sol",2,2,42,42,21,28.35,1190.7,null,null,{"$f":"IF(ISERROR(BMVT11[[#This Row],[Origem]]&\" - \"&BMVT11[[#This Row],[Destino]]),\"\",BMVT11[[#This Row],[Origem]]&\" - \"&BMVT11[[#This Row],[Destino]])","v":"Alagoinhas - Salvador"},null,"Fevereiro","2016-02-01","2016-02-29","2016-02-08",null,"2016-02-09","2016-02-10",null,{"$f":"NETWORKDAYS(X7,Y7,Z7:AD7)","v":18},{"$f":"COUNTA(AB7:AD7)","v":2}]
["000.003","Francisco","Anistiado","Salvador","ADMINISTRATIVO",23184,"Regular","Jequié","Ipiaú","Intermunicipal","Cidade Sol",2,2,42,48,24,10.65,511.20000000000005,null,null,{"$f":"IF(ISERROR(BMVT11[[#This Row],[Origem]]&\" - \"&BMVT11[[#This Row],[Destino]]),\"\",BMVT11[[#This Row],[Origem]]&\" - \"&BMVT11[[#This Row],[Destino]])","v":"Jequié - Ipiaú"},null,"Março","2016-03-01","2016-03-31","2016-03-25",null,"2016-03-24",null,null,{"$f":"NETWORKDAYS(X8,Y8,Z8:AD8)","v":21},1]
["000.004","Ricardo","Empregado","Salvador","ADMINISTRATIVO",23183,"Regular","Feira de Santana","Feira de Santana","Urbano","Via Feira",2,2,42,0,0,3.1,0,null,null,{"$f":"IF(ISERROR(BMVT11[[#This Row],[Origem]]&\" - \"&BMVT11[[#This Row],[Destino]]),\"\",BMVT11[[#This Row],[Origem]]&\" - \"&BMVT11[[#This Row],[Destino]])","v":"Feira de Santana - Feira de Santana"},null,"Abril","2016-04-01","2016-04-30","2016-04-21",null,"2016-01-22",null,null,20,1]
["000.005","Mauro","Empregado","Salvador","ADMINISTRATIVO",23183,"Regular","Feira de Santana","Feira de Santana","Urbano","Via Feira",2,2,42,42,21,3.1,130.20000000000002,null,null,{"$f":"IF(ISERROR(BMVT11[[#This Row],[Origem]]&\" - \"&BMVT11[[#This Row],[Destino]]),\"\",BMVT11[[#This Row],[Origem]]&\" - \"&BMVT11[[#This Row],[Destino]])","v":"Feira de Santana - Feira de Santana"},null,"Maio","2016-05-01","2016-05-31","2016-05-26",null,"2016-05-27",null,null,20,1]
["000.006","Marcio","Empregado","Salvador","ADMINISTRATIVO","23125-M","Regular","Conceição de Feira","Salvador","Intermunicipal","Viação Jauá",2,2,42,10,5,23.03,230.3,null,null,{"$f":"IF(ISERROR(BMVT11[[#This Row],[Origem]]&\" - \"&BMVT11[[#This Row],[Destino]]),\"\",BMVT11[[#This Row],[Origem]]&\" - \"&BMVT11[[#This Row],[Destino]])","v":"Conceição de Feira - Salvador"},null,"Junho","2016-06-01","2016-06-30",null,null,"2016-06-24",null,null,21,1]
["000.007","Carla","Empregado","Salvador","ADMINISTRATIVO","23125-M","Regular","Conceição de Feira","Salvador","Intermunicipal","Viação Jauá",2,2,42,42,21,23.03,967.26,null,null,{"$f":"IF(ISERROR(BMVT11[[#This Row],[Origem]]&\" - \"&BMVT11[[#This Row],[Destino]]),\"\",BMVT11[[#This Row],[Origem]]&\" - \"&BMVT11[[#This Row],[Destino]])","v":"Conceição de Feira - Salvador"},null,"Julho","2016-07-01","2016-07-31",null,null,null,null,null,21,0]
["000.008","Caroline","Empregado","Salvador","COMERCIAL","23190-V","Regular","Lauro de Freitas","Salvador","Intermunicipal","Metropasse",2,2,42,42,21,3.3,138.6,null,null,{"$f":"IF(ISERROR(BMVT11[[#This Row],[Origem]]&\" - \"&BMVT11[[#This Row],[Destino]]),\"\",BMVT11[[#This Row],[Origem]]&\" - \"&BMVT11[[#This Row],[Destino]])","v":"Lauro de Freitas - Salvador"},null,"Agosto","2016-08-01","2016-08-31",null,null,null,null,null,23,0]
["000.009","Pedro","Empregado","Salvador","COMERCIAL","23190-V","Regular","Lauro de Freitas","Salvador","Intermunicipal","Metropasse",2,2,42,0,0,3.3,0,null,null,{"$f":"IF(ISERROR(BMVT11[[#This Row],[Origem]]&\" - \"&BMVT11[[#This Row],[Destino]]),\"\",BMVT11[[#This Row],[Origem]]&\" - \"&BMVT11[[#This Row],[Destino]])","v":"Lauro de Freitas - Salvador"},null,"Setembro","2016-09-01","2016-09-30","2016-09-07",null,null,null,null,21,0]
["000.010","Paulo","Empregado","Salvador","COMERCIAL","23190-V","Regular","Lauro de Freitas","Salvador","Intermunicipal","Metropasse",2,2,42,42,21,3.3,138.6,null,null,{"$f":"IF(ISERROR(BMVT11[[#This Row],[Origem]]&\" - \"&BMVT11[[#This Row],[Destino]]),\"\",BMVT11[[#This Row],[Origem]]&\" - \"&BMVT11[[#This Row],[Destino]])","v":"Lauro de Freitas - Salvador"},null,"Outubro","2016-10-01","2016-10-31","2016-10-12",null,null,null,null,20,0]
["000.011","Rafael","Empregado","Salvador","COMERCIAL","23190-V","Regular","Lauro de Freitas","Salvador","Intermunicipal","Metropasse",2,2,42,42,21,3.3,138.6,null,null,{"$f":"IF(ISERROR(BMVT11[[#This Row],[Origem]]&\" - \"&BMVT11[[#This Row],[Destino]]),\"\",BMVT11[[#This Row],[Origem]]&\" - \"&BMVT11[[#This Row],[Destino]])","v":"Lauro de Freitas - Salvador"},null,"Novembro","2016-11-01","2016-11-30","2016-11-02","2016-11-15","2016-11-14",null,null,{"$f":"NETWORKDAYS(X16,Y16,Z16:AD16)","v":19},1]
["000.012","Ricardo","Empregado","Salvador","COMERCIAL","23170-I","Regular","Aracaju","Aracaju","Urbano","Aracaju Card",2,2,42,54,27,3.1,167.4,null,null,{"$f":"IF(ISERROR(BMVT11[[#This Row],[Origem]]&\" - \"&BMVT11[[#This Row],[Destino]]),\"\",BMVT11[[#This Row],[Origem]]&\" - \"&BMVT11[[#This Row],[Destino]])","v":"Aracaju - Aracaju"}]
["000.013","Jose","Empregado","Salvador","COMERCIAL","xxxxx-Y (Pool)","Regular","Feira de Santana","Camaçari","Intermunicipal","Lis Transportes",2,2,42,10,5,650,650,null,null,{"$f":"IF(ISERROR(BMVT11[[#This Row],[Origem]]&\" - \"&BMVT11[[#This Row],[Destino]]),\"\",BMVT11[[#This Row],[Origem]]&\" - \"&BMVT11[[#This Row],[Destino]])","v":"Feira de Santana - Camaçari"}]
["000.014","Felipe","Empregado","Salvador","COMERCIAL",23182,"Regular","Amélia Rodrigues","Governador Mangabeira","Intermunicipal","RD Transportes",2,2,42,25,12.5,10.06,251.5,null,null,{"$f":"IF(ISERROR(BMVT11[[#This Row],[Origem]]&\" - \"&BMVT11[[#This Row],[Destino]]),\"\",BMVT11[[#This Row],[Origem]]&\" - \"&BMVT11[[#This Row],[Destino]])","v":"Amélia Rodrigues - Governador Mangabeira"}]
["000.015","Julio","Empregado","Salvador","COMERCIAL","23101-A (09096)","Regular","Salvador","Salvador","Urbano","Salvador Card",2,4,42,42,10.5,3.3,138.6,null,null,{"$f":"IF(ISERROR(BMVT11[[#This Row],[Origem]]&\" - \"&BMVT11[[#This Row],[Destino]]),\"\",BMVT11[[#This Row],[Origem]]&\" - \"&BMVT11[[#This Row],[Destino]])","v":"Salvador - Salvador"}]
["000.016","Lucia","Empregado","Salvador","PESSOAL","23101-A (09096)","Regular","Salvador","Salvador","Urbano","Salvador Card",2,2,42,44,22,3.3,145.19999999999999,null,null,{"$f":"IF(ISERROR(BMVT11[[#This Row],[Origem]]&\" - \"&BMVT11[[#This Row],[Destino]]),\"\",BMVT11[[#This Row],[Origem]]&\" - \"&BMVT11[[#This Row],[Destino]])","v":"Salvador - Salvador"}]
["000.017","Luciano","Empregado","Salvador","PESSOAL","23101-A (09096)","Regular","Salvador","Salvador","Urbano","Salvador Card",0,0,0,0,0,3.3,0,null,null,{"$f":"IF(ISERROR(BMVT11[[#This Row],[Origem]]&\" - \"&BMVT11[[#This Row],[Destino]]),\"\",BMVT11[[#This Row],[Origem]]&\" - \"&BMVT11[[#This Row],[Destino]])","v":"Salvador - Salvador"}]
["000.018","Bruno","Empregado","Salvador","PESSOAL","23101-A (09096)","Regular","Salvador","Salvador","Urbano","Salvador Card",2,2,42,42,21,3.3,138.6,null,null,{"$f":"IF(ISERROR(BMVT11[[#This Row],[Origem]]&\" - \"&BMVT11[[#This Row],[Destino]]),\"\",BMVT11[[#This Row],[Origem]]&\" - \"&BMVT11[[#This Row],[Destino]])","v":"Salvador - Salvador"}]
["000.019","Vinicius","Anistiado","Salvador","PESSOAL","23101-A (09096)","Regular","Salvador","Salvador","Urbano","Salvador Card",2,2,42,42,21,3.3,138.6]
["000.020","José Carlos","Empregado","Salvador","LOGISTICA","23101-A (09096)","Regular","Salvador","Salvador","Urbano","Salvador Card",2,2,42,42,21,3.3,138.6,null,null,{"$f":"IF(ISERROR(BMVT11[[#This Row],[Origem]]&\" - \"&BMVT11[[#This Row],[Destino]]),\"\",BMVT11[[#This Row],[Origem]]&\" - \"&BMVT11[[#This Row],[Destino]])","v":"Salvador - Salvador"}]
["000.021","Carlos","Empregado","Salvador","LOGISTICA","23101-A (09096)","Regular","Salvador","Salvador","Urbano","Salvador Card",2,2,42,42,21,3.3,138.6,null,null,{"$f":"IF(ISERROR(BMVT11[[#This Row],[Origem]]&\" - \"&BMVT11[[#This Row],[Destino]]),\"\",BMVT11[[#This Row],[Origem]]&\" - \"&BMVT11[[#This Row],[Destino]])","v":"Salvador - Salvador"}]
["000.022","Miguel","Empregado","Salvador","LOGISTICA","23101-A (09096)","Regular","Salvador","Salvador","Urbano","Salvador Card",2,2,42,42,21,3.3,138.6,null,null,{"$f":"IF(ISERROR(BMVT11[[#This Row],[Origem]]&\" - \"&BMVT11[[#This Row],[Destino]]),\"\",BMVT11[[#This Row],[Origem]]&\" - \"&BMVT11[[#This Row],[Destino]])","v":"Salvador - Salvador"}]
["000.023","Gustavo","Empregado","Salvador","FINANCEIRO","23101-A (09096)","Regular","Salvador","Salvador","Urbano","Salvador Card",4,4,84,84,21,3.3,277.2,null,null,{"$f":"IF(ISERROR(BMVT11[[#This Row],[Origem]]&\" - \"&BMVT11[[#This Row],[Destino]]),\"\",BMVT11[[#This Row],[Origem]]&\" - \"&BMVT11[[#This Row],[Destino]])","v":"Salvador - Salvador"}]
["000.024","Guilherme","Empregado","Salvador","FINANCEIRO","23101-A (09096)","Irregular","Salvador","Salvador","Urbano","Salvador Card",0,0,0,0,0,3.3,0,null,null,{"$f":"IF(ISERROR(BMVT11[[#This Row],[Origem]]&\" - \"&BMVT11[[#This Row],[Destino]]),\"\",BMVT11[[#This Row],[Origem]]&\" - \"&BMVT11[[#This Row],[Destino]])","v":"Salvador - Salvador"}]
["000.025","Bruno Brito","Empregado","Salvador","FINANCEIRO","23101-A (09096)","Regular","Salvador","Salvador","Urbano","Salvador Card",2,2,42,14,7,3.3,46.199999999999996,null,null,{"$f":"IF(ISERROR(BMVT11[[#This Row],[Origem]]&\" - \"&BMVT11[[#This Row],[Destino]]),\"\",BMVT11[[#This Row],[Origem]]&\" - \"&BMVT11[[#This Row],[Destino]])","v":"Salvador - Salvador"}]
[null,"","","","",null,null,"","","","",null,0,0,0,0,0,0,null,null,{"$f":"IF(ISERROR(BMVT11[[#This Row],[Origem]]&\" - \"&BMVT11[[#This Row],[Destino]]),\"\",BMVT11[[#This Row],[Origem]]&\" - \"&BMVT11[[#This Row],[Destino]])","v":" - "}]
[null,"","","","",null,null,"","","","",null,0,0,0,0,0,0,null,null,{"$f":"IF(ISERROR(BMVT11[[#This Row],[Origem]]&\" - \"&BMVT11[[#This Row],[Destino]]),\"\",BMVT11[[#This Row],[Origem]]&\" - \"&BMVT11[[#This Row],[Destino]])","v":" - "}]
[null,"","","","",null,null,"","","","",null,0,0,0,0,0,0,null,null,{"$f":"IF(ISERROR(BMVT11[[#This Row],[Origem]]&\" - \"&BMVT11[[#This Row],[Destino]]),\"\",BMVT11[[#This Row],[Origem]]&\" - \"&BMVT11[[#This Row],[Destino]])","v":" - "}]
[null,"","","","",null,null,"","","","",null,0,0,0,0,0,0,null,null,{"$f":"IF(ISERROR(BMVT11[[#This Row],[Origem]]&\" - \"&BMVT11[[#This Row],[Destino]]),\"\",BMVT11[[#This Row],[Origem]]&\" - \"&BMVT11[[#This Row],[Destino]])","v":" - "}]
[null,"","","","",null,null,"","","","",null,0,0,0,0,0,0,null,null,{"$f":"IF(ISERROR(BMVT11[[#This Row],[Origem]]&\" - \"&BMVT11[[#This Row],[Destino]]),\"\",BMVT11[[#This Row],[Origem]]&\" - \"&BMVT11[[#This Row],[Destino]])","v":" - "}]
[null,"","","","",null,null,"","","","",null,0,0,0,0,0,0,null,null,{"$f":"IF(ISERROR(BMVT11[[#This Row],[Origem]]&\" - \"&BMVT11[[#This Row],[Destino]]),\"\",BMVT11[[#This Row],[Origem]]&\" - \"&BMVT11[[#This Row],[Destino]])","v":" - "}]
[null,"","","","",null,null,"","","","",null,0,0,0,0,0,0,null,null,{"$f":"IF(ISERROR(BMVT11[[#This Row],[Origem]]&\" - \"&BMVT11[[#This Row],[Destino]]),\"\",BMVT11[[#This Row],[Origem]]&\" - \"&BMVT11[[#This Row],[Destino]])","v":" - "}]
[null,"","","","",null,null,"","","","",null,0,0,0,0,0,0,null,null,{"$f":"IF(ISERROR(BMVT11[[#This Row],[Origem]]&\" - \"&BMVT11[[#This Row],[Destino]]),\"\",BMVT11[[#This Row],[Origem]]&\" - \"&BMVT11[[#This Row],[Destino]])","v":" - "}]
[null,"","","","",null,null,"","","","",null,0,0,0,0,0,0,null,null,{"$f":"IF(ISERROR(BMVT11[[#This Row],[Origem]]&\" - \"&BMVT11[[#This Row],[Destino]]),\"\",BMVT11[[#This Row],[Origem]]&\" - \"&BMVT11[[#This Row],[Destino]])","v":" - "}]
[null,"","","","",null,null,"","","","",null,0,0,0,0,0,0,null,null,{"$f":"IF(ISERROR(BMVT11[[#This Row],[Origem]]&\" - \"&BMVT11[[#This Row],[Destino]]),\"\",BMVT11[[#This Row],[Origem]]&\" - \"&BMVT11[[#This Row],[Destino]])","v":" - "}]
[null,"","","","",null,null,"","","","",null,0,0,0,0,0,0,null,null,{"$f":"IF(ISERROR(BMVT11[[#This Row],[Origem]]&\" - \"&BMVT11[[#This Row],[Destino]]),\"\",BMVT11[[#This Row],[Origem]]&\" - \"&BMVT11[[#This Row],[Destino]])","v":" - "}]
[null,"","","","",null,null,"","","","",null,0,0,0,0,0,0,null,null,{"$f":"IF(ISERROR(BMVT11[[#This Row],[Origem]]&\" - \"&BMVT11[[#This Row],[Destino]]),\"\",BMVT11[[#This Row],[Origem]]&\" - \"&BMVT11[[#This Row],[Destino]])","v":" - "}]
[null,"","","","",null,null,"","","","",null,0,0,0,0,0,0,null,null,{"$f":"IF(ISERROR(BMVT11[[#This Row],[Origem]]&\" - \"&BMVT11[[#This Row],[Destino]]),\"\",BMVT11[[#This Row],[Origem]]&\" - \"&BMVT11[[#This Row],[Destino]])","v":" - "}]
[null,"","","","",null,null,"","","","",null,0,0,0,0,0,0,null,null,{"$f":"IF(ISERROR(BMVT11[[#This Row],[Origem]]&\" - \"&BMVT11[[#This Row],[Destino]]),\"\",BMVT11[[#This Row],[Origem]]&\" - \"&BMVT11[[#This Row],[Destino]])","v":" - "}]
[null,"","","","",null,null,"","","","",null,0,0,0,0,0,0,null,null,{"$f":"IF(ISERROR(BMVT11[[#This Row],[Origem]]&\" - \"&BMVT11[[#This Row],[Destino]]),\"\",BMVT11[[#This Row],[Origem]]&\" - \"&BMVT11[[#This Row],[Destino]])","v":" - "}]
[null,"","","","",null,null,"","","","",null,0,0,0,0,0,0,null,null,{"$f":"IF(ISERROR(BMVT11[[#This Row],[Origem]]&\" - \"&BMVT11[[#This Row],[Destino]]),\"\",BMVT11[[#This Row],[Origem]]&\" - \"&BMVT11[[#This Row],[Destino]])","v":" - "}]
[null,"","","","",null,null,"","","","",null,0,0,0,0,0,0,null,null,{"$f":"IF(ISERROR(BMVT11[[#This Row],[Origem]]&\" - \"&BMVT11[[#This Row],[Destino]]),\"\",BMVT11[[#This Row],[Origem]]&\" - \"&BMVT11[[#This Row],[Destino]])","v":" - "}]
[null,"","","","",null,null,"","","","",null,0,0,0,0,0,0,null,null,{"$f":"IF(ISERROR(BMVT11[[#This Row],[Origem]]&\" - \"&BMVT11[[#This Row],[Destino]]),\"\",BMVT11[[#This Row],[Origem]]&\" - \"&BMVT11[[#This Row],[Destino]])","v":" - "}]
[null,"","","","",null,null,"","","","",null,0,0,0,0,0,0,null,null,{"$f":"IF(ISERROR(BMVT11[[#This Row],[Origem]]&\" - \"&BMVT11[[#This Row],[Destino]]),\"\",BMVT11[[#This Row],[Origem]]&\" - \"&BMVT11[[#This Row],[Destino]])","v":" - "}]
[null,"","","","",null,null,"","","","",null,0,0,0,0,0,0,null,null,{"$f":"IF(ISERROR(BMVT11[[#This Row],[Origem]]&\" - \"&BMVT11[[#This Row],[Destino]]),\"\",BMVT11[[#This Row],[Origem]]&\" - \"&BMVT11[[#This Row],[Destino]])","v":" - "}]
[null,"","","","",null,null,"","","","",null,0,0,0,0,0,0,null,null,{"$f":"IF(ISERROR(BMVT11[[#This Row],[Origem]]&\" - \"&BMVT11[[#This Row],[Destino]]),\"\",BMVT11[[#This Row],[Origem]]&\" - \"&BMVT11[[#This Row],[Destino]])","v":" - "}]
[null,"","","","",null,null,"","","","",null,0,0,0,0,0,0,null,null,{"$f":"IF(ISERROR(BMVT11[[#This Row],[Origem]]&\" - \"&BMVT11[[#This Row],[Destino]]),\"\",BMVT11[[#This Row],[Origem]]&\" - \"&BMVT11[[#This Row],[Destino]])","v":" - "}]
[null,"","","","",null,null,"","","","",null,0,0,0,0,0,0,null,null,{"$f":"IF(ISERROR(BMVT11[[#This Row],[Origem]]&\" - \"&BMVT11[[#This Row],[Destino]]),\"\",BMVT11[[#This Row],[Origem]]&\" - \"&BMVT11[[#This Row],[Destino]])","v":" - "}]
[null,"","","","",null,null,"","","","",null,0,0,0,0,0,0,null,null,{"$f":"IF(ISERROR(BMVT11[[#This Row],[Origem]]&\" - \"&BMVT11[[#This Row],[Destino]]),\"\",BMVT11[[#This Row],[Origem]]&\" - \"&BMVT11[[#This Row],[Destino]])","v":" - "}]
[null,"","","","",null,null,"","","","",null,0,0,0,0,0,0,null,null,{"$f":"IF(ISERROR(BMVT11[[#This Row],[Origem]]&\" - \"&BMVT11[[#This Row],[Destino]]),\"\",BMVT11[[#This Row],[Origem]]&\" - \"&BMVT11[[#This Row],[Destino]])","v":" - "}]
[null,"","","","",null,null,"","","","",null,0,0,0,0,0,0,null,null,{"$f":"IF(ISERROR(BMVT11[[#This Row],[Origem]]&\" - \"&BMVT11[[#This Row],[Destino]]),\"\",BMVT11[[#This Row],[Origem]]&\" - \"&BMVT11[[#This Row],[Destino]])","v":" - "}]
[null,"","","","",null,null,"","","","",null,0,0,0,0,0,0,null,null,{"$f":"IF(ISERROR(BMVT11[[#This Row],[Origem]]&\" - \"&BMVT11[[#This Row],[Destino]]),\"\",BMVT11[[#This Row],[Origem]]&\" - \"&BMVT11[[#This Row],[Destino]])","v":" - "}]
[null,"","","","",null,null,"","","","",null,0,0,0,0,0,0,null,null,{"$f":"IF(ISERROR(BMVT11[[#This Row],[Origem]]&\" - \"&BMVT11[[#This Row],[Destino]]),\"\",BMVT11[[#This Row],[Origem]]&\" - \"&BMVT11[[#This Row],[Destino]])","v":" - "}]
[null,"","","","",null,null,"","","","",null,0,0,0,0,0,0,null,null,{"$f":"IF(ISERROR(BMVT11[[#This Row],[Origem]]&\" - \"&BMVT11[[#This Row],[Destino]]),\"\",BMVT11[[#This Row],[Origem]]&\" - \"&BMVT11[[#This Row],[Destino]])","v":" - "}]
[null,"","","","",null,null,"","","","",null,0,0,0,0,0,0,null,null,{"$f":"IF(ISERROR(BMVT11[[#This Row],[Origem]]&\" - \"&BMVT11[[#This Row],[Destino]]),\"\",BMVT11[[#This Row],[Origem]]&\" - \"&BMVT11[[#This Row],[Destino]])","v":" - "}]
[null,"","","","",null,null,"","","","",null,0,0,0,0,0,0,null,null,{"$f":"IF(ISERROR(BMVT11[[#This Row],[Origem]]&\" - \"&BMVT11[[#This Row],[Destino]]),\"\",BMVT11[[#This Row],[Origem]]&\" - \"&BMVT11[[#This Row],[Destino]])","v":" - "}]
[null,"","","","",null,null,"","","","",null,0,0,0,0,0,0,null,null,{"$f":"IF(ISERROR(BMVT11[[#This Row],[Origem]]&\" - \"&BMVT11[[#This Row],[Destino]]),\"\",BMVT11[[#This Row],[Origem]]&\" - \"&BMVT11[[#This Row],[Destino]])","v":" - "}]
[null,"","","","",null,null,"","","","",null,0,0,0,0,0,0,null,null,{"$f":"IF(ISERROR(BMVT11[[#This Row],[Origem]]&\" - \"&BMVT11[[#This Row],[Destino]]),\"\",BMVT11[[#This Row],[Origem]]&\" - \"&BMVT11[[#This Row],[Destino]])","v":" - "}]
[null,"","","","",null,null,"","","","",null,0,0,0,0,0,0,null,null,{"$f":"IF(ISERROR(BMVT11[[#This Row],[Origem]]&\" - \"&BMVT11[[#This Row],[Destino]]),\"\",BMVT11[[#This Row],[Origem]]&\" - \"&BMVT11[[#This Row],[Destino]])","v":" - "}]
[null,"","","","",null,null,"","","","",null,0,0,0,0,0,0,null,null,{"$f":"IF(ISERROR(BMVT11[[#This Row],[Origem]]&\" - \"&BMVT11[[#This Row],[Destino]]),\"\",BMVT11[[#This Row],[Origem]]&\" - \"&BMVT11[[#This Row],[Destino]])","v":" - "}]
[null,"","","","",null,null,"","","","",null,0,0,0,0,0,0,null,null,{"$f":"IF(ISERROR(BMVT11[[#This Row],[Origem]]&\" - \"&BMVT11[[#This Row],[Destino]]),\"\",BMVT11[[#This Row],[Origem]]&\" - \"&BMVT11[[#This Row],[Destino]])","v":" - "}]
[null,"","","","",null,null,"","","","",null,0,0,0,0,0,0,null,null,{"$f":"IF(ISERROR(BMVT11[[#This Row],[Origem]]&\" - \"&BMVT11[[#This Row],[Destino]]),\"\",BMVT11[[#This Row],[Origem]]&\" - \"&BMVT11[[#This Row],[Destino]])","v":" - "}]
[null,"","","","",null,null,"","","","",null,0,0,0,0,0,0,null,null,{"$f":"IF(ISERROR(BMVT11[[#This Row],[Origem]]&\" - \"&BMVT11[[#This Row],[Destino]]),\"\",BMVT11[[#This Row],[Origem]]&\" - \"&BMVT11[[#This Row],[Destino]])","v":" - "}]
[null,"","","","",null,null,"","","","",null,0,0,0,0,0,0,null,null,{"$f":"IF(ISERROR(BMVT11[[#This Row],[Origem]]&\" - \"&BMVT11[[#This Row],[Destino]]),\"\",BMVT11[[#This Row],[Origem]]&\" - \"&BMVT11[[#This Row],[Destino]])","v":" - "}]
[null,"","","","",null,null,"","","","",null,0,0,0,0,0,0,null,null,{"$f":"IF(ISERROR(BMVT11[[#This Row],[Origem]]&\" - \"&BMVT11[[#This Row],[Destino]]),\"\",BMVT11[[#This Row],[Origem]]&\" - \"&BMVT11[[#This Row],[Destino]])","v":" - "}]
[null,"","","","",null,null,"","","","",null,0,0,0,0,0,0,null,null,{"$f":"IF(ISERROR(BMVT11[[#This Row],[Origem]]&\" - \"&BMVT11[[#This Row],[Destino]]),\"\",BMVT11[[#This Row],[Origem]]&\" - \"&BMVT11[[#This Row],[Destino]])","v":" - "}]
[null,"","","","",null,null,"","","","",null,0,0,0,0,0,0,null,null,{"$f":"IF(ISERROR(BMVT11[[#This Row],[Origem]]&\" - \"&BMVT11[[#This Row],[Destino]]),\"\",BMVT11[[#This Row],[Origem]]&\" - \"&BMVT11[[#This Row],[Destino]])","v":" - "}]
["Total",null,null,null,null,null,null,null,null,null,null,null,{"$f":"SUBTOTAL(109,BMVT11[Chipagem])","v":50},{"$f":"SUBTOTAL(109,BMVT11[Quant. Apur.])","v":1008},{"$f":"SUBTOTAL(109,BMVT11[Qtd. Solic.])","v":835},{"$f":"SUBTOTAL(109,BMVT11[Dias Lanc Sist.])","v":386},null,{"$f":"SUBTOTAL(109,BMVT11[Vlr. Total])","v":5932.1600000000017},null,null,{"$f":"IF(ISERROR(BMVT11[[#This Row],[Origem]]&\" - \"&BMVT11[[#This Row],[Destino]]),\"\",BMVT11[[#This Row],[Origem]]&\" - \"&BMVT11[[#This Row],[Destino]])","v":""}]
[null,null,null,null,null,null,null,null,null,null,null,null,null,null,null,null,null,null,null,null,{"$f":"IF(ISERROR(BMVT11[[#This Row],[Origem]]&\" - \"&BMVT11[[#This Row],[Destino]]),\"\",BMVT11[[#This Row],[Origem]]&\" - \"&BMVT11[[#This Row],[Destino]])","v":""}]
[null,null,null,null,null,null,null,null,null,null,null,null,null,null,null,null,null,null,null,null,{"$f":"IF(ISERROR(BMVT11[[#This Row],[Origem]]&\" - \"&BMVT11[[#This Row],[Destino]]),\"\",BMVT11[[#This Row],[Origem]]&\" - \"&BMVT11[[#This Row],[Destino]])","v":""}]
[null,null,null,null,null,null,null,null,null,null,null,null,null,null,null,null,null,null,null,null,{"$f":"IF(ISERROR(BMVT11[[#This Row],[Origem]]&\" - \"&BMVT11[[#This Row],[Destino]]),\"\",BMVT11[[#This Row],[Origem]]&\" - \"&BMVT11[[#This Row],[Destino]])","v":""}]
[{"$f":"\"Salvador, \"&TEXT(TODAY(),\"dd/mm/aaaa\")","v":"Salvador, 29/06/2016"},null,null,null,null,null,{"$f":"A77","v":"Salvador, 29/06/2016"},null,null,null,null,null,null,null,null,null,null,null,null,null,{"$f":"IF(ISERROR(BMVT11[[#This Row],[Origem]]&\" - \"&BMVT11[[#This Row],[Destino]]),\"\",BMVT11[[#This Row],[Origem]]&\" - \"&BMVT11[[#This Row],[Destino]])","v":""}]
[null,null,null,null,null,null,null,null,null,null,null,null,null,null,null,null,null,null,null,null,{"$f":"IF(ISERROR(BMVT11[[#This Row],[Origem]]&\" - \"&BMVT11[[#This Row],[Destino]]),\"\",BMVT11[[#This Row],[Origem]]&\" - \"&BMVT11[[#This Row],[Destino]])","v":""}]
[null,null,null,null,null,null,null,null,null,null,null,null,null,null,null,null,null,null,null,null,{"$f":"IF(ISERROR(BMVT11[[#This Row],[Origem]]&\" - \"&BMVT11[[#This Row],[Destino]]),\"\",BMVT11[[#This Row],[Origem]]&\" - \"&BMVT11[[#This Row],[Destino]])","v":""}]
[]
["Responsável pelo Boletim de Medição",null,null,null,null,null,"Gerente Serviço de Pessoal de Salvador -SSPE"]

{"sheet":"Maio","index":4,"n_rows":89,"n_cols":32,"rows_kept":89,"cut":false,"hidden":false,"merged":[[4,25,4,26],[4,27,4,29],[84,0,84,2],[0,0,2,2],[0,14,0,15],[1,3,2,3],[1,14,1,15],[2,14,2,15],[4,23,4,24]]}
["Boletim Mensal de Vales Transporte",null,null,"Competência:",null,"Dias Úteis (Mês):",{"$f":"VLOOKUP(INDEX($W$6:$AF$17,$W$5,1),$W$6:$AF$17,9,FALSE)","v":20},null,"SC (Empregado):",0,{"$f":"(SUMIFS(BMVT16[Vlr. Total],BMVT16[Vínculo],\"<>Aprendiz\",BMVT16[Empresa], \"Salvador Card\"))-J1","v":1240.8},null,null,"Qtd Usuários",{"$f":"SUMPRODUCT(SUBTOTAL(3,OFFSET(BMVT16[Matrícula],ROW(BMVT16[Matrícula])-ROW(A6),0,1)),--(BMVT16[Situação]=\"Regular\"))","v":24}]
[null,null,null,{"$f":"VLOOKUP(INDEX($W$6:$AF$17,$W$5,1),$W$6:$AF$17,1,FALSE)","v":"Maio"},null,"Compesações:",{"$f":"VLOOKUP(INDEX($W$6:$AF$17,$W$5,1),$W$6:$AF$17,10,FALSE)","v":1},null,"SC (Aprendiz):",0,{"$f":"(SUMIFS(BMVT16[Vlr. Total],BMVT16[Vínculo],\"Aprendiz\",BMVT16[Empresa],\"Salvador Card\"))-J2","v":0},null,null,"Qtd VT :",{"$f":"SUMPRODUCT(SUBTOTAL(9,OFFSET(BMVT16[Qtd. Solic.],ROW(BMVT16[Qtd. Solic.])-ROW(A6),0,1)),--(BMVT16[Situação]=\"Regular\"))","v":801}]
[null,null,null,null,null,"Desconto :",0,null,"Metropasse:",null,{"$f":"(SUMIF(BMVT16[Empresa],\"Metropasse\",BMVT16[Vlr. Total]))-J3","v":396},null,null,"Valor Total:",{"$f":"SUMPRODUCT(SUBTOTAL(9,OFFSET(BMVT16[Vlr. Total],ROW(BMVT16[Vlr. Total])-ROW(A6),0,1)),--(BMVT16[Situação]=\"Regular\"))","v":5732.2}]
[]
["Matrícula","Empregado","Vínculo","Lotação","Setor","Rota","Situação","Origem","Destino","Tipo","Empresa","Vales/Trecho","Chipagem","Quant. Apur.","Qtd. Solic.","Dias Lanc Sist.","Vlr. Unit.","Vlr. Total",null,null,null,null,5,"Período",null,"Feriados",null,"Compensações",null,null,"DU"]
["000.001","João","Anistiado","Salvador","ADMINISTRATIVO","xxxxx-Y","Regular","Dias D'Ávila","Camaçari","Intermunicipal","Cidade das Águas",2,2,40,40,20,2.8,112,null,null,null,null,"Janeiro","2016-01-01","2016-01-31","2016-01-01",null,null,null,null,{"$f":"NETWORKDAYS(X6,Y6,Z6:AD6)","v":20},{"$f":"COUNTA(AB6:AD6)","v":0}]
["000.002","Maria","Anistiado","Salvador","ADMINISTRATIVO",23196,"Regular","Alagoinhas","Salvador","Intermunicipal","Cidade Sol",2,2,40,40,20,28.35,1134,null,null,null,null,"Fevereiro","2016-02-01","2016-02-29","2016-02-08",null,"2016-02-09","2016-02-10",null,{"$f":"NETWORKDAYS(X7,Y7,Z7:AD7)","v":18},{"$f":"COUNTA(AB7:AD7)","v":2}]
["000.003","Francisco","Anistiado","Salvador","ADMINISTRATIVO",23184,"Regular","Jequié","Ipiaú","Intermunicipal","Cidade Sol",2,2,40,48,24,10.65,511.20000000000005,null,null,null,null,"Março","2016-03-01","2016-03-31","2016-03-25",null,"2016-03-24",null,null,{"$f":"NETWORKDAYS(X8,Y8,Z8:AD8)","v":21},1]
["000.004","Ricardo","Empregado","Salvador","ADMINISTRATIVO",23183,"Regular","Feira de Santana","Feira de Santana","Urbano","Via Feira",2,2,40,0,0,3.1,0,null,null,null,null,"Abril","2016-04-01","2016-04-30","2016-04-21",null,"2016-01-22",null,null,20,1]
["000.005","Mauro","Empregado","Salvador","ADMINISTRATIVO",23183,"Regular","Feira de Santana","Feira de Santana","Urbano","Via Feira",2,2,40,40,20,3.1,124,null,null,null,null,"Maio","2016-05-01","2016-05-31","2016-05-26",null,"2016-05-27",null,null,20,1]
["000.006","Marcio","Empregado","Salvador","ADMINISTRATIVO","23125-M","Regular","Conceição de Feira","Salvador","Intermunicipal","Viação Jauá",2,2,40,10,5,23.03,230.3,null,null,null,null,"Junho","2016-06-01","2016-06-30",null,null,null,null,null,22,0]
["000.007","Carla","Empregado","Salvador","ADMINISTRATIVO","23125-M","Regular","Conceição de Feira","Salvador","Intermunicipal","Viação Jauá",2,2,40,40,20,23.03,921.2,null,null,null,null,"Julho","2016-07-01","2016-07-31",null,null,null,null,null,21,0]
["000.008","Caroline","Empregado","Salvador","COMERCIAL","23190-V","Regular","Lauro de Freitas","Salvador","Intermunicipal","Metropasse",2,2,40,40,20,3.3,132,null,null,null,null,"Agosto","2016-08-01","2016-08-31",null,null,null,null,null,23,0]
["000.009","Pedro","Empregado","Salvador","COMERCIAL","23190-V","Regular","Lauro de Freitas","Salvador","Intermunicipal","Metropasse",2,2,40,0,0,3.3,0,null,null,null,null,"Setembro","2016-09-01","2016-09-30","2016-09-07",null,null,null,null,21,0]
["000.010","Paulo","Empregado","Salvador","COMERCIAL","23190-V","Regular","Lauro de Freitas","Salvador","Intermunicipal","Metropasse",2,2,40,40,20,3.3,132,null,null,null,null,"Outubro","2016-10-01","2016-10-31","2016-10-12",null,null,null,null,20,0]
["000.011","Rafael","Empregado","Salvador","COMERCIAL","23190-V","Regular","Lauro de Freitas","Salvador","Intermunicipal","Metropasse",2,2,40,40,20,3.3,132,null,null,null,null,"Novembro","2016-11-01","2016-11-30","2016-11-02","2016-11-15","2016-11-14",null,null,{"$f":"NETWORKDAYS(X16,Y16,Z16:AD16)","v":19},1]
["000.012","Ricardo","Empregado","Salvador","COMERCIAL","23170-I","Regular","Aracaju","Aracaju","Urbano","Aracaju Card",2,2,40,52,26,3.1,161.20000000000002,null,null,null,null,"Dezembro","2016-12-01","2016-12-31",null,null,null,null,null,22,0]
["000.013","Jose","Empregado","Salvador","COMERCIAL","xxxxx-Y (Pool)","Regular","Feira de Santana","Camaçari","Intermunicipal","Lis Transportes",2,2,40,10,5,650,650]
["000.014","Felipe","Empregado","Salvador","COMERCIAL",23182,"Regular","Amélia Rodrigues","Governador Mangabeira","Intermunicipal","RD Transportes",2,2,40,25,12.5,10.06,251.5]
["000.015","Julio","Empregado","Salvador","COMERCIAL","23101-A (09096)","Regular","Salvador","Salvador","Urbano","Salvador Card",2,4,40,40,10,3.3,132]
["000.016","Lucia","Empregado","Salvador","PESSOAL","23101-A (09096)","Regular","Salvador","Salvador","Urbano","Salvador Card",2,2,40,42,21,3.3,138.6]
["000.017","Luciano","Empregado","Salvador","PESSOAL","23101-A (09096)","Regular","Salvador","Salvador","Urbano","Salvador Card",0,0,0,0,0,3.3,0]
["000.018","Bruno","Empregado","Salvador","PESSOAL","23101-A (09096)","Regular","Salvador","Salvador","Urbano","Salvador Card",2,2,40,40,20,3.3,132]
["000.019","Vinicius","Anistiado","Salvador","PESSOAL","23101-A (09096)","Regular","Salvador","Salvador","Urbano","Salvador Card",2,2,40,40,20,3.3,132]
["000.020","José Carlos","Empregado","Salvador","LOGISTICA","23101-A (09096)","Regular","Salvador","Salvador","Urbano","Salvador Card",2,2,40,40,20,3.3,132]
["000.021","Carlos","Empregado","Salvador","LOGISTICA","23101-A (09096)","Regular","Salvador","Salvador","Urbano","Salvador Card",2,2,40,40,20,3.3,132]
["000.022","Miguel","Empregado","Salvador","LOGISTICA","23101-A (09096)","Regular","Salvador","Salvador","Urbano","Salvador Card",2,2,40,40,20,3.3,132]
["000.023","Gustavo","Empregado","Salvador","FINANCEIRO","23101-A (09096)","Regular","Salvador","Salvador","Urbano","Salvador Card",4,4,80,80,20,3.3,264]
["000.024","Guilherme","Empregado","Salvador","FINANCEIRO","23101-A (09096)","Irregular","Salvador","Salvador","Urbano","Salvador Card",0,0,0,0,0,3.3,0]
["000.025","Bruno Brito","Empregado","Salvador","FINANCEIRO","23101-A (09096)","Regular","Salvador","Salvador","Urbano","Salvador Card",2,2,40,14,7,3.3,46.199999999999996]
[null,"","","","",null,null,"","","","",null,0,0,0,0,0,0]
[null,"","","","",null,null,"","","","",null,0,0,0,0,0,0]
[null,"","","","",null,null,"","","","",null,0,0,0,0,0,0]
[null,"","","","",null,null,"","","","",null,0,0,0,0,0,0]
[null,"","","","",null,null,"","","","",null,0,0,0,0,0,0]
[null,"","","","",null,null,"","","","",null,0,0,0,0,0,0]
[null,"","","","",null,null,"","","","",null,0,0,0,0,0,0]
[null,"","","","",null,null,"","","","",null,0,0,0,0,0,0]
[null,"","","","",null,null,"","","","",null,0,0,0,0,0,0]
[null,"","","","",null,null,"","","","",null,0,0,0,0,0,0]
[null,"","","","",null,null,"","","","",null,0,0,0,0,0,0]
[null,"","","","",null,null,"","","","",null,0,0,0,0,0,0]
[null,"","","","",null,null,"","","","",null,0,0,0,0,0,0]
[null,"","","","",null,null,"","","","",null,0,0,0,0,0,0]
[null,"","","","",null,null,"","","","",null,0,0,0,0,0,0]
[null,"","","","",null,null,"","","","",null,0,0,0,0,0,0]
[null,"","","","",null,null,"","","","",null,0,0,0,0,0,0]
[null,"","","","",null,null,"","","","",null,0,0,0,0,0,0]
[null,"","","","",null,null,"","","","",null,0,0,0,0,0,0]
[null,"","","","",null,null,"","","","",null,0,0,0,0,0,0]
[null,"","","","",null,null,"","","","",null,0,0,0,0,0,0]
[null,"","","","",null,null,"","","","",null,0,0,0,0,0,0]
[null,"","","","",null,null,"","","","",null,0,0,0,0,0,0]
[null,"","","","",null,null,"","","","",null,0,0,0,0,0,0]
[null,"","","","",null,null,"","","","",null,0,0,0,0,0,0]
[null,"","","","",null,null,"","","","",null,0,0,0,0,0,0]
[null,"","","","",null,null,"","","","",null,0,0,0,0,0,0]
[null,"","","","",null,null,"","","","",null,0,0,0,0,0,0]
[null,"","","","",null,null,"","","","",null,0,0,0,0,0,0]
[null,"","","","",null,null,"","","","",null,0,0,0,0,0,0]
[null,"","","","",null,null,"","","","",null,0,0,0,0,0,0]
[null,"","","","",null,null,"","","","",null,0,0,0,0,0,0]
[null,"","","","",null,null,"","","","",null,0,0,0,0,0,0]
[null,"","","","",null,null,"","","","",null,0,0,0,0,0,0]
[null,"","","","",null,null,"","","","",null,0,0,0,0,0,0]
[null,"","","","",null,null,"","","","",null,0,0,0,0,0,0]
[null,"","","","",null,null,"","","","",null,0,0,0,0,0,0]
[null,"","","","",null,null,"","","","",null,0,0,0,0,0,0]
[null,"","","","",null,null,"","","","",null,0,0,0,0,0,0]
[null,"","","","",null,null,"","","","",null,0,0,0,0,0,0]
[null,"","","","",null,null,"","","","",null,0,0,0,0,0,0]
[null,"","","","",null,null,"","","","",null,0,0,0,0,0,0]
[null,"","","","",null,null,"","","","",null,0,0,0,0,0,0]
[null,"","","","",null,"","","","","",null,0,0,0,0,0,0]
[null,"","","","",null,"","","","","",null,0,0,0,0,0,0]
[null,"","","","",null,"","","","","",null,0,0,0,0,0,0]
[null,"","","","",null,"","","","","",null,0,0,0,0,0,0]
[null,"","","","",null,"","","","","",null,0,0,0,0,0,0]
[null,"","","","",null,"","","","","",null,0,0,0,0,0,0]
[null,"","","","",null,"","","","","",null,0,0,0,0,0,0]
["Total",null,null,null,null,null,null,null,null,null,null,null,{"$f":"SUBTOTAL(109,BMVT16[Chipagem])","v":50},{"$f":"SUBTOTAL(109,BMVT16[Quant. Apur.])","v":960},{"$f":"SUBTOTAL(109,BMVT16[Qtd. Solic.])","v":801},{"$f":"SUBTOTAL(109,BMVT16[Dias Lanc Sist.])","v":370.5},null,{"$f":"SUBTOTAL(109,BMVT16[Vlr. Total])","v":5732.2}]
[]
[]
[]
[{"$f":"\"Salvador, \"&TEXT(TODAY(),\"dd/mm/aaaa\")","v":"Salvador, 29/06/2016"},null,null,null,null,null,{"$f":"A85","v":"Salvador, 29/06/2016"}]
[]
[]
[]
["Responsável pelo Boletim de Medição",null,null,null,null,null,"Gerente Serviço de Pessoal de Salvador -SSPE"]

{"sheet":"Abril","index":5,"n_rows":89,"n_cols":32,"rows_kept":89,"cut":false,"hidden":false,"merged":[[4,25,4,26],[4,27,4,29],[84,0,84,2],[0,0,2,2],[0,14,0,15],[1,3,2,3],[1,14,1,15],[2,14,2,15],[4,23,4,24]]}
["Boletim Mensal de Vales Transporte",null,null,"Competência:",null,"Dias Úteis (Mês):",{"$f":"VLOOKUP(INDEX($W$6:$AF$17,$W$5,1),$W$6:$AF$17,9,FALSE)","v":20},null,"SC (Empregado):",0,{"$f":"(SUMIFS(BMVT13[Vlr. Total],BMVT13[Vínculo],\"<>Aprendiz\",BMVT13[Empresa], \"Salvador Card\"))-J1","v":1240.8},null,null,"Qtd Usuários",{"$f":"SUMPRODUCT(SUBTOTAL(3,OFFSET(BMVT13[Matrícula],ROW(BMVT13[Matrícula])-ROW(A6),0,1)),--(BMVT13[Situação]=\"Regular\"))","v":31}]
[null,null,null,{"$f":"VLOOKUP(INDEX($W$6:$AF$17,$W$5,1),$W$6:$AF$17,1,FALSE)","v":"Abril"},null,"Compesações:",{"$f":"VLOOKUP(INDEX($W$6:$AF$17,$W$5,1),$W$6:$AF$17,10,FALSE)","v":1},null,"SC (Aprendiz):",0,{"$f":"(SUMIFS(BMVT13[Vlr. Total],BMVT13[Vínculo],\"Aprendiz\",BMVT13[Empresa],\"Salvador Card\"))-J2","v":0},null,null,"Qtd VT :",{"$f":"SUMPRODUCT(SUBTOTAL(9,OFFSET(BMVT13[Qtd. Solic.],ROW(BMVT13[Qtd. Solic.])-ROW(A6),0,1)),--(BMVT13[Situação]=\"Regular\"))","v":927}]
[null,null,null,null,null,"Desconto :",0,null,"Metropasse:",null,{"$f":"(SUMIF(BMVT13[Empresa],\"Metropasse\",BMVT13[Vlr. Total]))-J3","v":396},null,null,"Valor Total:",{"$f":"SUMPRODUCT(SUBTOTAL(9,OFFSET(BMVT13[Vlr. Total],ROW(BMVT13[Vlr. Total])-ROW(A6),0,1)),--(BMVT13[Situação]=\"Regular\"))","v":6200.6999999999989}]
[]
["Matrícula","Empregado","Vínculo","Lotação","Setor","Rota","Situação","Origem","Destino","Tipo","Empresa","Vales/Trecho","Chipagem","Quant. Apur.","Qtd. Solic.","Dias Lanc Sist.","Vlr. Unit.","Vlr. Total",null,null,null,null,4,"Período",null,"Feriados",null,"Compensações",null,null,"DU"]
["000.001","João","Anistiado","Salvador","ADMINISTRATIVO","xxxxx-Y","Regular","Dias D'Ávila","Camaçari","Intermunicipal","Cidade das Águas",2,2,40,40,20,2.8,112,null,null,null,null,"Janeiro","2016-01-01","2016-01-31","2016-01-01",null,null,null,null,{"$f":"NETWORKDAYS(X6,Y6,Z6:AD6)","v":20},{"$f":"COUNTA(AB6:AD6)","v":0}]
["000.002","Maria","Anistiado","Salvador","ADMINISTRATIVO",23196,"Regular","Alagoinhas","Salvador","Intermunicipal","Cidade Sol",2,2,40,40,20,28.35,1134,null,null,null,null,"Fevereiro","2016-02-01","2016-02-29","2016-02-08",null,"2016-02-09","2016-02-10",null,{"$f":"NETWORKDAYS(X7,Y7,Z7:AD7)","v":18},{"$f":"COUNTA(AB7:AD7)","v":2}]
["000.003","Francisco","Anistiado","Salvador","ADMINISTRATIVO",23184,"Regular","Jequié","Ipiaú","Intermunicipal","Cidade Sol",2,2,40,48,24,10.65,511.20000000000005,null,null,null,null,"Março","2016-03-01","2016-03-31","2016-03-25",null,"2016-03-24",null,null,{"$f":"NETWORKDAYS(X8,Y8,Z8:AD8)","v":21},1]
["000.004","Ricardo","Empregado","Salvador","ADMINISTRATIVO",23183,"Regular","Feira de Santana","Feira de Santana","Urbano","Via Feira",2,2,40,0,0,3.1,0,null,null,null,null,"Abril","2016-04-01","2016-04-30","2016-04-21",null,"2016-01-22",null,null,20,1]
["000.005","Mauro","Empregado","Salvador","ADMINISTRATIVO",23183,"Regular","Feira de Santana","Feira de Santana","Urbano","Via Feira",2,2,40,40,20,3.1,124,null,null,null,null,"Maio","2016-05-01","2016-05-31","2016-05-26",null,"2016-05-27",null,null,20,1]
["000.006","Marcio","Empregado","Salvador","ADMINISTRATIVO","23125-M","Regular","Conceição de Feira","Salvador","Intermunicipal","Viação Jauá",2,2,40,10,5,23.03,230.3,null,null,null,null,"Junho","2016-06-01","2016-06-30",null,null,null,null,null,22,0]
["000.007","Carla","Empregado","Salvador","ADMINISTRATIVO","23125-M","Regular","Conceição de Feira","Salvador","Intermunicipal","Viação Jauá",2,2,40,40,20,23.03,921.2,null,null,null,null,"Julho","2016-07-01","2016-07-31",null,null,null,null,null,21,0]
["000.008","Caroline","Empregado","Salvador","COMERCIAL","23190-V","Regular","Lauro de Freitas","Salvador","Intermunicipal","Metropasse",2,2,40,40,20,3.3,132,null,null,null,null,"Agosto","2016-08-01","2016-08-31",null,null,null,null,null,23,0]
["000.009","Pedro","Empregado","Salvador","COMERCIAL","23190-V","Regular","Lauro de Freitas","Salvador","Intermunicipal","Metropasse",2,2,40,0,0,3.3,0,null,null,null,null,"Setembro","2016-09-01","2016-09-30","2016-09-07",null,null,null,null,21,0]
["000.010","Paulo","Empregado","Salvador","COMERCIAL","23190-V","Regular","Lauro de Freitas","Salvador","Intermunicipal","Metropasse",2,2,40,40,20,3.3,132,null,null,null,null,"Outubro","2016-10-01","2016-10-31","2016-10-12",null,null,null,null,20,0]
["000.011","Rafael","Empregado","Salvador","COMERCIAL","23190-V","Regular","Lauro de Freitas","Salvador","Intermunicipal","Metropasse",2,2,40,40,20,3.3,132,null,null,null,null,"Novembro","2016-11-01","2016-11-30","2016-11-02","2016-11-15","2016-11-14",null,null,{"$f":"NETWORKDAYS(X16,Y16,Z16:AD16)","v":19},1]
["000.012","Ricardo","Empregado","Salvador","COMERCIAL","23170-I","Regular","Aracaju","Aracaju","Urbano","Aracaju Card",2,2,40,52,26,3.1,161.20000000000002,null,null,null,null,"Dezembro","2016-12-01","2016-12-31",null,null,null,null,null,22,0]
["000.013","Jose","Empregado","Salvador","COMERCIAL","xxxxx-Y (Pool)","Regular","Feira de Santana","Camaçari","Intermunicipal","Lis Transportes",2,2,40,10,5,650,650]
["000.014","Felipe","Empregado","Salvador","COMERCIAL",23182,"Regular","Amélia Rodrigues","Governador Mangabeira","Intermunicipal","RD Transportes",2,2,40,25,12.5,10.06,251.5]
["000.015","Julio","Empregado","Salvador","COMERCIAL","23101-A (09096)","Regular","Salvador","Salvador","Urbano","Salvador Card",2,4,40,40,10,3.3,132]
["000.016","Lucia","Empregado","Salvador","PESSOAL","23101-A (09096)","Regular","Salvador","Salvador","Urbano","Salvador Card",2,2,40,42,21,3.3,138.6]
["000.017","Luciano","Empregado","Salvador","PESSOAL","23101-A (09096)","Regular","Salvador","Salvador","Urbano","Salvador Card",0,0,0,0,0,3.3,0]
["000.018","Bruno","Empregado","Salvador","PESSOAL","23101-A (09096)","Regular","Salvador","Salvador","Urbano","Salvador Card",2,2,40,40,20,3.3,132]
["000.019","Vinicius","Anistiado","Salvador","PESSOAL","23101-A (09096)","Regular","Salvador","Salvador","Urbano","Salvador Card",2,2,40,40,20,3.3,132]
["000.020","José Carlos","Empregado","Salvador","LOGISTICA","23101-A (09096)","Regular","Salvador","Salvador","Urbano","Salvador Card",2,2,40,40,20,3.3,132]
["000.021","Carlos","Empregado","Salvador","LOGISTICA","23101-A (09096)","Regular","Salvador","Salvador","Urbano","Salvador Card",2,2,40,40,20,3.3,132]
["000.022","Miguel","Empregado","Salvador","LOGISTICA","23101-A (09096)","Regular","Salvador","Salvador","Urbano","Salvador Card",2,2,40,40,20,3.3,132]
["000.023","Gustavo","Empregado","Salvador","FINANCEIRO","23101-A (09096)","Regular","Salvador","Salvador","Urbano","Salvador Card",4,4,80,80,20,3.3,264]
["000.024","Guilherme","Empregado","Salvador","FINANCEIRO","23101-A (09096)","Irregular","Salvador","Salvador","Urbano","Salvador Card",0,0,0,0,0,3.3,0]
["000.025","Bruno Brito","Empregado","Salvador","FINANCEIRO","23101-A (09096)","Regular","Salvador","Salvador","Urbano","Salvador Card",2,2,40,14,7,3.3,46.199999999999996]
[null,"","","","",null,null,"","","","",null,0,0,0,0,0,0]
[null,"","","","",null,null,"","","","",null,0,0,0,0,0,0]
[null,"","","","",null,null,"","","","",null,0,0,0,0,0,0]
[null,"","","","",null,null,"","","","",null,0,0,0,0,0,0]
[null,"","","","",null,null,"","","","",null,0,0,0,0,0,0]
[null,"","","","",null,null,"","","","",null,0,0,0,0,0,0]
[null,"","","","",null,null,"","","","",null,0,0,0,0,0,0]
[null,"","","","",null,null,"","","","",null,0,0,0,0,0,0]
[null,"","","","",null,null,"","","","",null,0,0,0,0,0,0]
[null,"","","","",null,null,"","","","",null,0,0,0,0,0,0]
[null,"","","","",null,null,"","","","",null,0,0,0,0,0,0]
[null,"","","","",null,null,"","","","",null,0,0,0,0,0,0]
[null,"","","","",null,null,"","","","",null,0,0,0,0,0,0]
[null,"","","","",null,null,"","","","",null,0,0,0,0,0,0]
[null,"","","","",null,null,"","","","",null,0,0,0,0,0,0]
[null,"","","","",null,null,"","","","",null,0,0,0,0,0,0]
[null,"","","","",null,null,"","","","",null,0,0,0,0,0,0]
[null,"","","","",null,null,"","","","",null,0,0,0,0,0,0]
[null,"","","","",null,null,"","","","",null,0,0,0,0,0,0]
[null,"","","","",null,null,"","","","",null,0,0,0,0,0,0]
[null,"","","","",null,null,"","","","",null,0,0,0,0,0,0]
[null,"","","","",null,null,"","","","",null,0,0,0,0,0,0]
[null,"","","","",null,null,"","","","",null,0,0,0,0,0,0]
[null,"","","","",null,null,"","","","",null,0,0,0,0,0,0]
[null,"","","","",null,null,"","","","",null,0,0,0,0,0,0]
[null,"","","","",null,null,"","","","",null,0,0,0,0,0,0]
[null,"","","","",null,null,"","","","",null,0,0,0,0,0,0]
[null,"","","","",null,null,"","","","",null,0,0,0,0,0,0]
[null,"","","","",null,null,"","","","",null,0,0,0,0,0,0]
[null,"","","","",null,null,"","","","",null,0,0,0,0,0,0]
[null,"","","","",null,null,"","","","",null,0,0,0,0,0,0]
[null,"","","","",null,null,"","","","",null,0,0,0,0,0,0]
[null,"","","","",null,null,"","","","",null,0,0,0,0,0,0]
[null,"","","","",null,null,"","","","",null,0,0,0,0,0,0]
[null,"","","","",null,null,"","","","",null,0,0,0,0,0,0]
[null,"","","","",null,null,"","","","",null,0,0,0,0,0,0]
[null,"","","","",null,null,"","","","",null,0,0,0,0,0,0]
[null,"","","","",null,null,"","","","",null,0,0,0,0,0,0]
[null,"","","","",null,null,"","","","",null,0,0,0,0,0,0]
[null,"","","","",null,null,"","","","",null,0,0,0,0,0,0]
[null,"","","","",null,null,"","","","",null,0,0,0,0,0,0]
[null,"","","","",null,null,"","","","",null,0,0,0,0,0,0]
[252069,"Aleandesson Florencio Fontes","Aprendiz","Complexo Pituaçu","DRAS","23170-I","Regular","Aracaju","Aracaju","Urbano","Aracaju Card",2,2,38,4,2,3.1,12.4]
[252077,"Dinnyster Bruno Costa Santos","Aprendiz","Complexo Pituaçu","DRAS","23170-I","Regular","Aracaju","Aracaju","Urbano","Aracaju Card",2,2,38,4,2,3.1,12.4]
[252085,"Ianny Monic Santos Brasileiro","Aprendiz","Complexo Pituaçu","DRAS","23170-I","Regular","Aracaju","Aracaju","Urbano","Aracaju Card",2,2,38,4,2,3.1,12.4]
[218510,"José Leônio de Goes Guimarães","Empregado","Complexo Jardim","SSMA","23170-I","Regular","Aracaju","Aracaju","Urbano","Aracaju Card",2,2,38,38,19,3.1,117.8]
[215856,"Job Cláudio dos Santos Nascimento","Empregado","Jardim","SSMA","23170-I","Regular","Aracaju","Aracaju","Urbano","Aracaju Card",2,2,38,38,19,3.1,117.8]
[220213,"Alexsandro de Oliveira Barboza","Empregado","Complexo Funil","SSMF",23185,"Regular","Itabuna","Ubaitaba","Intermunicipal","Águia Branca",0,0,0,0,{"$error":"#DIV/0!"},13.47,0]
[114243,"Fernando Cardoso Soares","Empregado","Pituaçu","SSTL",23195,"Regular","Salvador","Vera Cruz (Mar Grande)","Intermunicipal","Vera Cruz Transportes",2,2,38,38,19,5.15,195.7]
[null,null,null,null,null,null,""]
["Total",null,null,null,null,null,null,null,null,null,null,null,{"$f":"SUBTOTAL(109,BMVT13[Chipagem])","v":62},{"$f":"SUBTOTAL(109,BMVT13[Quant. Apur.])","v":1188},{"$f":"SUBTOTAL(109,BMVT13[Qtd. Solic.])","v":927},{"$f":"SUBTOTAL(109,BMVT13[Dias Lanc Sist.])","v":{"$error":"#DIV/0!"}},null,{"$f":"SUBTOTAL(109,BMVT13[Vlr. Total])","v":6200.6999999999989}]
[]
[]
[]
[{"$f":"\"Salvador, \"&TEXT(TODAY(),\"dd/mm/aaaa\")","v":"Salvador, 29/06/2016"},null,null,null,null,null,{"$f":"A85","v":"Salvador, 29/06/2016"}]
[]
[]
[]
["Responsável pelo Boletim de Medição",null,null,null,null,null,"Gerente Serviço de Pessoal de Salvador -SSPE"]

{"sheet":"Março","index":6,"n_rows":86,"n_cols":32,"rows_kept":86,"cut":false,"hidden":false,"merged":[[4,25,4,26],[4,27,4,29],[81,0,81,2],[0,0,2,2],[0,14,0,15],[1,3,2,3],[1,14,1,15],[2,14,2,15],[4,23,4,24]]}
["Boletim Mensal de Vales Transporte",null,null,"Competência:",null,"Dias Úteis (Mês):",{"$f":"VLOOKUP(INDEX($W$6:$AF$17,$W$5,1),$W$6:$AF$17,9,FALSE)","v":21},null,"SC (Empregado):",0,{"$f":"(SUMIFS(BMVT12[Vlr. Total],BMVT12[Vínculo],\"<>Aprendiz\",BMVT12[Empresa], \"Salvador Card\"))-J1","v":1300.2},null,null,"Qtd Usuários",{"$f":"SUMPRODUCT(SUBTOTAL(3,OFFSET(BMVT12[Matrícula],ROW(BMVT12[Matrícula])-ROW(A6),0,1)),--(BMVT12[Situação]=\"Regular\"))","v":24}]
[null,null,null,{"$f":"VLOOKUP(INDEX($W$6:$AF$17,$W$5,1),$W$6:$AF$17,1,FALSE)","v":"Março"},null,"Compesações:",{"$f":"VLOOKUP(INDEX($W$6:$AF$17,$W$5,1),$W$6:$AF$17,10,FALSE)","v":1},null,"SC (Aprendiz):",0,{"$f":"(SUMIFS(BMVT12[Vlr. Total],BMVT12[Vínculo],\"Aprendiz\",BMVT12[Empresa],\"Salvador Card\"))-J2","v":0},null,null,"Qtd VT :",{"$f":"SUMPRODUCT(SUBTOTAL(9,OFFSET(BMVT12[Qtd. Solic.],ROW(BMVT12[Qtd. Solic.])-ROW(A6),0,1)),--(BMVT12[Situação]=\"Regular\"))","v":835}]
[null,null,null,null,null,"Desconto :",0,null,"Metropasse:",null,{"$f":"(SUMIF(BMVT12[Empresa],\"Metropasse\",BMVT12[Vlr. Total]))-J3","v":415.79999999999995},null,null,"Valor Total:",{"$f":"SUMPRODUCT(SUBTOTAL(9,OFFSET(BMVT12[Vlr. Total],ROW(BMVT12[Vlr. Total])-ROW(A6),0,1)),--(BMVT12[Situação]=\"Regular\"))","v":5932.1600000000017}]
[]
["Matrícula","Empregado","Vínculo","Lotação","Setor","Rota","Situação","Origem","Destino","Tipo","Empresa","Vales/Trecho","Chipagem","Quant. Apur.","Qtd. Solic.","Dias Lanc Sist.","Vlr. Unit.","Vlr. Total",null,null,null,null,3,"Período",null,"Feriados",null,"Compensações",null,null,"DU"]
["000.001","João","Anistiado","Salvador","ADMINISTRATIVO","xxxxx-Y","Regular","Dias D'Ávila","Camaçari","Intermunicipal","Cidade das Águas",2,2,42,42,21,2.8,117.6,null,null,null,null,"Janeiro","2016-01-01","2016-01-31","2016-01-01",null,null,null,null,{"$f":"NETWORKDAYS(X6,Y6,Z6:AD6)","v":20},{"$f":"COUNTA(AB6:AD6)","v":0}]
["000.002","Maria","Anistiado","Salvador","ADMINISTRATIVO",23196,"Regular","Alagoinhas","Salvador","Intermunicipal","Cidade Sol",2,2,42,42,21,28.35,1190.7,null,null,null,null,"Fevereiro","2016-02-01","2016-02-29","2016-02-08",null,"2016-02-09","2016-02-10",null,{"$f":"NETWORKDAYS(X7,Y7,Z7:AD7)","v":18},{"$f":"COUNTA(AB7:AD7)","v":2}]
["000.003","Francisco","Anistiado","Salvador","ADMINISTRATIVO",23184,"Regular","Jequié","Ipiaú","Intermunicipal","Cidade Sol",2,2,42,48,24,10.65,511.20000000000005,null,null,null,null,"Março","2016-03-01","2016-03-31","2016-03-25",null,"2016-03-24",null,null,{"$f":"NETWORKDAYS(X8,Y8,Z8:AD8)","v":21},1]
["000.004","Ricardo","Empregado","Salvador","ADMINISTRATIVO",23183,"Regular","Feira de Santana","Feira de Santana","Urbano","Via Feira",2,2,42,0,0,3.1,0,null,null,null,null,"Abril","2016-04-01","2016-04-30","2016-04-21",null,"2016-01-22",null,null,20,1]
["000.005","Mauro","Empregado","Salvador","ADMINISTRATIVO",23183,"Regular","Feira de Santana","Feira de Santana","Urbano","Via Feira",2,2,42,42,21,3.1,130.20000000000002,null,null,null,null,"Maio","2016-05-01","2016-05-31","2016-05-26",null,"2016-05-27",null,null,20,1]
["000.006","Marcio","Empregado","Salvador","ADMINISTRATIVO","23125-M","Regular","Conceição de Feira","Salvador","Intermunicipal","Viação Jauá",2,2,42,10,5,23.03,230.3,null,null,null,null,"Junho","2016-06-01","2016-06-30",null,null,null,null,null,22,0]
["000.007","Carla","Empregado","Salvador","ADMINISTRATIVO","23125-M","Regular","Conceição de Feira","Salvador","Intermunicipal","Viação Jauá",2,2,42,42,21,23.03,967.26,null,null,null,null,"Julho","2016-07-01","2016-07-31",null,null,null,null,null,21,0]
["000.008","Caroline","Empregado","Salvador","COMERCIAL","23190-V","Regular","Lauro de Freitas","Salvador","Intermunicipal","Metropasse",2,2,42,42,21,3.3,138.6,null,null,null,null,"Agosto","2016-08-01","2016-08-31",null,null,null,null,null,23,0]
["000.009","Pedro","Empregado","Salvador","COMERCIAL","23190-V","Regular","Lauro de Freitas","Salvador","Intermunicipal","Metropasse",2,2,42,0,0,3.3,0,null,null,null,null,"Setembro","2016-09-01","2016-09-30","2016-09-07",null,null,null,null,21,0]
["000.010","Paulo","Empregado","Salvador","COMERCIAL","23190-V","Regular","Lauro de Freitas","Salvador","Intermunicipal","Metropasse",2,2,42,42,21,3.3,138.6,null,null,null,null,"Outubro","2016-10-01","2016-10-31","2016-10-12",null,null,null,null,20,0]
["000.011","Rafael","Empregado","Salvador","COMERCIAL","23190-V","Regular","Lauro de Freitas","Salvador","Intermunicipal","Metropasse",2,2,42,42,21,3.3,138.6,null,null,null,null,"Novembro","2016-11-01","2016-11-30","2016-11-02","2016-11-15","2016-11-14",null,null,{"$f":"NETWORKDAYS(X16,Y16,Z16:AD16)","v":19},1]
["000.012","Ricardo","Empregado","Salvador","COMERCIAL","23170-I","Regular","Aracaju","Aracaju","Urbano","Aracaju Card",2,2,42,54,27,3.1,167.4,null,null,null,null,"Dezembro","2016-12-01","2016-12-31",null,null,null,null,null,22,0]
["000.013","Jose","Empregado","Salvador","COMERCIAL","xxxxx-Y (Pool)","Regular","Feira de Santana","Camaçari","Intermunicipal","Lis Transportes",2,2,42,10,5,650,650]
["000.014","Felipe","Empregado","Salvador","COMERCIAL",23182,"Regular","Amélia Rodrigues","Governador Mangabeira","Intermunicipal","RD Transportes",2,2,42,25,12.5,10.06,251.5]
["000.015","Julio","Empregado","Salvador","COMERCIAL","23101-A (09096)","Regular","Salvador","Salvador","Urbano","Salvador Card",2,4,42,42,10.5,3.3,138.6]
["000.016","Lucia","Empregado","Salvador","PESSOAL","23101-A (09096)","Regular","Salvador","Salvador","Urbano","Salvador Card",2,2,42,44,22,3.3,145.19999999999999]
["000.017","Luciano","Empregado","Salvador","PESSOAL","23101-A (09096)","Regular","Salvador","Salvador","Urbano","Salvador Card",0,0,0,0,0,3.3,0]
["000.018","Bruno","Empregado","Salvador","PESSOAL","23101-A (09096)","Regular","Salvador","Salvador","Urbano","Salvador Card",2,2,42,42,21,3.3,138.6]
["000.019","Vinicius","Anistiado","Salvador","PESSOAL","23101-A (09096)","Regular","Salvador","Salvador","Urbano","Salvador Card",2,2,42,42,21,3.3,138.6]
["000.020","José Carlos","Empregado","Salvador","LOGISTICA","23101-A (09096)","Regular","Salvador","Salvador","Urbano","Salvador Card",2,2,42,42,21,3.3,138.6]
["000.021","Carlos","Empregado","Salvador","LOGISTICA","23101-A (09096)","Regular","Salvador","Salvador","Urbano","Salvador Card",2,2,42,42,21,3.3,138.6]
["000.022","Miguel","Empregado","Salvador","LOGISTICA","23101-A (09096)","Regular","Salvador","Salvador","Urbano","Salvador Card",2,2,42,42,21,3.3,138.6]
["000.023","Gustavo","Empregado","Salvador","FINANCEIRO","23101-A (09096)","Regular","Salvador","Salvador","Urbano","Salvador Card",4,4,84,84,21,3.3,277.2]
["000.024","Guilherme","Empregado","Salvador","FINANCEIRO","23101-A (09096)","Irregular","Salvador","Salvador","Urbano","Salvador Card",0,0,0,0,0,3.3,0]
["000.025","Bruno Brito","Empregado","Salvador","FINANCEIRO","23101-A (09096)","Regular","Salvador","Salvador","Urbano","Salvador Card",2,2,42,14,7,3.3,46.199999999999996]
[null,"","","","",null,null,"","","","",null,0,0,0,0,0,0]
[null,"","","","",null,null,"","","","",null,0,0,0,0,0,0]
[null,"","","","",null,null,"","","","",null,0,0,0,0,0,0]
[null,"","","","",null,null,"","","","",null,0,0,0,0,0,0]
[null,"","","","",null,null,"","","","",null,0,0,0,0,0,0]
[null,"","","","",null,null,"","","","",null,0,0,0,0,0,0]
[null,"","","","",null,null,"","","","",null,0,0,0,0,0,0]
[null,"","","","",null,null,"","","","",null,0,0,0,0,0,0]
[null,"","","","",null,null,"","","","",null,0,0,0,0,0,0]
[null,"","","","",null,null,"","","","",null,0,0,0,0,0,0]
[null,"","","","",null,null,"","","","",null,0,0,0,0,0,0]
[null,"","","","",null,null,"","","","",null,0,0,0,0,0,0]
[null,"","","","",null,null,"","","","",null,0,0,0,0,0,0]
[null,"","","","",null,null,"","","","",null,0,0,0,0,0,0]
[null,"","","","",null,null,"","","","",null,0,0,0,0,0,0]
[null,"","","","",null,null,"","","","",null,0,0,0,0,0,0]
[null,"","","","",null,null,"","","","",null,0,0,0,0,0,0]
[null,"","","","",null,null,"","","","",null,0,0,0,0,0,0]
[null,"","","","",null,null,"","","","",null,0,0,0,0,0,0]
[null,"","","","",null,null,"","","","",null,0,0,0,0,0,0]
[null,"","","","",null,null,"","","","",null,0,0,0,0,0,0]
[null,"","","","",null,null,"","","","",null,0,0,0,0,0,0]
[null,"","","","",null,null,"","","","",null,0,0,0,0,0,0]
[null,"","","","",null,null,"","","","",null,0,0,0,0,0,0]
[null,"","","","",null,null,"","","","",null,0,0,0,0,0,0]
[null,"","","","",null,null,"","","","",null,0,0,0,0,0,0]
[null,"","","","",null,null,"","","","",null,0,0,0,0,0,0]
[null,"","","","",null,null,"","","","",null,0,0,0,0,0,0]
[null,"","","","",null,null,"","","","",null,0,0,0,0,0,0]
[null,"","","","",null,null,"","","","",null,0,0,0,0,0,0]
[null,"","","","",null,null,"","","","",null,0,0,0,0,0,0]
[null,"","","","",null,null,"","","","",null,0,0,0,0,0,0]
[null,"","","","",null,null,"","","","",null,0,0,0,0,0,0]
[null,"","","","",null,null,"","","","",null,0,0,0,0,0,0]
[null,"","","","",null,null,"","","","",null,0,0,0,0,0,0]
[null,"","","","",null,null,"","","","",null,0,0,0,0,0,0]
[null,"","","","",null,null,"","","","",null,0,0,0,0,0,0]
[null,"","","","",null,null,"","","","",null,0,0,0,0,0,0]
[null,"","","","",null,null,"","","","",null,0,0,0,0,0,0]
[null,"","","","",null,null,"","","","",null,0,0,0,0,0,0]
[null,"","","","",null,null,"","","","",null,0,0,0,0,0,0]
[null,"","","","",null,null,"","","","",null,0,0,0,0,0,0]
[null,"","","","",null,null,"","","","",null,0,0,0,0,0,0]
[null,"","","","",null,"","","","","",null,0,0,0,0,0,0]
[null,"","","","",null,"","","","","",null,0,0,0,0,0,0]
[null,"","","","",null,"","","","","",null,0,0,0,0,0,0]
[null,"","","","",null,"","","","","",null,0,0,0,0,0,0]
[null,null,null,null,null,null,""]
[null,null,null,null,null,null,""]
[null,null,null,null,null,null,""]
["Total",null,null,null,null,null,null,null,null,null,null,null,{"$f":"SUBTOTAL(109,BMVT12[Chipagem])","v":50},{"$f":"SUBTOTAL(109,BMVT12[Quant. Apur.])","v":1008},{"$f":"SUBTOTAL(109,BMVT12[Qtd. Solic.])","v":835},{"$f":"SUBTOTAL(109,BMVT12[Dias Lanc Sist.])","v":386},null,{"$f":"SUBTOTAL(109,BMVT12[Vlr. Total])","v":5932.1600000000017}]
[{"$f":"\"Salvador, \"&TEXT(TODAY(),\"dd/mm/aaaa\")","v":"Salvador, 29/06/2016"},null,null,null,null,null,{"$f":"A82","v":"Salvador, 29/06/2016"}]
[]
[]
[]
["Responsável pelo Boletim de Medição",null,null,null,null,null,"Gerente Serviço de Pessoal de Salvador -SSPE"]

{"sheet":"Fevereiro","index":7,"n_rows":86,"n_cols":32,"rows_kept":86,"cut":false,"hidden":false,"merged":[[4,25,4,26],[4,27,4,29],[81,0,81,2],[0,0,2,2],[0,14,0,15],[1,3,2,3],[1,14,1,15],[2,14,2,15],[4,23,4,24]]}
["Boletim Mensal de Vales Transporte",null,null,"Competência:",null,"Dias Úteis (Mês):",{"$f":"VLOOKUP(INDEX($W$7:$AF$18,$W$5,1),$W$7:$AF$18,9,FALSE)","v":18},null,"SC (Empregado):",0,{"$f":"(SUMIFS(BMVT15[Vlr. Total],BMVT15[Vínculo],\"<>Aprendiz\",BMVT15[Empresa], \"Salvador Card\"))-J1","v":1122},null,null,"Qtd Usuários",{"$f":"SUMPRODUCT(SUBTOTAL(3,OFFSET(BMVT15[Matrícula],ROW(BMVT15[Matrícula])-ROW(A6),0,1)),--(BMVT15[Situação]=\"Regular\"))","v":24}]
[null,null,null,{"$f":"VLOOKUP(INDEX($W$7:$AF$18,$W$5,1),$W$7:$AF$18,1,FALSE)","v":"Fevereiro"},null,"Compesações:",{"$f":"VLOOKUP(INDEX($W$7:$AF$18,$W$5,1),$W$7:$AF$18,10,FALSE)","v":2},null,"SC (Aprendiz):",0,{"$f":"(SUMIFS(BMVT15[Vlr. Total],BMVT15[Vínculo],\"Aprendiz\",BMVT15[Empresa],\"Salvador Card\"))-J2","v":0},null,null,"Qtd VT :",{"$f":"SUMPRODUCT(SUBTOTAL(9,OFFSET(BMVT15[Qtd. Solic.],ROW(BMVT15[Qtd. Solic.])-ROW(A6),0,1)),--(BMVT15[Situação]=\"Regular\"))","v":733}]
[null,null,null,null,null,"Desconto :",0,null,"Metropasse:",null,{"$f":"(SUMIF(BMVT15[Empresa],\"Metropasse\",BMVT15[Vlr. Total]))-J3","v":356.4},null,null,"Valor Total:",{"$f":"SUMPRODUCT(SUBTOTAL(9,OFFSET(BMVT15[Vlr. Total],ROW(BMVT15[Vlr. Total])-ROW(A6),0,1)),--(BMVT15[Situação]=\"Regular\"))","v":5332.2800000000016}]
[]
["Matrícula","Empregado","Vínculo","Lotação","Setor","Rota","Situação","Origem","Destino","Tipo","Empresa","Vales/Trecho","Chipagem","Quant. Apur.","Qtd. Solic.","Dias Lanc Sist.","Vlr. Unit.","Vlr. Total",null,null,null,null,2,"Período",null,"Feriados",null,"Compensações",null,null,"DU"]
["000.001","João","Anistiado","Salvador","ADMINISTRATIVO","xxxxx-Y","Regular","Dias D'Ávila","Camaçari","Intermunicipal","Cidade das Águas",2,2,36,36,18,2.8,100.8]
["000.002","Maria","Anistiado","Salvador","ADMINISTRATIVO",23196,"Regular","Alagoinhas","Salvador","Intermunicipal","Cidade Sol",2,2,36,36,18,28.35,1020.6,null,null,null,null,"Janeiro","2016-01-01","2016-01-31","2016-01-01",null,null,null,null,{"$f":"NETWORKDAYS(X7,Y7,Z7:AD7)","v":20},{"$f":"COUNTA(AB7:AD7)","v":0}]
["000.003","Francisco","Anistiado","Salvador","ADMINISTRATIVO",23184,"Regular","Jequié","Ipiaú","Intermunicipal","Cidade Sol",2,2,36,48,24,10.65,511.20000000000005,null,null,null,null,"Fevereiro","2016-02-01","2016-02-29","2016-02-08",null,"2016-02-09","2016-02-10",null,{"$f":"NETWORKDAYS(X8,Y8,Z8:AD8)","v":18},{"$f":"COUNTA(AB8:AD8)","v":2}]
["000.004","Ricardo","Empregado","Salvador","ADMINISTRATIVO",23183,"Regular","Feira de Santana","Feira de Santana","Urbano","Via Feira",2,2,36,0,0,3.1,0,null,null,null,null,"Março","2016-03-01","2016-03-31","2016-03-25",null,"2016-03-24",null,null,{"$f":"NETWORKDAYS(X9,Y9,Z9:AD9)","v":21},1]
["000.005","Mauro","Empregado","Salvador","ADMINISTRATIVO",23183,"Regular","Feira de Santana","Feira de Santana","Urbano","Via Feira",2,2,36,36,18,3.1,111.60000000000001,null,null,null,null,"Abril","2016-04-01","2016-04-30","2016-04-21",null,"2016-01-22",null,null,20,1]
["000.006","Marcio","Empregado","Salvador","ADMINISTRATIVO","23125-M","Regular","Conceição de Feira","Salvador","Intermunicipal","Viação Jauá",2,2,36,10,5,23.03,230.3,null,null,null,null,"Maio","2016-05-01","2016-05-31","2016-05-26",null,"2016-05-27",null,null,20,1]
["000.007","Carla","Empregado","Salvador","ADMINISTRATIVO","23125-M","Regular","Conceição de Feira","Salvador","Intermunicipal","Viação Jauá",2,2,36,36,18,23.03,829.08,null,null,null,null,"Junho","2016-06-01","2016-06-30",null,null,null,null,null,22,0]
["000.008","Caroline","Empregado","Salvador","COMERCIAL","23190-V","Regular","Lauro de Freitas","Salvador","Intermunicipal","Metropasse",2,2,36,36,18,3.3,118.8,null,null,null,null,"Julho","2016-07-01","2016-07-31",null,null,null,null,null,21,0]
["000.009","Pedro","Empregado","Salvador","COMERCIAL","23190-V","Regular","Lauro de Freitas","Salvador","Intermunicipal","Metropasse",2,2,36,0,0,3.3,0,null,null,null,null,"Agosto","2016-08-01","2016-08-31",null,null,null,null,null,23,0]
["000.010","Paulo","Empregado","Salvador","COMERCIAL","23190-V","Regular","Lauro de Freitas","Salvador","Intermunicipal","Metropasse",2,2,36,36,18,3.3,118.8,null,null,null,null,"Setembro","2016-09-01","2016-09-30","2016-09-07",null,null,null,null,21,0]
["000.011","Rafael","Empregado","Salvador","COMERCIAL","23190-V","Regular","Lauro de Freitas","Salvador","Intermunicipal","Metropasse",2,2,36,36,18,3.3,118.8,null,null,null,null,"Outubro","2016-10-01","2016-10-31","2016-10-12",null,null,null,null,20,0]
["000.012","Ricardo","Empregado","Salvador","COMERCIAL","23170-I","Regular","Aracaju","Aracaju","Urbano","Aracaju Card",2,2,36,48,24,3.1,148.80000000000001,null,null,null,null,"Novembro","2016-11-01","2016-11-30","2016-11-02","2016-11-15","2016-11-14",null,null,{"$f":"NETWORKDAYS(X17,Y17,Z17:AD17)","v":19},1]
["000.013","Jose","Empregado","Salvador","COMERCIAL","xxxxx-Y (Pool)","Regular","Feira de Santana","Camaçari","Intermunicipal","Lis Transportes",2,2,36,10,5,650,650,null,null,null,null,"Dezembro","2016-12-01","2016-12-31",null,null,null,null,null,22,0]
["000.014","Felipe","Empregado","Salvador","COMERCIAL",23182,"Regular","Amélia Rodrigues","Governador Mangabeira","Intermunicipal","RD Transportes",2,2,36,25,12.5,10.06,251.5]
["000.015","Julio","Empregado","Salvador","COMERCIAL","23101-A (09096)","Regular","Salvador","Salvador","Urbano","Salvador Card",2,4,36,36,9,3.3,118.8]
["000.016","Lucia","Empregado","Salvador","PESSOAL","23101-A (09096)","Regular","Salvador","Salvador","Urbano","Salvador Card",2,2,36,38,19,3.3,125.39999999999999]
["000.017","Luciano","Empregado","Salvador","PESSOAL","23101-A (09096)","Regular","Salvador","Salvador","Urbano","Salvador Card",0,0,0,0,0,3.3,0]
["000.018","Bruno","Empregado","Salvador","PESSOAL","23101-A (09096)","Regular","Salvador","Salvador","Urbano","Salvador Card",2,2,36,36,18,3.3,118.8]
["000.019","Vinicius","Anistiado","Salvador","PESSOAL","23101-A (09096)","Regular","Salvador","Salvador","Urbano","Salvador Card",2,2,36,36,18,3.3,118.8]
["000.020","José Carlos","Empregado","Salvador","LOGISTICA","23101-A (09096)","Regular","Salvador","Salvador","Urbano","Salvador Card",2,2,36,36,18,3.3,118.8]
["000.021","Carlos","Empregado","Salvador","LOGISTICA","23101-A (09096)","Regular","Salvador","Salvador","Urbano","Salvador Card",2,2,36,36,18,3.3,118.8]
["000.022","Miguel","Empregado","Salvador","LOGISTICA","23101-A (09096)","Regular","Salvador","Salvador","Urbano","Salvador Card",2,2,36,36,18,3.3,118.8]
["000.023","Gustavo","Empregado","Salvador","FINANCEIRO","23101-A (09096)","Regular","Salvador","Salvador","Urbano","Salvador Card",4,4,72,72,18,3.3,237.6]
["000.024","Guilherme","Empregado","Salvador","FINANCEIRO","23101-A (09096)","Irregular","Salvador","Salvador","Urbano","Salvador Card",0,0,0,0,0,3.3,0]
["000.025","Bruno Brito","Empregado","Salvador","FINANCEIRO","23101-A (09096)","Regular","Salvador","Salvador","Urbano","Salvador Card",2,2,36,14,7,3.3,46.199999999999996]
[null,"","","","",null,null,"","","","",null,0,0,0,0,0,0]
[null,"","","","",null,null,"","","","",null,0,0,0,0,0,0]
[null,"","","","",null,null,"","","","",null,0,0,0,0,0,0]
[null,"","","","",null,null,"","","","",null,0,0,0,0,0,0]
[null,"","","","",null,null,"","","","",null,0,0,0,0,0,0]
[null,"","","","",null,null,"","","","",null,0,0,0,0,0,0]
[null,"","","","",null,null,"","","","",null,0,0,0,0,0,0]
[null,"","","","",null,null,"","","","",null,0,0,0,0,0,0]
[null,"","","","",null,null,"","","","",null,0,0,0,0,0,0]
[null,"","","","",null,null,"","","","",null,0,0,0,0,0,0]
[null,"","","","",null,null,"","","","",null,0,0,0,0,0,0]
[null,"","","","",null,null,"","","","",null,0,0,0,0,0,0]
[null,"","","","",null,null,"","","","",null,0,0,0,0,0,0]
[null,"","","","",null,null,"","","","",null,0,0,0,0,0,0]
[null,"","","","",null,null,"","","","",null,0,0,0,0,0,0]
[null,"","","","",null,null,"","","","",null,0,0,0,0,0,0]
[null,"","","","",null,null,"","","","",null,0,0,0,0,0,0]
[null,"","","","",null,null,"","","","",null,0,0,0,0,0,0]
[null,"","","","",null,null,"","","","",null,0,0,0,0,0,0]
[null,"","","","",null,null,"","","","",null,0,0,0,0,0,0]
[null,"","","","",null,null,"","","","",null,0,0,0,0,0,0]
[null,"","","","",null,null,"","","","",null,0,0,0,0,0,0]
[null,"","","","",null,null,"","","","",null,0,0,0,0,0,0]
[null,"","","","",null,null,"","","","",null,0,0,0,0,0,0]
[null,"","","","",null,null,"","","","",null,0,0,0,0,0,0]
[null,"","","","",null,null,"","","","",null,0,0,0,0,0,0]
[null,"","","","",null,null,"","","","",null,0,0,0,0,0,0]
[null,"","","","",null,null,"","","","",null,0,0,0,0,0,0]
[null,"","","","",null,null,"","","","",null,0,0,0,0,0,0]
[null,"","","","",null,null,"","","","",null,0,0,0,0,0,0]
[null,"","","","",null,null,"","","","",null,0,0,0,0,0,0]
[null,"","","","",null,null,"","","","",null,0,0,0,0,0,0]
[null,"","","","",null,null,"","","","",null,0,0,0,0,0,0]
[null,"","","","",null,null,"","","","",null,0,0,0,0,0,0]
[null,"","","","",null,null,"","","","",null,0,0,0,0,0,0]
[null,"","","","",null,null,"","","","",null,0,0,0,0,0,0]
[null,"","","","",null,null,"","","","",null,0,0,0,0,0,0]
[null,"","","","",null,null,"","","","",null,0,0,0,0,0,0]
[null,"","","","",null,null,"","","","",null,0,0,0,0,0,0]
[null,"","","","",null,null,"","","","",null,0,0,0,0,0,0]
[null,"","","","",null,null,"","","","",null,0,0,0,0,0,0]
[null,"","","","",null,null,"","","","",null,0,0,0,0,0,0]
[null,"","","","",null,null,"","","","",null,0,0,0,0,0,0]
[null,"","","","",null,"","","","","",null,0,0,0,0,0,0]
[null,"","","","",null,"","","","","",null,0,0,0,0,0,0]
[null,"","","","",null,"","","","","",null,0,0,0,0,0,0]
[null,"","","","",null,"","","","","",null,0,0,0,0,0,0]
[null,"","","","",null,"","","","","",null,0,0,0,0,0,0]
[null,null,null,null,null,null,""]
[null,null,null,null,null,null,""]
["Total",null,null,null,null,null,null,null,null,null,null,null,{"$f":"SUBTOTAL(109,BMVT15[Chipagem])","v":50},{"$f":"SUBTOTAL(109,BMVT15[Quant. Apur.])","v":864},{"$f":"SUBTOTAL(109,BMVT15[Qtd. Solic.])","v":733},{"$f":"SUBTOTAL(109,BMVT15[Dias Lanc Sist.])","v":339.5},null,{"$f":"SUBTOTAL(109,BMVT15[Vlr. Total])","v":5332.2800000000016}]
[{"$f":"\"Salvador, \"&TEXT(TODAY(),\"dd/mm/aaaa\")","v":"Salvador, 29/06/2016"},null,null,null,null,null,{"$f":"A82","v":"Salvador, 29/06/2016"}]
[]
[]
[]
["Responsável pelo Boletim de Medição",null,null,null,null,null,"Gerente Serviço de Pessoal de Salvador -SSPE"]

{"sheet":"Janeiro","index":8,"n_rows":86,"n_cols":32,"rows_kept":86,"cut":false,"hidden":false,"merged":[[4,25,4,26],[4,27,4,29],[81,0,81,2],[0,0,2,2],[0,14,0,15],[1,3,2,3],[1,14,1,15],[2,14,2,15],[4,23,4,24]]}
["Boletim Mensal de Vales Transporte",null,null,"Competência:",null,"Dias Úteis (Mês):",{"$f":"VLOOKUP(INDEX($W$6:$AF$17,$W$5,1),$W$6:$AF$17,9,FALSE)","v":20},null,"SC (Empregado):",0,{"$f":"(SUMIFS(BMVT14[Vlr. Total],BMVT14[Vínculo],\"<>Aprendiz\",BMVT14[Empresa], \"Salvador Card\"))-J1","v":1240.8},null,null,"Qtd Usuários",{"$f":"SUMPRODUCT(SUBTOTAL(3,OFFSET(BMVT14[Matrícula],ROW(BMVT14[Matrícula])-ROW(A6),0,1)),--(BMVT14[Situação]=\"Regular\"))","v":24}]
[null,null,null,{"$f":"VLOOKUP(INDEX($W$6:$AF$17,$W$5,1),$W$6:$AF$17,1,FALSE)","v":"Janeiro"},null,"Compesações:",{"$f":"VLOOKUP(INDEX($W$6:$AF$17,$W$5,1),$W$6:$AF$17,10,FALSE)","v":0},null,"SC (Aprendiz):",0,{"$f":"(SUMIFS(BMVT14[Vlr. Total],BMVT14[Vínculo],\"Aprendiz\",BMVT14[Empresa],\"Salvador Card\"))-J2","v":0},null,null,"Qtd VT :",{"$f":"SUMPRODUCT(SUBTOTAL(9,OFFSET(BMVT14[Qtd. Solic.],ROW(BMVT14[Qtd. Solic.])-ROW(A6),0,1)),--(BMVT14[Situação]=\"Regular\"))","v":801}]
[null,null,null,null,null,"Desconto :",0,null,"Metropasse:",0,{"$f":"(SUMIF(BMVT14[Empresa],\"Metropasse\",BMVT14[Vlr. Total]))-J3","v":396},null,null,"Valor Total:",{"$f":"SUMPRODUCT(SUBTOTAL(9,OFFSET(BMVT14[Vlr. Total],ROW(BMVT14[Vlr. Total])-ROW(A6),0,1)),--(BMVT14[Situação]=\"Regular\"))","v":5732.2}]
[]
["Matrícula","Empregado","Vínculo","Lotação","Setor","Rota","Situação","Origem","Destino","Tipo","Empresa","Vales/Trecho","Chipagem","Quant. Apur.","Qtd. Solic.","Dias Lanc Sist.","Vlr. Unit.","Vlr. Total",null,null,null,null,1,"Período",null,"Feriados",null,"Compensações",null,null,"DU"]
["000.001","João","Anistiado","Salvador","ADMINISTRATIVO","xxxxx-Y","Regular","Dias D'Ávila","Camaçari","Intermunicipal","Cidade das Águas",2,2,40,40,20,2.8,112,null,null,null,null,"Janeiro","2016-01-01","2016-01-31","2016-01-01",null,null,null,null,{"$f":"NETWORKDAYS(X6,Y6,Z6:AD6)","v":20},{"$f":"COUNTA(AB6:AD6)","v":0}]
["000.002","Maria","Anistiado","Salvador","ADMINISTRATIVO",23196,"Regular","Alagoinhas","Salvador","Intermunicipal","Cidade Sol",2,2,40,40,20,28.35,1134,null,null,null,null,"Fevereiro","2016-02-01","2016-02-29","2016-02-08",null,"2016-02-09","2016-02-10",null,{"$f":"NETWORKDAYS(X7,Y7,Z7:AD7)","v":18},{"$f":"COUNTA(AB7:AD7)","v":2}]
["000.003","Francisco","Anistiado","Salvador","ADMINISTRATIVO",23184,"Regular","Jequié","Ipiaú","Intermunicipal","Cidade Sol",2,2,40,48,24,10.65,511.20000000000005,null,null,null,null,"Março","2016-03-01","2016-03-31","2016-03-25",null,"2016-03-24",null,null,{"$f":"NETWORKDAYS(X8,Y8,Z8:AD8)","v":21},1]
["000.004","Ricardo","Empregado","Salvador","ADMINISTRATIVO",23183,"Regular","Feira de Santana","Feira de Santana","Urbano","Via Feira",2,2,40,0,0,3.1,0,null,null,null,null,"Abril","2016-04-01","2016-04-30","2016-04-21",null,"2016-01-22",null,null,20,1]
["000.005","Mauro","Empregado","Salvador","ADMINISTRATIVO",23183,"Regular","Feira de Santana","Feira de Santana","Urbano","Via Feira",2,2,40,40,20,3.1,124,null,null,null,null,"Maio","2016-05-01","2016-05-31","2016-05-26",null,"2016-05-27",null,null,20,1]
["000.006","Marcio","Empregado","Salvador","ADMINISTRATIVO","23125-M","Regular","Conceição de Feira","Salvador","Intermunicipal","Viação Jauá",2,2,40,10,5,23.03,230.3,null,null,null,null,"Junho","2016-06-01","2016-06-30",null,null,null,null,null,22,0]
["000.007","Carla","Empregado","Salvador","ADMINISTRATIVO","23125-M","Regular","Conceição de Feira","Salvador","Intermunicipal","Viação Jauá",2,2,40,40,20,23.03,921.2,null,null,null,null,"Julho","2016-07-01","2016-07-31",null,null,null,null,null,21,0]
["000.008","Caroline","Empregado","Salvador","COMERCIAL","23190-V","Regular","Lauro de Freitas","Salvador","Intermunicipal","Metropasse",2,2,40,40,20,3.3,132,null,null,null,null,"Agosto","2016-08-01","2016-08-31",null,null,null,null,null,23,0]
["000.009","Pedro","Empregado","Salvador","COMERCIAL","23190-V","Regular","Lauro de Freitas","Salvador","Intermunicipal","Metropasse",2,2,40,0,0,3.3,0,null,null,null,null,"Setembro","2016-09-01","2016-09-30","2016-09-07",null,null,null,null,21,0]
["000.010","Paulo","Empregado","Salvador","COMERCIAL","23190-V","Regular","Lauro de Freitas","Salvador","Intermunicipal","Metropasse",2,2,40,40,20,3.3,132,null,null,null,null,"Outubro","2016-10-01","2016-10-31","2016-10-12",null,null,null,null,20,0]
["000.011","Rafael","Empregado","Salvador","COMERCIAL","23190-V","Regular","Lauro de Freitas","Salvador","Intermunicipal","Metropasse",2,2,40,40,20,3.3,132,null,null,null,null,"Novembro","2016-11-01","2016-11-30","2016-11-02","2016-11-15","2016-11-14",null,null,{"$f":"NETWORKDAYS(X16,Y16,Z16:AD16)","v":19},1]
["000.012","Ricardo","Empregado","Salvador","COMERCIAL","23170-I","Regular","Aracaju","Aracaju","Urbano","Aracaju Card",2,2,40,52,26,3.1,161.20000000000002,null,null,null,null,"Dezembro","2016-12-01","2016-12-31",null,null,null,null,null,22,0]
["000.013","Jose","Empregado","Salvador","COMERCIAL","xxxxx-Y (Pool)","Regular","Feira de Santana","Camaçari","Intermunicipal","Lis Transportes",2,2,40,10,5,650,650]
["000.014","Felipe","Empregado","Salvador","COMERCIAL",23182,"Regular","Amélia Rodrigues","Governador Mangabeira","Intermunicipal","RD Transportes",2,2,40,25,12.5,10.06,251.5]
["000.015","Julio","Empregado","Salvador","COMERCIAL","23101-A (09096)","Regular","Salvador","Salvador","Urbano","Salvador Card",2,4,40,40,10,3.3,132]
["000.016","Lucia","Empregado","Salvador","PESSOAL","23101-A (09096)","Regular","Salvador","Salvador","Urbano","Salvador Card",2,2,40,42,21,3.3,138.6]
["000.017","Luciano","Empregado","Salvador","PESSOAL","23101-A (09096)","Regular","Salvador","Salvador","Urbano","Salvador Card",0,0,0,0,0,3.3,0]
["000.018","Bruno","Empregado","Salvador","PESSOAL","23101-A (09096)","Regular","Salvador","Salvador","Urbano","Salvador Card",2,2,40,40,20,3.3,132]
["000.019","Vinicius","Anistiado","Salvador","PESSOAL","23101-A (09096)","Regular","Salvador","Salvador","Urbano","Salvador Card",2,2,40,40,20,3.3,132]
["000.020","José Carlos","Empregado","Salvador","LOGISTICA","23101-A (09096)","Regular","Salvador","Salvador","Urbano","Salvador Card",2,2,40,40,20,3.3,132]
["000.021","Carlos","Empregado","Salvador","LOGISTICA","23101-A (09096)","Regular","Salvador","Salvador","Urbano","Salvador Card",2,2,40,40,20,3.3,132]
["000.022","Miguel","Empregado","Salvador","LOGISTICA","23101-A (09096)","Regular","Salvador","Salvador","Urbano","Salvador Card",2,2,40,40,20,3.3,132]
["000.023","Gustavo","Empregado","Salvador","FINANCEIRO","23101-A (09096)","Regular","Salvador","Salvador","Urbano","Salvador Card",4,4,80,80,20,3.3,264]
["000.024","Guilherme","Empregado","Salvador","FINANCEIRO","23101-A (09096)","Irregular","Salvador","Salvador","Urbano","Salvador Card",0,0,0,0,0,3.3,0]
["000.025","Bruno Brito","Empregado","Salvador","FINANCEIRO","23101-A (09096)","Regular","Salvador","Salvador","Urbano","Salvador Card",2,2,40,14,7,3.3,46.199999999999996]
[null,"","","","",null,null,"","","","",null,0,0,0,0,0,0]
[null,"","","","",null,null,"","","","",null,0,0,0,0,0,0]
[null,"","","","",null,null,"","","","",null,0,0,0,0,0,0]
[null,"","","","",null,null,"","","","",null,0,0,0,0,0,0]
[null,"","","","",null,null,"","","","",null,0,0,0,0,0,0]
[null,"","","","",null,null,"","","","",null,0,0,0,0,0,0]
[null,"","","","",null,null,"","","","",null,0,0,0,0,0,0]
[null,"","","","",null,null,"","","","",null,0,0,0,0,0,0]
[null,"","","","",null,null,"","","","",null,0,0,0,0,0,0]
[null,"","","","",null,null,"","","","",null,0,0,0,0,0,0]
[null,"","","","",null,null,"","","","",null,0,0,0,0,0,0]
[null,"","","","",null,null,"","","","",null,0,0,0,0,0,0]
[null,"","","","",null,null,"","","","",null,0,0,0,0,0,0]
[null,"","","","",null,null,"","","","",null,0,0,0,0,0,0]
[null,"","","","",null,null,"","","","",null,0,0,0,0,0,0]
[null,"","","","",null,null,"","","","",null,0,0,0,0,0,0]
[null,"","","","",null,null,"","","","",null,0,0,0,0,0,0]
[null,"","","","",null,null,"","","","",null,0,0,0,0,0,0]
[null,"","","","",null,null,"","","","",null,0,0,0,0,0,0]
[null,"","","","",null,null,"","","","",null,0,0,0,0,0,0]
[null,"","","","",null,null,"","","","",null,0,0,0,0,0,0]
[null,"","","","",null,null,"","","","",null,0,0,0,0,0,0]
[null,"","","","",null,null,"","","","",null,0,0,0,0,0,0]
[null,"","","","",null,null,"","","","",null,0,0,0,0,0,0]
[null,"","","","",null,null,"","","","",null,0,0,0,0,0,0]
[null,"","","","",null,null,"","","","",null,0,0,0,0,0,0]
[null,"","","","",null,null,"","","","",null,0,0,0,0,0,0]
[null,"","","","",null,null,"","","","",null,0,0,0,0,0,0]
[null,"","","","",null,null,"","","","",null,0,0,0,0,0,0]
[null,"","","","",null,null,"","","","",null,0,0,0,0,0,0]
[null,"","","","",null,null,"","","","",null,0,0,0,0,0,0]
[null,"","","","",null,null,"","","","",null,0,0,0,0,0,0]
[null,"","","","",null,null,"","","","",null,0,0,0,0,0,0]
[null,"","","","",null,null,"","","","",null,0,0,0,0,0,0]
[null,"","","","",null,null,"","","","",null,0,0,0,0,0,0]
[null,"","","","",null,null,"","","","",null,0,0,0,0,0,0]
[null,"","","","",null,null,"","","","",null,0,0,0,0,0,0]
[null,"","","","",null,null,"","","","",null,0,0,0,0,0,0]
[null,"","","","",null,null,"","","","",null,0,0,0,0,0,0]
[null,"","","","",null,null,"","","","",null,0,0,0,0,0,0]
[null,"","","","",null,null,"","","","",null,0,0,0,0,0,0]
[null,"","","","",null,null,"","","","",null,0,0,0,0,0,0]
[null,"","","","",null,null,"","","","",null,0,0,0,0,0,0]
[null,"","","","",null,"","","","","",null,0,0,0,0,0,0]
[null,"","","","",null,"","","","","",null,0,0,0,0,0,0]
[null,"","","","",null,"","","","","",null,0,0,0,0,0,0]
[null,"","","","",null,"","","","","",null,0,0,0,0,0,0]
[null,null,null,null,null,null,""]
[null,null,null,null,null,null,""]
[null,null,null,null,null,null,""]
["Total",null,null,null,null,null,null,null,null,null,null,null,{"$f":"SUBTOTAL(109,BMVT14[Chipagem])","v":50},{"$f":"SUBTOTAL(109,BMVT14[Quant. Apur.])","v":960},{"$f":"SUBTOTAL(109,BMVT14[Qtd. Solic.])","v":801},{"$f":"SUBTOTAL(109,BMVT14[Dias Lanc Sist.])","v":370.5},null,{"$f":"SUBTOTAL(109,BMVT14[Vlr. Total])","v":5732.2}]
[{"$f":"\"Salvador, \"&TEXT(TODAY(),\"dd/mm/aaaa\")","v":"Salvador, 29/06/2016"},null,null,null,null,null,{"$f":"A82","v":"Salvador, 29/06/2016"}]
[]
[]
[]
["Responsável pelo Boletim de Medição",null,null,null,null,null,"Gerente Serviço de Pessoal de Salvador -SSPE"]

{"sheet":"Relatório","index":9,"n_rows":154,"n_cols":21,"rows_kept":154,"cut":false,"hidden":false,"merged":[[1,0,5,15]]}
[]
["Relatório Gráfico Comparativo"]
[]
[]
[]
[]
[]
[]
[]
[]
[]
[]
[]
[]
[]
[]
[]
[]
[]
[]
[]
[]
[]
[]
[]
[]
[]
[]
[]
[]
[]
[]
[]
[]
[]
[]
[]
[]
[]
[]
[]
[]
[]
[]
[]
[]
[]
[]
[]
[]
[]
[]
[]
[]
[]
[]
[]
[]
[]
[]
[]
[]
[]
[]
[]
[]
[]
[]
[]
[]
[]
[]
[]
[]
[]
[]
[]
[]
[]
[]
[]
[]
[]
[]
[]
[]
[]
[]
[]
[]
[]
[]
[]
[]
[]
[]
[]
[]
[]
[]
[]
[]
[]
[]
[]
[]
[]
[]
[]
[]
[]
[]
[]
[]
[]
[]
[]
[]
[]
[]
[]
[]
[]
[]
[]
[]
[]
[]
[]
[]
[]
[]
[]
[]
[]
[]
[]
[2,{"$f":"Rel_Gestao!$C$4","v":"JANEIRO"},{"$f":"Rel_Gestao!$E$4","v":"FEVEREIRO"},{"$f":"Rel_Gestao!$G$4","v":"MARÇO"},{"$f":"Rel_Gestao!$I$4","v":"ABRIL"},{"$f":"Rel_Gestao!$K$4","v":"MAIO"},{"$f":"Rel_Gestao!$M$4","v":"JUNHO"},{"$f":"Rel_Gestao!$O$4","v":"JULHO"},{"$f":"Rel_Gestao!$Q$4","v":"AGOSTO"},{"$f":"Rel_Gestao!$S$4","v":"SETEMBRO"},{"$f":"Rel_Gestao!$U$4","v":"OUTUBRO"},{"$f":"Rel_Gestao!$W$4","v":"NOVEMBRO"},{"$f":"Rel_Gestao!$Y$4","v":"DEZEMBRO"},{"$f":"Rel_Gestao!$AA$4","v":"TOTAL"},"1º TRIM","2º TRIM","3º TRIM","4ºTRIM","1º SEM","2º SEM","ANUAL"]
[{"$f":"VLOOKUP(INDEX(Rel_Gestao!A6:AB10,Relatório!A138,1),Rel_Gestao!A6:AB10,1,FALSE)","v":"Aprendiz"},{"$f":"IF(ISERROR(VLOOKUP(INDEX(Rel_Gestao!A6:AB10,Relatório!A138,1),Rel_Gestao!A6:AB10,3,FALSE)),0,(VLOOKUP(INDEX(Rel_Gestao!A6:AB10,Relatório!A138,1),Rel_Gestao!A6:AB10,3,FALSE)))","v":0},{"$f":"IF(ISERROR(VLOOKUP(INDEX(Rel_Gestao!A6:AB10,Relatório!A138,1),Rel_Gestao!A6:AB10,5,FALSE)),0,(VLOOKUP(INDEX(Rel_Gestao!A6:AB10,Relatório!A138,1),Rel_Gestao!A6:AB10,5,FALSE)))","v":0},{"$f":"IF(ISERROR(VLOOKUP(INDEX(Rel_Gestao!A6:AB10,Relatório!A138,1),Rel_Gestao!A6:AB10,7,FALSE)),0,(VLOOKUP(INDEX(Rel_Gestao!A6:AB10,Relatório!A138,1),Rel_Gestao!A6:AB10,7,FALSE)))","v":0},{"$f":"IF(ISERROR(VLOOKUP(INDEX(Rel_Gestao!A6:AB10,Relatório!A138,1),Rel_Gestao!A6:AB10,9,FALSE)),0,(VLOOKUP(INDEX(Rel_Gestao!A6:AB10,Relatório!A138,1),Rel_Gestao!A6:AB10,9,FALSE)))","v":12},{"$f":"IF(ISERROR(VLOOKUP(INDEX(Rel_Gestao!A6:AB10,Relatório!A138,1),Rel_Gestao!A6:AB10,11,FALSE)),0,(VLOOKUP(INDEX(Rel_Gestao!A6:AB10,Relatório!A138,1),Rel_Gestao!A6:AB10,11,FALSE)))","v":0},{"$f":"IF(ISERROR(VLOOKUP(INDEX(Rel_Gestao!A6:AB10,Relatório!A138,1),Rel_Gestao!A6:AB10,13,FALSE)),\"\",(VLOOKUP(INDEX(Rel_Gestao!A6:AB10,Relatório!A138,1),Rel_Gestao!A6:AB10,13,FALSE)))","v":0},{"$f":"IF(ISERROR(VLOOKUP(INDEX(Rel_Gestao!A6:AB10,Relatório!A138,1),Rel_Gestao!A6:AB10,15,FALSE)),\"\",(VLOOKUP(INDEX(Rel_Gestao!A6:AB10,Relatório!A138,1),Rel_Gestao!A6:AB10,15,FALSE)))","v":0},{"$f":"IF(ISERROR(VLOOKUP(INDEX(Rel_Gestao!A6:AB10,Relatório!A138,1),Rel_Gestao!A6:AB10,17,FALSE)),\"\",(VLOOKUP(INDEX(Rel_Gestao!A6:AB10,Relatório!A138,1),Rel_Gestao!A6:AB10,17,FALSE)))","v":""},{"$f":"IF(ISERROR(VLOOKUP(INDEX(Rel_Gestao!A6:AB10,Relatório!A138,1),Rel_Gestao!A6:AB10,19,FALSE)),\"\",(VLOOKUP(INDEX(Rel_Gestao!A6:AB10,Relatório!A138,1),Rel_Gestao!A6:AB10,19,FALSE)))","v":""},{"$f":"IF(ISERROR(VLOOKUP(INDEX(Rel_Gestao!A6:AB10,Relatório!A138,1),Rel_Gestao!A6:AB10,21,FALSE)),\"\",(VLOOKUP(INDEX(Rel_Gestao!A6:AB10,Relatório!A138,1),Rel_Gestao!A6:AB10,21,FALSE)))","v":""},{"$f":"IF(ISERROR(VLOOKUP(INDEX(Rel_Gestao!A6:AB10,Relatório!A138,1),Rel_Gestao!A6:AB10,23,FALSE)),\"\",(VLOOKUP(INDEX(Rel_Gestao!A6:AB10,Relatório!A138,1),Rel_Gestao!A6:AB10,23,FALSE)))","v":""},{"$f":"IF(ISERROR(VLOOKUP(INDEX(Rel_Gestao!A6:AB10,Relatório!A138,1),Rel_Gestao!A6:AB10,25,FALSE)),\"\",(VLOOKUP(INDEX(Rel_Gestao!A6:AB10,Relatório!A138,1),Rel_Gestao!A6:AB10,25,FALSE)))","v":""},{"$f":"IF(ISERROR(VLOOKUP(INDEX(Rel_Gestao!A6:AB10,Relatório!A138,1),Rel_Gestao!A6:AB10,27,FALSE)),0,(VLOOKUP(INDEX(Rel_Gestao!A6:AB10,Relatório!A138,1),Rel_Gestao!A6:AB10,27,FALSE)))","v":12},{"$f":"AVERAGE(B139,C139,D139)","v":0},{"$f":"AVERAGE(E139,F139,G139)","v":4},{"$f":"AVERAGE(H139,I139,J139)","v":0},{"$f":"AVERAGE(K139,L139,M139)","v":{"$error":"#DIV/0!"}},{"$f":"AVERAGE(B139,C139,D139,E139,F139,G139)","v":2},{"$f":"AVERAGE(H139,I139,J139,K139,L139,M139)","v":0},{"$f":"AVERAGE(B139:M139)","v":1.7142857142857142}]
[null,{"$f":"IF(ISERROR(VLOOKUP(INDEX(Rel_Gestao!A6:AB10,Relatório!A138,1),Rel_Gestao!A6:AB10,4,FALSE)),\"\",(VLOOKUP(INDEX(Rel_Gestao!A6:AB10,Relatório!A138,1),Rel_Gestao!A6:AB10,4,FALSE)))","v":0},{"$f":"IF(ISERROR(VLOOKUP(INDEX(Rel_Gestao!A6:AB10,Relatório!A138,1),Rel_Gestao!A6:AB10,6,FALSE)),\"\",(VLOOKUP(INDEX(Rel_Gestao!A6:AB10,Relatório!A138,1),Rel_Gestao!A6:AB10,6,FALSE)))","v":0},{"$f":"IF(ISERROR(VLOOKUP(INDEX(Rel_Gestao!A6:AB10,Relatório!A138,1),Rel_Gestao!A6:AB10,8,FALSE)),\"\",(VLOOKUP(INDEX(Rel_Gestao!A6:AB10,Relatório!A138,1),Rel_Gestao!A6:AB10,8,FALSE)))","v":0},{"$f":"IF(ISERROR(VLOOKUP(INDEX(Rel_Gestao!A6:AB10,Relatório!A138,1),Rel_Gestao!A6:AB10,10,FALSE)),\"\",(VLOOKUP(INDEX(Rel_Gestao!A6:AB10,Relatório!A138,1),Rel_Gestao!A6:AB10,10,FALSE)))","v":37.200000000000003},{"$f":"IF(ISERROR(VLOOKUP(INDEX(Rel_Gestao!A6:AB10,Relatório!A138,1),Rel_Gestao!A6:AB10,12,FALSE)),\"\",(VLOOKUP(INDEX(Rel_Gestao!A6:AB10,Relatório!A138,1),Rel_Gestao!A6:AB10,12,FALSE)))","v":0},{"$f":"IF(ISERROR(VLOOKUP(INDEX(Rel_Gestao!A6:AB10,Relatório!A138,1),Rel_Gestao!A6:AB10,14,FALSE)),\"\",(VLOOKUP(INDEX(Rel_Gestao!A6:AB10,Relatório!A138,1),Rel_Gestao!A6:AB10,14,FALSE)))","v":0},{"$f":"IF(ISERROR(VLOOKUP(INDEX(Rel_Gestao!A6:AB10,Relatório!A138,1),Rel_Gestao!A6:AB10,16,FALSE)),\"\",(VLOOKUP(INDEX(Rel_Gestao!A6:AB10,Relatório!A138,1),Rel_Gestao!A6:AB10,16,FALSE)))","v":0},{"$f":"IF(ISERROR(VLOOKUP(INDEX(Rel_Gestao!A6:AB10,Relatório!A138,1),Rel_Gestao!A6:AB10,18,FALSE)),\"\",(VLOOKUP(INDEX(Rel_Gestao!A6:AB10,Relatório!A138,1),Rel_Gestao!A6:AB10,18,FALSE)))","v":""},{"$f":"IF(ISERROR(VLOOKUP(INDEX(Rel_Gestao!A6:AB10,Relatório!A138,1),Rel_Gestao!A6:AB10,20,FALSE)),\"\",(VLOOKUP(INDEX(Rel_Gestao!A6:AB10,Relatório!A138,1),Rel_Gestao!A6:AB10,20,FALSE)))","v":""},{"$f":"IF(ISERROR(VLOOKUP(INDEX(Rel_Gestao!A6:AB10,Relatório!A138,1),Rel_Gestao!A6:AB10,22,FALSE)),\"\",(VLOOKUP(INDEX(Rel_Gestao!A6:AB10,Relatório!A138,1),Rel_Gestao!A6:AB10,22,FALSE)))","v":""},{"$f":"IF(ISERROR(VLOOKUP(INDEX(Rel_Gestao!A6:AB10,Relatório!A138,1),Rel_Gestao!A6:AB10,24,FALSE)),\"\",(VLOOKUP(INDEX(Rel_Gestao!A6:AB10,Relatório!A138,1),Rel_Gestao!A6:AB10,24,FALSE)))","v":""},{"$f":"IF(ISERROR(VLOOKUP(INDEX(Rel_Gestao!A6:AB10,Relatório!A138,1),Rel_Gestao!A6:AB10,26,FALSE)),\"\",(VLOOKUP(INDEX(Rel_Gestao!A6:AB10,Relatório!A138,1),Rel_Gestao!A6:AB10,26,FALSE)))","v":""},{"$f":"IF(ISERROR(VLOOKUP(INDEX(Rel_Gestao!A6:AB10,Relatório!A138,1),Rel_Gestao!A6:AB10,28,FALSE)),0,(VLOOKUP(INDEX(Rel_Gestao!A6:AB10,Relatório!A138,1),Rel_Gestao!A6:AB10,28,FALSE)))","v":37.200000000000003},{"$f":"AVERAGE(B140,C140,D140)","v":0},{"$f":"AVERAGE(E140,F140,G140)","v":12.4},{"$f":"AVERAGE(H140,I140,J140)","v":0},{"$f":"AVERAGE(K140,L140,M140)","v":{"$error":"#DIV/0!"}},{"$f":"AVERAGE(B140,C140,D140,E140,F140,G140)","v":6.2},{"$f":"AVERAGE(H140,I140,J140,K140,L140,M140)","v":0},{"$f":"AVERAGE(B140:M140)","v":5.3142857142857149}]
[11,{"$f":"Rel_Gestao!$C$4","v":"JANEIRO"},{"$f":"Rel_Gestao!$E$4","v":"FEVEREIRO"},{"$f":"Rel_Gestao!$G$4","v":"MARÇO"},{"$f":"Rel_Gestao!$I$4","v":"ABRIL"},{"$f":"Rel_Gestao!$K$4","v":"MAIO"},{"$f":"Rel_Gestao!$M$4","v":"JUNHO"},{"$f":"Rel_Gestao!$O$4","v":"JULHO"},{"$f":"Rel_Gestao!$Q$4","v":"AGOSTO"},{"$f":"Rel_Gestao!$S$4","v":"SETEMBRO"},{"$f":"Rel_Gestao!$U$4","v":"OUTUBRO"},{"$f":"Rel_Gestao!$W$4","v":"NOVEMBRO"},{"$f":"Rel_Gestao!$Y$4","v":"DEZEMBRO"},{"$f":"Rel_Gestao!$AA$4","v":"TOTAL"},"1º TRIM","2º TRIM","3º TRIM","4ºTRIM","1º SEM","2º SEM","ANUAL"]
[{"$f":"IF(ISERROR(VLOOKUP(INDEX(Rel_Gestao!A12:AB28,Relatório!A141,1),Rel_Gestao!A12:AB28,1,FALSE)),0,(VLOOKUP(INDEX(Rel_Gestao!A12:AB28,Relatório!A141,1),Rel_Gestao!A12:AB28,1,FALSE)))","v":"23101-A (09096)"},{"$f":"IF(ISERROR(VLOOKUP(INDEX(Rel_Gestao!A12:AB28,Relatório!A141,1),Rel_Gestao!A12:AB28,3,FALSE)),\"\",(VLOOKUP(INDEX(Rel_Gestao!A12:AB28,Relatório!A144,1),Rel_Gestao!A12:AB28,3,FALSE)))","v":40},{"$f":"IF(ISERROR(VLOOKUP(INDEX(Rel_Gestao!A12:AB28,Relatório!A141,1),Rel_Gestao!A12:AB28,5,FALSE)),\"\",(VLOOKUP(INDEX(Rel_Gestao!A12:AB28,Relatório!A144,1),Rel_Gestao!A12:AB28,5,FALSE)))","v":36},{"$f":"IF(ISERROR(VLOOKUP(INDEX(Rel_Gestao!A12:AB28,Relatório!A141,1),Rel_Gestao!A12:AB28,7,FALSE)),\"\",(VLOOKUP(INDEX(Rel_Gestao!A12:AB28,Relatório!A141,1),Rel_Gestao!A12:AB28,7,FALSE)))","v":394},{"$f":"IF(ISERROR(VLOOKUP(INDEX(Rel_Gestao!A12:AB28,Relatório!A141,1),Rel_Gestao!A12:AB28,9,FALSE)),\"\",(VLOOKUP(INDEX(Rel_Gestao!A12:AB28,Relatório!A141,1),Rel_Gestao!A12:AB28,9,FALSE)))","v":376},{"$f":"IF(ISERROR(VLOOKUP(INDEX(Rel_Gestao!A12:AB28,Relatório!A141,1),Rel_Gestao!A12:AB28,11,FALSE)),\"\",(VLOOKUP(INDEX(Rel_Gestao!A12:AB28,Relatório!A141,1),Rel_Gestao!A12:AB28,11,FALSE)))","v":376},{"$f":"IF(ISERROR(VLOOKUP(INDEX(Rel_Gestao!A12:AB28,Relatório!A141,1),Rel_Gestao!A12:AB28,13,FALSE)),\"\",(VLOOKUP(INDEX(Rel_Gestao!A12:AB28,Relatório!A141,1),Rel_Gestao!A12:AB28,13,FALSE)))","v":394},{"$f":"IF(ISERROR(VLOOKUP(INDEX(Rel_Gestao!A12:AB28,Relatório!A141,1),Rel_Gestao!A12:AB28,15,FALSE)),\"\",(VLOOKUP(INDEX(Rel_Gestao!A12:AB28,Relatório!A141,1),Rel_Gestao!A12:AB28,15,FALSE)))","v":394},{"$f":"IF(ISERROR(VLOOKUP(INDEX(Rel_Gestao!A12:AB28,Relatório!A141,1),Rel_Gestao!A12:AB28,17,FALSE)),\"\",(VLOOKUP(INDEX(Rel_Gestao!A12:AB28,Relatório!A141,1),Rel_Gestao!A12:AB28,17,FALSE)))","v":""},{"$f":"IF(ISERROR(VLOOKUP(INDEX(Rel_Gestao!A12:AB28,Relatório!A141,1),Rel_Gestao!A12:AB28,19,FALSE)),\"\",(VLOOKUP(INDEX(Rel_Gestao!A12:AB28,Relatório!A141,1),Rel_Gestao!A12:AB28,19,FALSE)))","v":""},{"$f":"IF(ISERROR(VLOOKUP(INDEX(Rel_Gestao!A12:AB28,Relatório!A141,1),Rel_Gestao!A12:AB28,21,FALSE)),\"\",(VLOOKUP(INDEX(Rel_Gestao!A12:AB28,Relatório!A141,1),Rel_Gestao!A12:AB28,21,FALSE)))","v":""},{"$f":"IF(ISERROR(VLOOKUP(INDEX(Rel_Gestao!A12:AB28,Relatório!A141,1),Rel_Gestao!A12:AB28,23,FALSE)),\"\",(VLOOKUP(INDEX(Rel_Gestao!A12:AB28,Relatório!A141,1),Rel_Gestao!A12:AB28,23,FALSE)))","v":""},{"$f":"IF(ISERROR(VLOOKUP(INDEX(Rel_Gestao!A12:AB28,Relatório!A141,1),Rel_Gestao!A12:AB28,25,FALSE)),\"\",(VLOOKUP(INDEX(Rel_Gestao!A12:AB28,Relatório!A141,1),Rel_Gestao!A12:AB28,25,FALSE)))","v":""},{"$f":"IF(ISERROR(VLOOKUP(INDEX(Rel_Gestao!A12:AB28,Relatório!A141,1),Rel_Gestao!A12:AB28,27,FALSE)),\"\",(VLOOKUP(INDEX(Rel_Gestao!A12:AB28,Relatório!A141,1),Rel_Gestao!A12:AB28,27,FALSE)))","v":2650},{"$f":"AVERAGE(B142,C142,D142)","v":156.66666666666666},{"$f":"AVERAGE(E142,F142,G142)","v":382},{"$f":"AVERAGE(H142,I142,J142)","v":394},{"$f":"AVERAGE(K142,L142,M142)","v":{"$error":"#DIV/0!"}},{"$f":"AVERAGE(B142,C142,D142,E142,F142,G142)","v":269.33333333333331},{"$f":"AVERAGE(H142,I142,J142,K142,L142,M142)","v":394},{"$f":"AVERAGE(B142:M142)","v":287.14285714285717}]
[null,{"$f":"IF(ISERROR(VLOOKUP(INDEX(Rel_Gestao!A12:AB28,Relatório!A141,1),Rel_Gestao!A12:AB28,4,FALSE)),\"\",(VLOOKUP(INDEX(Rel_Gestao!A12:AB28,Relatório!A141,1),Rel_Gestao!A12:AB28,4,FALSE)))","v":1240.8},{"$f":"IF(ISERROR(VLOOKUP(INDEX(Rel_Gestao!A12:AB28,Relatório!A141,1),Rel_Gestao!A12:AB28,6,FALSE)),\"\",(VLOOKUP(INDEX(Rel_Gestao!A12:AB28,Relatório!A141,1),Rel_Gestao!A12:AB28,6,FALSE)))","v":1122},{"$f":"IF(ISERROR(VLOOKUP(INDEX(Rel_Gestao!A12:AB28,Relatório!A141,1),Rel_Gestao!A12:AB28,8,FALSE)),\"\",(VLOOKUP(INDEX(Rel_Gestao!A12:AB28,Relatório!A141,1),Rel_Gestao!A12:AB28,8,FALSE)))","v":1300.2},{"$f":"IF(ISERROR(VLOOKUP(INDEX(Rel_Gestao!A12:AB28,Relatório!A141,1),Rel_Gestao!A12:AB28,10,FALSE)),\"\",(VLOOKUP(INDEX(Rel_Gestao!A12:AB28,Relatório!A141,1),Rel_Gestao!A12:AB28,10,FALSE)))","v":1240.8},{"$f":"IF(ISERROR(VLOOKUP(INDEX(Rel_Gestao!A12:AB28,Relatório!A141,1),Rel_Gestao!A12:AB28,12,FALSE)),\"\",(VLOOKUP(INDEX(Rel_Gestao!A12:AB28,Relatório!A141,1),Rel_Gestao!A12:AB28,12,FALSE)))","v":1240.8},{"$f":"IF(ISERROR(VLOOKUP(INDEX(Rel_Gestao!A12:AB28,Relatório!A141,1),Rel_Gestao!A12:AB28,14,FALSE)),\"\",(VLOOKUP(INDEX(Rel_Gestao!A12:AB28,Relatório!A141,1),Rel_Gestao!A12:AB28,14,FALSE)))","v":1300.2},{"$f":"IF(ISERROR(VLOOKUP(INDEX(Rel_Gestao!A12:AB28,Relatório!A141,1),Rel_Gestao!A12:AB28,16,FALSE)),\"\",(VLOOKUP(INDEX(Rel_Gestao!A12:AB28,Relatório!A141,1),Rel_Gestao!A12:AB28,16,FALSE)))","v":1300.2},{"$f":"IF(ISERROR(VLOOKUP(INDEX(Rel_Gestao!A12:AB28,Relatório!A141,1),Rel_Gestao!A12:AB28,18,FALSE)),\"\",(VLOOKUP(INDEX(Rel_Gestao!A12:AB28,Relatório!A141,1),Rel_Gestao!A12:AB28,16,FALSE)))","v":""},{"$f":"IF(ISERROR(VLOOKUP(INDEX(Rel_Gestao!A12:AB28,Relatório!A141,1),Rel_Gestao!A12:AB28,20,FALSE)),\"\",(VLOOKUP(INDEX(Rel_Gestao!A12:AB28,Relatório!A141,1),Rel_Gestao!A12:AB28,20,FALSE)))","v":""},{"$f":"IF(ISERROR(VLOOKUP(INDEX(Rel_Gestao!A12:AB28,Relatório!A141,1),Rel_Gestao!A12:AB28,22,FALSE)),\"\",(VLOOKUP(INDEX(Rel_Gestao!A12:AB28,Relatório!A141,1),Rel_Gestao!A12:AB28,22,FALSE)))","v":""},{"$f":"IF(ISERROR(VLOOKUP(INDEX(Rel_Gestao!A12:AB28,Relatório!A141,1),Rel_Gestao!A12:AB28,24,FALSE)),\"\",(VLOOKUP(INDEX(Rel_Gestao!A12:AB28,Relatório!A141,1),Rel_Gestao!A12:AB28,24,FALSE)))","v":""},{"$f":"IF(ISERROR(VLOOKUP(INDEX(Rel_Gestao!A12:AB28,Relatório!A141,1),Rel_Gestao!A12:AB28,26,FALSE)),\"\",(VLOOKUP(INDEX(Rel_Gestao!A12:AB28,Relatório!A141,1),Rel_Gestao!A12:AB28,26,FALSE)))","v":""},{"$f":"IF(ISERROR(VLOOKUP(INDEX(Rel_Gestao!A12:AB28,Relatório!A141,1),Rel_Gestao!A12:AB28,28,FALSE)),\"\",(VLOOKUP(INDEX(Rel_Gestao!A12:AB28,Relatório!A141,1),Rel_Gestao!A12:AB28,28,FALSE)))","v":8745},{"$f":"AVERAGE(B143,C143,D143)","v":1221},{"$f":"AVERAGE(E143,F143,G143)","v":1260.6000000000001},{"$f":"AVERAGE(H143,I143,J143)","v":1300.2},{"$f":"AVERAGE(K143,L143,M143)","v":{"$error":"#DIV/0!"}},{"$f":"AVERAGE(B143,C143,D143,E143,F143,G143)","v":1240.8},{"$f":"AVERAGE(H143,I143,J143,K143,L143,M143)","v":1300.2},{"$f":"AVERAGE(B143:M143)","v":1249.2857142857142}]
[2,{"$f":"Rel_Gestao!$C$4","v":"JANEIRO"},{"$f":"Rel_Gestao!$E$4","v":"FEVEREIRO"},{"$f":"Rel_Gestao!$G$4","v":"MARÇO"},{"$f":"Rel_Gestao!$I$4","v":"ABRIL"},{"$f":"Rel_Gestao!$K$4","v":"MAIO"},{"$f":"Rel_Gestao!$M$4","v":"JUNHO"},{"$f":"Rel_Gestao!$O$4","v":"JULHO"},{"$f":"Rel_Gestao!$Q$4","v":"AGOSTO"},{"$f":"Rel_Gestao!$S$4","v":"SETEMBRO"},{"$f":"Rel_Gestao!$U$4","v":"OUTUBRO"},{"$f":"Rel_Gestao!$W$4","v":"NOVEMBRO"},{"$f":"Rel_Gestao!$Y$4","v":"DEZEMBRO"},{"$f":"Rel_Gestao!$AA$4","v":"TOTAL"},"1º TRIM","2º TRIM","3º TRIM","4ºTRIM","1º SEM","2º SEM","ANUAL"]
[{"$f":"IF(ISERROR(VLOOKUP(INDEX(Rel_Gestao!A30:AB31,Relatório!A144,1),Rel_Gestao!A30:AB31,1,FALSE)),0,(VLOOKUP(INDEX(Rel_Gestao!A30:AB31,Relatório!A144,1),Rel_Gestao!A30:AB31,1,FALSE)))","v":"Urbano"},{"$f":"IF(ISERROR(VLOOKUP(INDEX(Rel_Gestao!A30:AB31,Relatório!A144,1),Rel_Gestao!A30:AB31,3,FALSE)),\"\",(VLOOKUP(INDEX(Rel_Gestao!A30:AB31,Relatório!A144,1),Rel_Gestao!A30:AB31,3,FALSE)))","v":468},{"$f":"IF(ISERROR(VLOOKUP(INDEX(Rel_Gestao!A30:AB31,Relatório!A144,1),Rel_Gestao!A30:AB31,5,FALSE)),\"\",(VLOOKUP(INDEX(Rel_Gestao!A30:AB31,Relatório!A144,1),Rel_Gestao!A30:AB31,5,FALSE)))","v":424},{"$f":"IF(ISERROR(VLOOKUP(INDEX(Rel_Gestao!A30:AB31,Relatório!A144,1),Rel_Gestao!A30:AB31,7,FALSE)),\"\",(VLOOKUP(INDEX(Rel_Gestao!A30:AB31,Relatório!A144,1),Rel_Gestao!A30:AB31,7,FALSE)))","v":490},{"$f":"IF(ISERROR(VLOOKUP(INDEX(Rel_Gestao!A30:AB31,Relatório!A144,1),Rel_Gestao!A30:AB31,9,FALSE)),\"\",(VLOOKUP(INDEX(Rel_Gestao!A30:AB31,Relatório!A144,1),Rel_Gestao!A30:AB31,9,FALSE)))","v":556},{"$f":"IF(ISERROR(VLOOKUP(INDEX(Rel_Gestao!A30:AB31,Relatório!A144,1),Rel_Gestao!A30:AB31,11,FALSE)),\"\",(VLOOKUP(INDEX(Rel_Gestao!A30:AB31,Relatório!A144,1),Rel_Gestao!A30:AB31,11,FALSE)))","v":468},{"$f":"IF(ISERROR(VLOOKUP(INDEX(Rel_Gestao!A30:AB31,Relatório!A144,1),Rel_Gestao!A30:AB31,13,FALSE)),\"\",(VLOOKUP(INDEX(Rel_Gestao!A30:AB31,Relatório!A144,1),Rel_Gestao!A30:AB31,13,FALSE)))","v":490},{"$f":"IF(ISERROR(VLOOKUP(INDEX(Rel_Gestao!A30:AB31,Relatório!A144,1),Rel_Gestao!A30:AB31,15,FALSE)),\"\",(VLOOKUP(INDEX(Rel_Gestao!A30:AB31,Relatório!A144,1),Rel_Gestao!A30:AB31,15,FALSE)))","v":490},{"$f":"IF(ISERROR(VLOOKUP(INDEX(Rel_Gestao!A30:AB31,Relatório!A144,1),Rel_Gestao!A30:AB31,17,FALSE)),\"\",(VLOOKUP(INDEX(Rel_Gestao!A30:AB31,Relatório!A144,1),Rel_Gestao!A30:AB31,17,FALSE)))","v":""},{"$f":"IF(ISERROR(VLOOKUP(INDEX(Rel_Gestao!A30:AB31,Relatório!A144,1),Rel_Gestao!A30:AB31,19,FALSE)),\"\",(VLOOKUP(INDEX(Rel_Gestao!A30:AB31,Relatório!A144,1),Rel_Gestao!A30:AB31,19,FALSE)))","v":""},{"$f":"IF(ISERROR(VLOOKUP(INDEX(Rel_Gestao!A30:AB31,Relatório!A144,1),Rel_Gestao!A30:AB31,21,FALSE)),\"\",(VLOOKUP(INDEX(Rel_Gestao!A30:AB31,Relatório!A144,1),Rel_Gestao!A30:AB31,21,FALSE)))","v":""},{"$f":"IF(ISERROR(VLOOKUP(INDEX(Rel_Gestao!A30:AB31,Relatório!A144,1),Rel_Gestao!A30:AB31,23,FALSE)),\"\",(VLOOKUP(INDEX(Rel_Gestao!A30:AB31,Relatório!A144,1),Rel_Gestao!A30:AB31,23,FALSE)))","v":""},{"$f":"IF(ISERROR(VLOOKUP(INDEX(Rel_Gestao!A30:AB31,Relatório!A144,1),Rel_Gestao!A30:AB31,25,FALSE)),\"\",(VLOOKUP(INDEX(Rel_Gestao!A30:AB31,Relatório!A144,1),Rel_Gestao!A30:AB31,25,FALSE)))","v":""},{"$f":"IF(ISERROR(VLOOKUP(INDEX(Rel_Gestao!A30:AB31,Relatório!A144,1),Rel_Gestao!A30:AB31,27,FALSE)),\"\",(VLOOKUP(INDEX(Rel_Gestao!A30:AB31,Relatório!A144,1),Rel_Gestao!A30:AB31,27,FALSE)))","v":3386},{"$f":"AVERAGE(B145,C145,D145)","v":460.66666666666669},{"$f":"AVERAGE(E145,F145,G145)","v":504.66666666666669},{"$f":"AVERAGE(H145,I145,J145)","v":490},{"$f":"AVERAGE(K145,L145,M145)","v":{"$error":"#DIV/0!"}},{"$f":"AVERAGE(B145,C145,D145,E145,F145,G145)","v":482.66666666666669},{"$f":"AVERAGE(H145,I145,J145,K145,L145,M145)","v":490},{"$f":"AVERAGE(B145:M145)","v":483.71428571428572}]
[null,{"$f":"IF(ISERROR(VLOOKUP(INDEX(Rel_Gestao!A30:AB31,Relatório!A144,1),Rel_Gestao!A30:AB31,4,FALSE)),\"\",(VLOOKUP(INDEX(Rel_Gestao!A30:AB31,Relatório!A144,1),Rel_Gestao!A30:AB31,4,FALSE)))","v":1526.0000000000002},{"$f":"IF(ISERROR(VLOOKUP(INDEX(Rel_Gestao!A30:AB31,Relatório!A144,1),Rel_Gestao!A30:AB31,6,FALSE)),\"\",(VLOOKUP(INDEX(Rel_Gestao!A30:AB31,Relatório!A144,1),Rel_Gestao!A30:AB31,6,FALSE)))","v":1382.3999999999999},{"$f":"IF(ISERROR(VLOOKUP(INDEX(Rel_Gestao!A30:AB31,Relatório!A144,1),Rel_Gestao!A30:AB31,8,FALSE)),\"\",(VLOOKUP(INDEX(Rel_Gestao!A30:AB31,Relatório!A144,1),Rel_Gestao!A30:AB31,8,FALSE)))","v":1597.8000000000002},{"$f":"IF(ISERROR(VLOOKUP(INDEX(Rel_Gestao!A30:AB31,Relatório!A144,1),Rel_Gestao!A30:AB31,10,FALSE)),\"\",(VLOOKUP(INDEX(Rel_Gestao!A30:AB31,Relatório!A144,1),Rel_Gestao!A30:AB31,10,FALSE)))","v":1798.8000000000004},{"$f":"IF(ISERROR(VLOOKUP(INDEX(Rel_Gestao!A30:AB31,Relatório!A144,1),Rel_Gestao!A30:AB31,12,FALSE)),\"\",(VLOOKUP(INDEX(Rel_Gestao!A30:AB31,Relatório!A144,1),Rel_Gestao!A30:AB31,12,FALSE)))","v":1526.0000000000002},{"$f":"IF(ISERROR(VLOOKUP(INDEX(Rel_Gestao!A30:AB31,Relatório!A144,1),Rel_Gestao!A30:AB31,14,FALSE)),\"\",(VLOOKUP(INDEX(Rel_Gestao!A30:AB31,Relatório!A144,1),Rel_Gestao!A30:AB31,14,FALSE)))","v":1597.8000000000002},{"$f":"IF(ISERROR(VLOOKUP(INDEX(Rel_Gestao!A30:AB31,Relatório!A144,1),Rel_Gestao!A30:AB31,16,FALSE)),\"\",(VLOOKUP(INDEX(Rel_Gestao!A30:AB31,Relatório!A144,1),Rel_Gestao!A30:AB31,16,FALSE)))","v":1597.8000000000002},{"$f":"IF(ISERROR(VLOOKUP(INDEX(Rel_Gestao!A30:AB31,Relatório!A144,1),Rel_Gestao!A30:AB31,18,FALSE)),\"\",(VLOOKUP(INDEX(Rel_Gestao!A30:AB31,Relatório!A144,1),Rel_Gestao!A30:AB31,18,FALSE)))","v":""},{"$f":"IF(ISERROR(VLOOKUP(INDEX(Rel_Gestao!A30:AB31,Relatório!A144,1),Rel_Gestao!A30:AB31,20,FALSE)),\"\",(VLOOKUP(INDEX(Rel_Gestao!A30:AB31,Relatório!A144,1),Rel_Gestao!A30:AB31,20,FALSE)))","v":""},{"$f":"IF(ISERROR(VLOOKUP(INDEX(Rel_Gestao!A30:AB31,Relatório!A144,1),Rel_Gestao!A30:AB31,22,FALSE)),\"\",(VLOOKUP(INDEX(Rel_Gestao!A30:AB31,Relatório!A144,1),Rel_Gestao!A30:AB31,22,FALSE)))","v":""},{"$f":"IF(ISERROR(VLOOKUP(INDEX(Rel_Gestao!A30:AB31,Relatório!A144,1),Rel_Gestao!A30:AB31,24,FALSE)),\"\",(VLOOKUP(INDEX(Rel_Gestao!A30:AB31,Relatório!A144,1),Rel_Gestao!A30:AB31,24,FALSE)))","v":""},{"$f":"IF(ISERROR(VLOOKUP(INDEX(Rel_Gestao!A30:AB31,Relatório!A144,1),Rel_Gestao!A30:AB31,26,FALSE)),\"\",(VLOOKUP(INDEX(Rel_Gestao!A30:AB31,Relatório!A144,1),Rel_Gestao!A30:AB31,26,FALSE)))","v":""},{"$f":"IF(ISERROR(VLOOKUP(INDEX(Rel_Gestao!A30:AB31,Relatório!A144,1),Rel_Gestao!A30:AB31,28,FALSE)),\"\",(VLOOKUP(INDEX(Rel_Gestao!A30:AB31,Relatório!A144,1),Rel_Gestao!A30:AB31,28,FALSE)))","v":11026.600000000002},{"$f":"AVERAGE(B146,C146,D146)","v":1502.0666666666668},{"$f":"AVERAGE(E146,F146,G146)","v":1640.8666666666668},{"$f":"AVERAGE(H146,I146,J146)","v":1597.8000000000002},{"$f":"AVERAGE(K146,L146,M146)","v":{"$error":"#DIV/0!"}},{"$f":"AVERAGE(B146,C146,D146,E146,F146,G146)","v":1571.4666666666669},{"$f":"AVERAGE(H146,I146,J146,K146,L146,M146)","v":1597.8000000000002},{"$f":"AVERAGE(B146:M146)","v":1575.2285714285717}]
[10,{"$f":"Rel_Gestao!$C$4","v":"JANEIRO"},{"$f":"Rel_Gestao!$E$4","v":"FEVEREIRO"},{"$f":"Rel_Gestao!$G$4","v":"MARÇO"},{"$f":"Rel_Gestao!$I$4","v":"ABRIL"},{"$f":"Rel_Gestao!$K$4","v":"MAIO"},{"$f":"Rel_Gestao!$M$4","v":"JUNHO"},{"$f":"Rel_Gestao!$O$4","v":"JULHO"},{"$f":"Rel_Gestao!$Q$4","v":"AGOSTO"},{"$f":"Rel_Gestao!$S$4","v":"SETEMBRO"},{"$f":"Rel_Gestao!$U$4","v":"OUTUBRO"},{"$f":"Rel_Gestao!$W$4","v":"NOVEMBRO"},{"$f":"Rel_Gestao!$Y$4","v":"DEZEMBRO"},{"$f":"Rel_Gestao!$AA$4","v":"TOTAL"},"1º TRIM","2º TRIM","3º TRIM","4ºTRIM","1º SEM","2º SEM","ANUAL"]
[{"$f":"IF(ISERROR(VLOOKUP(INDEX(Rel_Gestao!A33:AB45,Relatório!A147,1),Rel_Gestao!A33:AB45,1,FALSE)),0,(VLOOKUP(INDEX(Rel_Gestao!A33:AB45,Relatório!A147,1),Rel_Gestao!A33:AB45,1,FALSE)))","v":"Salvador Card"},{"$f":"IF(ISERROR(VLOOKUP(INDEX(Rel_Gestao!A33:AB45,Relatório!A147,1),Rel_Gestao!A33:AB45,3,FALSE)),\"\",(VLOOKUP(INDEX(Rel_Gestao!A33:AB45,Relatório!A147,1),Rel_Gestao!A33:AB45,3,FALSE)))","v":376},{"$f":"IF(ISERROR(VLOOKUP(INDEX(Rel_Gestao!A33:AB45,Relatório!A147,1),Rel_Gestao!A33:AB45,5,FALSE)),\"\",(VLOOKUP(INDEX(Rel_Gestao!A33:AB45,Relatório!A147,1),Rel_Gestao!A33:AB45,5,FALSE)))","v":340},{"$f":"IF(ISERROR(VLOOKUP(INDEX(Rel_Gestao!A33:AB45,Relatório!A147,1),Rel_Gestao!A33:AB45,7,FALSE)),\"\",(VLOOKUP(INDEX(Rel_Gestao!A33:AB45,Relatório!A147,1),Rel_Gestao!A33:AB45,7,FALSE)))","v":394},{"$f":"IF(ISERROR(VLOOKUP(INDEX(Rel_Gestao!A33:AB45,Relatório!A147,1),Rel_Gestao!A33:AB45,9,FALSE)),\"\",(VLOOKUP(INDEX(Rel_Gestao!A33:AB45,Relatório!A147,1),Rel_Gestao!A33:AB45,9,FALSE)))","v":376},{"$f":"IF(ISERROR(VLOOKUP(INDEX(Rel_Gestao!A33:AB45,Relatório!A147,1),Rel_Gestao!A33:AB45,11,FALSE)),\"\",(VLOOKUP(INDEX(Rel_Gestao!A33:AB45,Relatório!A147,1),Rel_Gestao!A33:AB45,11,FALSE)))","v":376},{"$f":"IF(ISERROR(VLOOKUP(INDEX(Rel_Gestao!A33:AB45,Relatório!A147,1),Rel_Gestao!A33:AB45,13,FALSE)),\"\",(VLOOKUP(INDEX(Rel_Gestao!A33:AB45,Relatório!A147,1),Rel_Gestao!A33:AB45,13,FALSE)))","v":394},{"$f":"IF(ISERROR(VLOOKUP(INDEX(Rel_Gestao!A33:AB45,Relatório!A147,1),Rel_Gestao!A33:AB45,15,FALSE)),\"\",(VLOOKUP(INDEX(Rel_Gestao!A33:AB45,Relatório!A147,1),Rel_Gestao!A33:AB45,15,FALSE)))","v":394},{"$f":"IF(ISERROR(VLOOKUP(INDEX(Rel_Gestao!A33:AB45,Relatório!A147,1),Rel_Gestao!A33:AB45,17,FALSE)),\"\",(VLOOKUP(INDEX(Rel_Gestao!A33:AB45,Relatório!A147,1),Rel_Gestao!A33:AB45,17,FALSE)))","v":""},{"$f":"IF(ISERROR(VLOOKUP(INDEX(Rel_Gestao!A33:AB45,Relatório!A147,1),Rel_Gestao!A33:AB45,19,FALSE)),\"\",(VLOOKUP(INDEX(Rel_Gestao!A33:AB45,Relatório!A147,1),Rel_Gestao!A33:AB45,19,FALSE)))","v":""},{"$f":"IF(ISERROR(VLOOKUP(INDEX(Rel_Gestao!A33:AB45,Relatório!A147,1),Rel_Gestao!A33:AB45,21,FALSE)),\"\",(VLOOKUP(INDEX(Rel_Gestao!A33:AB45,Relatório!A147,1),Rel_Gestao!A33:AB45,21,FALSE)))","v":""},{"$f":"IF(ISERROR(VLOOKUP(INDEX(Rel_Gestao!A33:AB45,Relatório!A147,1),Rel_Gestao!A33:AB45,23,FALSE)),\"\",(VLOOKUP(INDEX(Rel_Gestao!A33:AB45,Relatório!A147,1),Rel_Gestao!A33:AB45,23,FALSE)))","v":""},{"$f":"IF(ISERROR(VLOOKUP(INDEX(Rel_Gestao!A33:AB45,Relatório!A147,1),Rel_Gestao!A33:AB45,25,FALSE)),\"\",(VLOOKUP(INDEX(Rel_Gestao!A33:AB45,Relatório!A147,1),Rel_Gestao!A33:AB45,25,FALSE)))","v":""},{"$f":"IF(ISERROR(VLOOKUP(INDEX(Rel_Gestao!A33:AB45,Relatório!A147,1),Rel_Gestao!A33:AB45,27,FALSE)),\"\",(VLOOKUP(INDEX(Rel_Gestao!A33:AB45,Relatório!A147,1),Rel_Gestao!A33:AB45,27,FALSE)))","v":2650},{"$f":"AVERAGE(B148,C148,D148)","v":370},{"$f":"AVERAGE(E148,F148,G148)","v":382},{"$f":"AVERAGE(H148,I148,J148)","v":394},{"$f":"AVERAGE(K148,L148,M148)","v":{"$error":"#DIV/0!"}},{"$f":"AVERAGE(B148,C148,D148,E148,F148,G148)","v":376},{"$f":"AVERAGE(H148,I148,J148,K148,L148,M148)","v":394},{"$f":"AVERAGE(B148:M148)","v":378.57142857142856}]
[null,{"$f":"IF(ISERROR(VLOOKUP(INDEX(Rel_Gestao!A33:AB45,Relatório!A147,1),Rel_Gestao!A33:AB45,4,FALSE)),\"\",(VLOOKUP(INDEX(Rel_Gestao!A33:AB45,Relatório!A147,1),Rel_Gestao!A33:AB45,4,FALSE)))","v":1240.8},{"$f":"IF(ISERROR(VLOOKUP(INDEX(Rel_Gestao!A33:AB45,Relatório!A147,1),Rel_Gestao!A33:AB45,6,FALSE)),\"\",(VLOOKUP(INDEX(Rel_Gestao!A33:AB45,Relatório!A147,1),Rel_Gestao!A33:AB45,6,FALSE)))","v":1122},{"$f":"IF(ISERROR(VLOOKUP(INDEX(Rel_Gestao!A33:AB45,Relatório!A147,1),Rel_Gestao!A33:AB45,8,FALSE)),\"\",(VLOOKUP(INDEX(Rel_Gestao!A33:AB45,Relatório!A147,1),Rel_Gestao!A33:AB45,8,FALSE)))","v":1300.2},{"$f":"IF(ISERROR(VLOOKUP(INDEX(Rel_Gestao!A33:AB45,Relatório!A147,1),Rel_Gestao!A33:AB45,10,FALSE)),\"\",(VLOOKUP(INDEX(Rel_Gestao!A33:AB45,Relatório!A147,1),Rel_Gestao!A33:AB45,10,FALSE)))","v":1240.8},{"$f":"IF(ISERROR(VLOOKUP(INDEX(Rel_Gestao!A33:AB45,Relatório!A147,1),Rel_Gestao!A33:AB45,12,FALSE)),\"\",(VLOOKUP(INDEX(Rel_Gestao!A33:AB45,Relatório!A147,1),Rel_Gestao!A33:AB45,12,FALSE)))","v":1240.8},{"$f":"IF(ISERROR(VLOOKUP(INDEX(Rel_Gestao!A33:AB45,Relatório!A147,1),Rel_Gestao!A33:AB45,14,FALSE)),\"\",(VLOOKUP(INDEX(Rel_Gestao!A33:AB45,Relatório!A147,1),Rel_Gestao!A33:AB45,14,FALSE)))","v":1300.2},{"$f":"IF(ISERROR(VLOOKUP(INDEX(Rel_Gestao!A33:AB45,Relatório!A147,1),Rel_Gestao!A33:AB45,16,FALSE)),\"\",(VLOOKUP(INDEX(Rel_Gestao!A33:AB45,Relatório!A147,1),Rel_Gestao!A33:AB45,16,FALSE)))","v":1300.2},{"$f":"IF(ISERROR(VLOOKUP(INDEX(Rel_Gestao!A33:AB45,Relatório!A147,1),Rel_Gestao!A33:AB45,18,FALSE)),\"\",(VLOOKUP(INDEX(Rel_Gestao!A33:AB45,Relatório!A147,1),Rel_Gestao!A33:AB45,18,FALSE)))","v":""},{"$f":"IF(ISERROR(VLOOKUP(INDEX(Rel_Gestao!A33:AB45,Relatório!A147,1),Rel_Gestao!A33:AB45,20,FALSE)),\"\",(VLOOKUP(INDEX(Rel_Gestao!A33:AB45,Relatório!A147,1),Rel_Gestao!A33:AB45,20,FALSE)))","v":""},{"$f":"IF(ISERROR(VLOOKUP(INDEX(Rel_Gestao!A33:AB45,Relatório!A147,1),Rel_Gestao!A33:AB45,22,FALSE)),\"\",(VLOOKUP(INDEX(Rel_Gestao!A33:AB45,Relatório!A147,1),Rel_Gestao!A33:AB45,22,FALSE)))","v":""},{"$f":"IF(ISERROR(VLOOKUP(INDEX(Rel_Gestao!A33:AB45,Relatório!A147,1),Rel_Gestao!A33:AB45,24,FALSE)),\"\",(VLOOKUP(INDEX(Rel_Gestao!A33:AB45,Relatório!A147,1),Rel_Gestao!A33:AB45,24,FALSE)))","v":""},{"$f":"IF(ISERROR(VLOOKUP(INDEX(Rel_Gestao!A33:AB45,Relatório!A147,1),Rel_Gestao!A33:AB45,26,FALSE)),\"\",(VLOOKUP(INDEX(Rel_Gestao!A33:AB45,Relatório!A147,1),Rel_Gestao!A33:AB45,26,FALSE)))","v":""},{"$f":"IF(ISERROR(VLOOKUP(INDEX(Rel_Gestao!A33:AB45,Relatório!A147,1),Rel_Gestao!A33:AB45,28,FALSE)),0,(VLOOKUP(INDEX(Rel_Gestao!A33:AB45,Relatório!A147,1),Rel_Gestao!A33:AB45,28,FALSE)))","v":8745},{"$f":"AVERAGE(B149,C149,D149)","v":1221},{"$f":"AVERAGE(E149,F149,G149)","v":1260.6000000000001},{"$f":"AVERAGE(H149,I149,J149)","v":1300.2},{"$f":"AVERAGE(K149,L149,M149)","v":{"$error":"#DIV/0!"}},{"$f":"AVERAGE(B149,C149,D149,E149,F149,G149)","v":1240.8},{"$f":"AVERAGE(H149,I149,J149,K149,L149,M149)","v":1300.2},{"$f":"AVERAGE(B149:M149)","v":1249.2857142857142}]
[14,{"$f":"Rel_Gestao!$C$4","v":"JANEIRO"},{"$f":"Rel_Gestao!$E$4","v":"FEVEREIRO"},{"$f":"Rel_Gestao!$G$4","v":"MARÇO"},{"$f":"Rel_Gestao!$I$4","v":"ABRIL"},{"$f":"Rel_Gestao!$K$4","v":"MAIO"},{"$f":"Rel_Gestao!$M$4","v":"JUNHO"},{"$f":"Rel_Gestao!$O$4","v":"JULHO"},{"$f":"Rel_Gestao!$Q$4","v":"AGOSTO"},{"$f":"Rel_Gestao!$S$4","v":"SETEMBRO"},{"$f":"Rel_Gestao!$U$4","v":"OUTUBRO"},{"$f":"Rel_Gestao!$W$4","v":"NOVEMBRO"},{"$f":"Rel_Gestao!$Y$4","v":"DEZEMBRO"},{"$f":"Rel_Gestao!$AA$4","v":"TOTAL"},"1º TRIM","2º TRIM","3º TRIM","4ºTRIM","1º SEM","2º SEM","ANUAL"]
[{"$f":"IF(ISERROR(VLOOKUP(INDEX(Rel_Gestao!B48:AB119,Relatório!A150,1),Rel_Gestao!B48:AB119,1,FALSE)),0,(VLOOKUP(INDEX(Rel_Gestao!B48:AB119,Relatório!A150,1),Rel_Gestao!B48:AB119,1,FALSE)))","v":"Taiane Silva Cabral"},{"$f":"IF(ISERROR(VLOOKUP(INDEX(Rel_Gestao!B48:AB119,Relatório!A150,1),Rel_Gestao!B48:AB119,2,FALSE)),\"\",(VLOOKUP(INDEX(Rel_Gestao!B48:AB119,Relatório!A150,1),Rel_Gestao!B48:AB119,2,FALSE)))","v":0},{"$f":"IF(ISERROR(VLOOKUP(INDEX(Rel_Gestao!B48:AB119,Relatório!A150,1),Rel_Gestao!B48:AB119,4,FALSE)),\"\",(VLOOKUP(INDEX(Rel_Gestao!B48:AB119,Relatório!A150,1),Rel_Gestao!B48:AB119,4,FALSE)))","v":0},{"$f":"IF(ISERROR(VLOOKUP(INDEX(Rel_Gestao!B48:AB119,Relatório!A150,1),Rel_Gestao!B48:AB119,6,FALSE)),\"\",(VLOOKUP(INDEX(Rel_Gestao!B48:AB119,Relatório!A150,1),Rel_Gestao!B48:AB119,6,FALSE)))","v":0},{"$f":"IF(ISERROR(VLOOKUP(INDEX(Rel_Gestao!B48:AB119,Relatório!A150,1),Rel_Gestao!B48:AB119,8,FALSE)),\"\",(VLOOKUP(INDEX(Rel_Gestao!B48:AB119,Relatório!A150,1),Rel_Gestao!B48:AB119,8,FALSE)))","v":0},{"$f":"IF(ISERROR(VLOOKUP(INDEX(Rel_Gestao!B48:AB119,Relatório!A150,1),Rel_Gestao!B48:AB119,10,FALSE)),\"\",(VLOOKUP(INDEX(Rel_Gestao!B48:AB119,Relatório!A150,1),Rel_Gestao!B48:AB119,10,FALSE)))","v":0},{"$f":"IF(ISERROR(VLOOKUP(INDEX(Rel_Gestao!B48:AB119,Relatório!A150,1),Rel_Gestao!B48:AB119,12,FALSE)),\"\",(VLOOKUP(INDEX(Rel_Gestao!B48:AB119,Relatório!A150,1),Rel_Gestao!B48:AB119,12,FALSE)))","v":0},{"$f":"IF(ISERROR(VLOOKUP(INDEX(Rel_Gestao!B48:AB119,Relatório!A150,1),Rel_Gestao!B48:AB119,14,FALSE)),\"\",(VLOOKUP(INDEX(Rel_Gestao!B48:AB119,Relatório!A150,1),Rel_Gestao!B48:AB119,14,FALSE)))","v":0},{"$f":"IF(ISERROR(VLOOKUP(INDEX(Rel_Gestao!B48:AB119,Relatório!A150,1),Rel_Gestao!B48:AB119,16,FALSE)),\"\",(VLOOKUP(INDEX(Rel_Gestao!B48:AB119,Relatório!A150,1),Rel_Gestao!B48:AB119,16,FALSE)))","v":""},{"$f":"IF(ISERROR(VLOOKUP(INDEX(Rel_Gestao!B48:AB119,Relatório!A150,1),Rel_Gestao!B48:AB119,18,FALSE)),\"\",(VLOOKUP(INDEX(Rel_Gestao!B48:AB119,Relatório!A150,1),Rel_Gestao!B48:AB119,18,FALSE)))","v":""},{"$f":"IF(ISERROR(VLOOKUP(INDEX(Rel_Gestao!B48:AB119,Relatório!A150,1),Rel_Gestao!B48:AB119,20,FALSE)),\"\",(VLOOKUP(INDEX(Rel_Gestao!B48:AB119,Relatório!A150,1),Rel_Gestao!B48:AB119,20,FALSE)))","v":""},{"$f":"IF(ISERROR(VLOOKUP(INDEX(Rel_Gestao!B48:AB119,Relatório!A150,1),Rel_Gestao!B48:AB119,22,FALSE)),\"\",(VLOOKUP(INDEX(Rel_Gestao!B48:AB119,Relatório!A150,1),Rel_Gestao!B48:AB119,22,FALSE)))","v":""},{"$f":"IF(ISERROR(VLOOKUP(INDEX(Rel_Gestao!B48:AB119,Relatório!A150,1),Rel_Gestao!B48:AB119,24,FALSE)),\"\",(VLOOKUP(INDEX(Rel_Gestao!B48:AB119,Relatório!A150,1),Rel_Gestao!B48:AB119,24,FALSE)))","v":""},{"$f":"IF(ISERROR(VLOOKUP(INDEX(Rel_Gestao!B48:AB119,Relatório!A150,1),Rel_Gestao!B48:AB119,26,FALSE)),\"\",(VLOOKUP(INDEX(Rel_Gestao!B48:AB119,Relatório!A150,1),Rel_Gestao!B48:AB119,26,FALSE)))","v":0},{"$f":"AVERAGE(B151,C151,D151)","v":0},{"$f":"AVERAGE(E151,F151,G151)","v":0},{"$f":"AVERAGE(H151,I151,J151)","v":0},{"$f":"AVERAGE(K151,L151,M151)","v":{"$error":"#DIV/0!"}},{"$f":"AVERAGE(B151,C151,D151,E151,F151,G151)","v":0},{"$f":"AVERAGE(H151,I151,J151,K151,L151,M151)","v":0},{"$f":"AVERAGE(B151:M151)","v":0}]
[null,{"$f":"IF(ISERROR(VLOOKUP(INDEX(Rel_Gestao!B48:AB119,Relatório!A150,1),Rel_Gestao!B48:AB119,3,FALSE)),\"\",(VLOOKUP(INDEX(Rel_Gestao!B48:AB119,Relatório!A150,1),Rel_Gestao!B48:AB119,3,FALSE)))","v":0},{"$f":"IF(ISERROR(VLOOKUP(INDEX(Rel_Gestao!B48:AB119,Relatório!A150,1),Rel_Gestao!B48:AB119,5,FALSE)),\"\",(VLOOKUP(INDEX(Rel_Gestao!B48:AB119,Relatório!A150,1),Rel_Gestao!B48:AB119,5,FALSE)))","v":0},{"$f":"IF(ISERROR(VLOOKUP(INDEX(Rel_Gestao!B48:AB119,Relatório!A150,1),Rel_Gestao!B48:AB119,7,FALSE)),\"\",(VLOOKUP(INDEX(Rel_Gestao!B48:AB119,Relatório!A150,1),Rel_Gestao!B48:AB119,7,FALSE)))","v":0},{"$f":"IF(ISERROR(VLOOKUP(INDEX(Rel_Gestao!B48:AB119,Relatório!A150,1),Rel_Gestao!B48:AB119,9,FALSE)),\"\",(VLOOKUP(INDEX(Rel_Gestao!B48:AB119,Relatório!A150,1),Rel_Gestao!B48:AB119,9,FALSE)))","v":0},{"$f":"IF(ISERROR(VLOOKUP(INDEX(Rel_Gestao!B48:AB119,Relatório!A150,1),Rel_Gestao!B48:AB119,11,FALSE)),\"\",(VLOOKUP(INDEX(Rel_Gestao!B48:AB119,Relatório!A150,1),Rel_Gestao!B48:AB119,11,FALSE)))","v":0},{"$f":"IF(ISERROR(VLOOKUP(INDEX(Rel_Gestao!B48:AB119,Relatório!A150,1),Rel_Gestao!B48:AB119,13,FALSE)),\"\",(VLOOKUP(INDEX(Rel_Gestao!B48:AB119,Relatório!A150,1),Rel_Gestao!B48:AB119,13,FALSE)))","v":0},{"$f":"IF(ISERROR(VLOOKUP(INDEX(Rel_Gestao!B48:AB119,Relatório!A150,1),Rel_Gestao!B48:AB119,15,FALSE)),\"\",(VLOOKUP(INDEX(Rel_Gestao!B48:AB119,Relatório!A150,1),Rel_Gestao!B48:AB119,15,FALSE)))","v":0},{"$f":"IF(ISERROR(VLOOKUP(INDEX(Rel_Gestao!B48:AB119,Relatório!A150,1),Rel_Gestao!B48:AB119,17,FALSE)),\"\",(VLOOKUP(INDEX(Rel_Gestao!B48:AB119,Relatório!A150,1),Rel_Gestao!B48:AB119,17,FALSE)))","v":""},{"$f":"IF(ISERROR(VLOOKUP(INDEX(Rel_Gestao!B48:AB119,Relatório!A150,1),Rel_Gestao!B48:AB119,19,FALSE)),\"\",(VLOOKUP(INDEX(Rel_Gestao!B48:AB119,Relatório!A150,1),Rel_Gestao!B48:AB119,19,FALSE)))","v":""},{"$f":"IF(ISERROR(VLOOKUP(INDEX(Rel_Gestao!B48:AB119,Relatório!A150,1),Rel_Gestao!B48:AB119,21,FALSE)),\"\",(VLOOKUP(INDEX(Rel_Gestao!B48:AB119,Relatório!A150,1),Rel_Gestao!B48:AB119,21,FALSE)))","v":""},{"$f":"IF(ISERROR(VLOOKUP(INDEX(Rel_Gestao!B48:AB119,Relatório!A150,1),Rel_Gestao!B48:AB119,23,FALSE)),\"\",(VLOOKUP(INDEX(Rel_Gestao!B48:AB119,Relatório!A150,1),Rel_Gestao!B48:AB119,23,FALSE)))","v":""},{"$f":"IF(ISERROR(VLOOKUP(INDEX(Rel_Gestao!B48:AB119,Relatório!A150,1),Rel_Gestao!B48:AB119,25,FALSE)),\"\",(VLOOKUP(INDEX(Rel_Gestao!B48:AB119,Relatório!A150,1),Rel_Gestao!B48:AB119,25,FALSE)))","v":""},{"$f":"IF(ISERROR(VLOOKUP(INDEX(Rel_Gestao!B48:AB119,Relatório!A150,1),Rel_Gestao!B48:AB119,27,FALSE)),\"\",(VLOOKUP(INDEX(Rel_Gestao!B48:AB119,Relatório!A150,1),Rel_Gestao!B48:AB119,27,FALSE)))","v":0},{"$f":"AVERAGE(B152,C152,D152)","v":0},{"$f":"AVERAGE(E152,F152,G152)","v":0},{"$f":"AVERAGE(H152,I152,J152)","v":0},{"$f":"AVERAGE(K152,L152,M152)","v":{"$error":"#DIV/0!"}},{"$f":"AVERAGE(B152,C152,D152,E152,F152,G152)","v":0},{"$f":"AVERAGE(H152,I152,J152,K152,L152,M152)","v":0},{"$f":"AVERAGE(B152:M152)","v":0}]
[null,{"$f":"Rel_Gestao!$C$4","v":"JANEIRO"},{"$f":"Rel_Gestao!$E$4","v":"FEVEREIRO"},{"$f":"Rel_Gestao!$G$4","v":"MARÇO"},{"$f":"Rel_Gestao!$I$4","v":"ABRIL"},{"$f":"Rel_Gestao!$K$4","v":"MAIO"},{"$f":"Rel_Gestao!$M$4","v":"JUNHO"},{"$f":"Rel_Gestao!$O$4","v":"JULHO"},{"$f":"Rel_Gestao!$Q$4","v":"AGOSTO"},{"$f":"Rel_Gestao!$S$4","v":"SETEMBRO"},{"$f":"Rel_Gestao!$U$4","v":"OUTUBRO"},{"$f":"Rel_Gestao!$W$4","v":"NOVEMBRO"},{"$f":"Rel_Gestao!$Y$4","v":"DEZEMBRO"},{"$f":"Rel_Gestao!$AA$4","v":"TOTAL"},"1º TRIM","2º TRIM","3º TRIM","4ºTRIM","1º SEM","2º SEM","ANUAL"]
["Descontos",{"$f":"Rel_Gestao!B122","v":0},{"$f":"Rel_Gestao!C122","v":0},{"$f":"Rel_Gestao!D122","v":0},{"$f":"Rel_Gestao!E122","v":0},{"$f":"Rel_Gestao!F122","v":0},{"$f":"Rel_Gestao!G122","v":250.8},{"$f":"Rel_Gestao!H122","v":132},{"$f":"Rel_Gestao!I122","v":""},{"$f":"Rel_Gestao!J122","v":""},{"$f":"Rel_Gestao!K122","v":""},{"$f":"Rel_Gestao!L122","v":""},{"$f":"Rel_Gestao!M122","v":""},{"$f":"IF(ISERROR(SUM(B154:M154)),\"\",(SUM(B154:M154)))","v":382.8},{"$f":"AVERAGE(B154,C154,D154)","v":0},{"$f":"AVERAGE(E154,F154,G154)","v":83.600000000000009},{"$f":"AVERAGE(H154,I154,J154)","v":132},{"$f":"AVERAGE(K154,L154,M154)","v":{"$error":"#DIV/0!"}},{"$f":"AVERAGE(B154,C154,D154,E154,F154,G154)","v":41.800000000000004},{"$f":"AVERAGE(H154,I154,J154,K154,L154,M154)","v":132},{"$f":"AVERAGE(B154:M154)","v":54.68571428571429}]

{"sheet":"Rel_Gestao","index":10,"n_rows":122,"n_cols":28,"rows_kept":122,"cut":false,"hidden":false,"merged":[[10,0,10,1],[28,0,28,1],[31,0,31,1],[3,26,3,27],[4,0,4,1],[3,6,3,7],[3,8,3,9],[3,10,3,11],[3,12,3,13],[3,4,3,5],[1,0,2,25],[3,2,3,3],[3,14,3,15],[3,16,3,17],[3,18,3,19],[3,20,3,21],[3,22,3,23],[3,24,3,25]]}
[]
["Tabulação de Dados de Vales-Transporte"]
[]
[null,null,"JANEIRO",null,"FEVEREIRO",null,"MARÇO",null,"ABRIL",null,"MAIO",null,"JUNHO",null,"JULHO",null,"AGOSTO",null,"SETEMBRO",null,"OUTUBRO",null,"NOVEMBRO",null,"DEZEMBRO",null,"TOTAL"]
["Vínculo",null,"Quant. Total","Vlr. Total","Quant. Total","Vlr. Total","Quant. Total","Vlr. Total","Quant. Total","Vlr. Total","Quant. Total","Vlr. Total","Quant. Total","Vlr. Total","Quant. Total","Vlr. Total","Quant. Total","Vlr. Total","Quant. Total","Vlr. Total","Quant. Total","Vlr. Total","Quant. Total","Vlr. Total","Quant. Total","Vlr. Total","Quant. Total","Vlr. Total"]
["Anistiado",null,{"$f":"SUMIF(Janeiro!C6:R77,A6,Janeiro!O6:O77)","v":168},{"$f":"SUMIF(Janeiro!$C$6:$R$77,A6,Janeiro!$R$6:$R$77)","v":1889.2},{"$f":"SUMIF(Fevereiro!$C$6:$R$77,A6,Fevereiro!$O$6:$O$77)","v":156},{"$f":"SUMIF(Fevereiro!$C$6:$R$77,A6,Fevereiro!$R$6:$R$77)","v":1751.4},{"$f":"SUMIF(Março!$C$6:$R$80,A6,Março!$O$6:$O$80)","v":174},{"$f":"SUMIF(Março!$C$6:$R$80,A6,Março!$R$6:$R$80)","v":1958.1},{"$f":"SUMIF(Abril!$C$6:$R$80,A6,Abril!$O$6:$O$80)","v":168},{"$f":"SUMIF(Abril!$C$6:$R$80,A6,Abril!$R$6:$R$80)","v":1889.2},{"$f":"SUMIF(Maio!$C$6:$R$80,A6,Maio!$O$6:$O$80)","v":168},{"$f":"SUMIF(Maio!$C$6:$R$80,A6,Maio!$R$6:$R$80)","v":1889.2},{"$f":"SUMIF(Junho!$C$6:$R$80,A6,Junho!$O$6:$O$80)","v":174},{"$f":"SUMIF(Junho!$C$6:$R$80,A6,Junho!$R$6:$R$80)","v":1958.1},{"$f":"SUMIF(Julho!$C$6:$R$80,A6,Julho!$O$6:$O$80)","v":174},{"$f":"SUMIF(Julho!$C$6:$R$80,A6,Julho!$R$6:$R$80)","v":1958.1},{"$f":"SUMIF([1]Agosto!$C$6:$R$80,A6,[1]Agosto!$O$6:$O$80)","v":{"$error":"#VALUE!"}},{"$f":"SUMIF([1]Agosto!$C$6:$R$80,A6,[1]Agosto!$R$6:$R$80)","v":{"$error":"#VALUE!"}},{"$f":"SUMIF([2]Setembro!$C$6:$R$80,A6,[2]Setembro!$O$6:$O$80)","v":{"$error":"#VALUE!"}},{"$f":"SUMIF([3]SET!$C$6:$R$80,A6,[3]SET!$R$6:$R$80)","v":{"$error":"#VALUE!"}},{"$f":"SUMIF([4]Outubro!$C$6:$R$80,A6,[4]Outubro!$O$6:$O$80)","v":{"$error":"#VALUE!"}},{"$f":"SUMIF([4]Outubro!$C$6:$R$80,A6,[4]Outubro!$R$6:$R$80)","v":{"$error":"#VALUE!"}},{"$f":"SUMIF([5]Novembro!$C$6:$R$80,A6,[5]Novembro!$O$6:$O$80)","v":{"$error":"#VALUE!"}},{"$f":"SUMIF([5]Novembro!$C$6:$R$80,A6,[5]Novembro!$R$6:$R$80)","v":{"$error":"#VALUE!"}},{"$f":"SUMIF([6]Dezembro!$C$6:$R$80,D6,[6]Dezembro!$O$6:$O$80)","v":{"$error":"#VALUE!"}},{"$f":"SUMIF([6]Dezembro!$C$6:$R$80,D6,[6]Dezembro!$R$6:$R$80)","v":{"$error":"#VALUE!"}},{"$f":"IF(ISERROR(C6),0,C6)+IF(ISERROR(E6),0,E6)+IF(ISERROR(G6),0,G6)+IF(ISERROR(I6),0,I6)+IF(ISERROR(K6),0,K6)+IF(ISERROR(M6),0,M6)+IF(ISERROR(O6),0,O6)+IF(ISERROR(Q6),0,Q6)+IF(ISERROR(S6),0,S6)+IF(ISERROR(U6),0,U6)+IF(ISERROR(W6),0,W6)+IF(ISERROR(Y6),0,Y6)","v":1182},{"$f":"IF(ISERROR(D6),0,D6)+IF(ISERROR(F6),0,F6)+IF(ISERROR(H6),0,H6)+IF(ISERROR(J6),0,J6)+IF(ISERROR(L6),0,L6)+IF(ISERROR(N6),0,N6)+IF(ISERROR(P6),0,P6)+IF(ISERROR(R6),0,R6)+IF(ISERROR(T6),0,T6)+IF(ISERROR(V6),0,V6)+IF(ISERROR(X6),0,X6)+IF(ISERROR(Z6),0,Z6)","v":13293.300000000001}]
["Aprendiz",null,{"$f":"SUMIF(Janeiro!C7:R78,A7,Janeiro!O7:O78)","v":0},{"$f":"SUMIF(Janeiro!$C$6:$R$77,A7,Janeiro!$R$6:$R$77)","v":0},{"$f":"SUMIF(Fevereiro!$C$6:$R$77,A7,Fevereiro!$O$6:$O$77)","v":0},{"$f":"SUMIF(Fevereiro!$C$6:$R$77,A7,Fevereiro!$R$6:$R$77)","v":0},{"$f":"SUMIF(Março!$C$6:$R$80,A7,Março!$O$6:$O$80)","v":0},{"$f":"SUMIF(Março!$C$6:$R$80,A7,Março!$R$6:$R$80)","v":0},{"$f":"SUMIF(Abril!$C$6:$R$80,A7,Abril!$O$6:$O$80)","v":12},{"$f":"SUMIF(Abril!$C$6:$R$80,A7,Abril!$R$6:$R$80)","v":37.200000000000003},{"$f":"SUMIF(Maio!$C$6:$R$80,A7,Maio!$O$6:$O$80)","v":0},{"$f":"SUMIF(Maio!$C$6:$R$80,A7,Maio!$R$6:$R$80)","v":0},{"$f":"SUMIF(Junho!$C$6:$R$80,A7,Junho!$O$6:$O$80)","v":0},{"$f":"SUMIF(Junho!$C$6:$R$80,A7,Junho!$R$6:$R$80)","v":0},{"$f":"SUMIF(Julho!$C$6:$R$80,A7,Julho!$O$6:$O$80)","v":0},{"$f":"SUMIF(Julho!$C$6:$R$80,A7,Julho!$R$6:$R$80)","v":0},{"$f":"SUMIF([1]Agosto!$C$6:$R$80,A7,[1]Agosto!$O$6:$O$80)","v":{"$error":"#VALUE!"}},{"$f":"SUMIF([1]Agosto!$C$6:$R$80,A7,[1]Agosto!$R$6:$R$80)","v":{"$error":"#VALUE!"}},{"$f":"SUMIF([2]Setembro!$C$6:$R$80,A7,[2]Setembro!$O$6:$O$80)","v":{"$error":"#VALUE!"}},{"$f":"SUMIF([3]SET!$C$6:$R$80,A7,[3]SET!$R$6:$R$80)","v":{"$error":"#VALUE!"}},{"$f":"SUMIF([4]Outubro!$C$6:$R$80,A7,[4]Outubro!$O$6:$O$80)","v":{"$error":"#VALUE!"}},{"$f":"SUMIF([4]Outubro!$C$6:$R$80,A7,[4]Outubro!$R$6:$R$80)","v":{"$error":"#VALUE!"}},{"$f":"SUMIF([5]Novembro!$C$6:$R$80,A7,[5]Novembro!$O$6:$O$80)","v":{"$error":"#VALUE!"}},{"$f":"SUMIF([5]Novembro!$C$6:$R$80,A7,[5]Novembro!$R$6:$R$80)","v":{"$error":"#VALUE!"}},{"$f":"SUMIF([6]Dezembro!$C$6:$R$80,D7,[6]Dezembro!$O$6:$O$80)","v":{"$error":"#VALUE!"}},{"$f":"SUMIF([6]Dezembro!$C$6:$R$80,D7,[6]Dezembro!$R$6:$R$80)","v":{"$error":"#VALUE!"}},{"$f":"IF(ISERROR(C7),0,C7)+IF(ISERROR(E7),0,E7)+IF(ISERROR(G7),0,G7)+IF(ISERROR(I7),0,I7)+IF(ISERROR(K7),0,K7)+IF(ISERROR(M7),0,M7)+IF(ISERROR(O7),0,O7)+IF(ISERROR(Q7),0,Q7)+IF(ISERROR(S7),0,S7)+IF(ISERROR(U7),0,U7)+IF(ISERROR(W7),0,W7)+IF(ISERROR(Y7),0,Y7)","v":12},{"$f":"IF(ISERROR(D7),0,D7)+IF(ISERROR(F7),0,F7)+IF(ISERROR(H7),0,H7)+IF(ISERROR(J7),0,J7)+IF(ISERROR(L7),0,L7)+IF(ISERROR(N7),0,N7)+IF(ISERROR(P7),0,P7)+IF(ISERROR(R7),0,R7)+IF(ISERROR(T7),0,T7)+IF(ISERROR(V7),0,V7)+IF(ISERROR(X7),0,X7)+IF(ISERROR(Z7),0,Z7)","v":37.200000000000003}]
["Cedido",null,{"$f":"SUMIF(Janeiro!C8:R79,A8,Janeiro!O8:O79)","v":0},{"$f":"SUMIF(Janeiro!$C$6:$R$77,A8,Janeiro!$R$6:$R$77)","v":0},{"$f":"SUMIF(Fevereiro!$C$6:$R$77,A8,Fevereiro!$O$6:$O$77)","v":0},{"$f":"SUMIF(Fevereiro!$C$6:$R$77,A8,Fevereiro!$R$6:$R$77)","v":0},{"$f":"SUMIF(Março!$C$6:$R$80,A8,Março!$O$6:$O$80)","v":0},{"$f":"SUMIF(Março!$C$6:$R$80,A8,Março!$R$6:$R$80)","v":0},{"$f":"SUMIF(Abril!$C$6:$R$80,A8,Abril!$O$6:$O$80)","v":0},{"$f":"SUMIF(Abril!$C$6:$R$80,A8,Abril!$R$6:$R$80)","v":0},{"$f":"SUMIF(Maio!$C$6:$R$80,A8,Maio!$O$6:$O$80)","v":0},{"$f":"SUMIF(Maio!$C$6:$R$80,A8,Maio!$R$6:$R$80)","v":0},{"$f":"SUMIF(Junho!$C$6:$R$80,A8,Junho!$O$6:$O$80)","v":0},{"$f":"SUMIF(Junho!$C$6:$R$80,A8,Junho!$R$6:$R$80)","v":0},{"$f":"SUMIF(Julho!$C$6:$R$80,A8,Julho!$O$6:$O$80)","v":0},{"$f":"SUMIF(Julho!$C$6:$R$80,A8,Julho!$R$6:$R$80)","v":0},{"$f":"SUMIF([1]Agosto!$C$6:$R$80,A8,[1]Agosto!$O$6:$O$80)","v":{"$error":"#VALUE!"}},{"$f":"SUMIF([1]Agosto!$C$6:$R$80,A8,[1]Agosto!$R$6:$R$80)","v":{"$error":"#VALUE!"}},{"$f":"SUMIF([2]Setembro!$C$6:$R$80,A8,[2]Setembro!$O$6:$O$80)","v":{"$error":"#VALUE!"}},{"$f":"SUMIF([3]SET!$C$6:$R$80,A8,[3]SET!$R$6:$R$80)","v":{"$error":"#VALUE!"}},{"$f":"SUMIF([4]Outubro!$C$6:$R$80,A8,[4]Outubro!$O$6:$O$80)","v":{"$error":"#VALUE!"}},{"$f":"SUMIF([4]Outubro!$C$6:$R$80,A8,[4]Outubro!$R$6:$R$80)","v":{"$error":"#VALUE!"}},{"$f":"SUMIF([5]Novembro!$C$6:$R$80,A8,[5]Novembro!$O$6:$O$80)","v":{"$error":"#VALUE!"}},{"$f":"SUMIF([5]Novembro!$C$6:$R$80,A8,[5]Novembro!$R$6:$R$80)","v":{"$error":"#VALUE!"}},{"$f":"SUMIF([6]Dezembro!$C$6:$R$80,D8,[6]Dezembro!$O$6:$O$80)","v":{"$error":"#VALUE!"}},{"$f":"SUMIF([6]Dezembro!$C$6:$R$80,D8,[6]Dezembro!$R$6:$R$80)","v":{"$error":"#VALUE!"}},0,0]
["Empregado",null,{"$f":"SUMIF(Janeiro!C9:R80,A9,Janeiro!O9:O80)","v":633},{"$f":"SUMIF(Janeiro!$C$6:$R$77,A9,Janeiro!$R$6:$R$77)","v":3842.9999999999995},{"$f":"SUMIF(Fevereiro!$C$6:$R$77,A9,Fevereiro!$O$6:$O$77)","v":577},{"$f":"SUMIF(Fevereiro!$C$6:$R$77,A9,Fevereiro!$R$6:$R$77)","v":3580.8800000000006},{"$f":"SUMIF(Março!$C$6:$R$80,A9,Março!$O$6:$O$80)","v":661},{"$f":"SUMIF(Março!$C$6:$R$80,A9,Março!$R$6:$R$80)","v":3974.059999999999},{"$f":"SUMIF(Abril!$C$6:$R$80,A9,Abril!$O$6:$O$80)","v":747},{"$f":"SUMIF(Abril!$C$6:$R$80,A9,Abril!$R$6:$R$80)","v":4274.3},{"$f":"SUMIF(Maio!$C$6:$R$80,A9,Maio!$O$6:$O$80)","v":633},{"$f":"SUMIF(Maio!$C$6:$R$80,A9,Maio!$R$6:$R$80)","v":3842.9999999999995},{"$f":"SUMIF(Junho!$C$6:$R$80,A9,Junho!$O$6:$O$80)","v":661},{"$f":"SUMIF(Junho!$C$6:$R$80,A9,Junho!$R$6:$R$80)","v":3974.059999999999},{"$f":"SUMIF(Julho!$C$6:$R$80,A9,Julho!$O$6:$O$80)","v":661},{"$f":"SUMIF(Julho!$C$6:$R$80,A9,Julho!$R$6:$R$80)","v":3974.059999999999},{"$f":"SUMIF([1]Agosto!$C$6:$R$80,A9,[1]Agosto!$O$6:$O$80)","v":{"$error":"#VALUE!"}},{"$f":"SUMIF([1]Agosto!$C$6:$R$80,A9,[1]Agosto!$R$6:$R$80)","v":{"$error":"#VALUE!"}},{"$f":"SUMIF([2]Setembro!$C$6:$R$80,A9,[2]Setembro!$O$6:$O$80)","v":{"$error":"#VALUE!"}},{"$f":"SUMIF([3]SET!$C$6:$R$80,A9,[3]SET!$R$6:$R$80)","v":{"$error":"#VALUE!"}},{"$f":"SUMIF([4]Outubro!$C$6:$R$80,A9,[4]Outubro!$O$6:$O$80)","v":{"$error":"#VALUE!"}},{"$f":"SUMIF([4]Outubro!$C$6:$R$80,A9,[4]Outubro!$R$6:$R$80)","v":{"$error":"#VALUE!"}},{"$f":"SUMIF([5]Novembro!$C$6:$R$80,A9,[5]Novembro!$O$6:$O$80)","v":{"$error":"#VALUE!"}},{"$f":"SUMIF([5]Novembro!$C$6:$R$80,A9,[5]Novembro!$R$6:$R$80)","v":{"$error":"#VALUE!"}},{"$f":"SUMIF([6]Dezembro!$C$6:$R$80,D9,[6]Dezembro!$O$6:$O$80)","v":{"$error":"#VALUE!"}},{"$f":"SUMIF([6]Dezembro!$C$6:$R$80,D9,[6]Dezembro!$R$6:$R$80)","v":{"$error":"#VALUE!"}},4573,27463.359999999993]
["Estagiário",null,{"$f":"SUMIF(Janeiro!C10:R81,A10,Janeiro!O10:O81)","v":0},{"$f":"SUMIF(Janeiro!$C$6:$R$77,A10,Janeiro!$R$6:$R$77)","v":0},{"$f":"SUMIF(Fevereiro!$C$6:$R$77,A10,Fevereiro!$O$6:$O$77)","v":0},{"$f":"SUMIF(Fevereiro!$C$6:$R$77,A10,Fevereiro!$R$6:$R$77)","v":0},{"$f":"SUMIF(Março!$C$6:$R$80,A10,Março!$O$6:$O$80)","v":0},{"$f":"SUMIF(Março!$C$6:$R$80,A10,Março!$R$6:$R$80)","v":0},{"$f":"SUMIF(Abril!$C$6:$R$80,A10,Abril!$O$6:$O$80)","v":0},{"$f":"SUMIF(Abril!$C$6:$R$80,A10,Abril!$R$6:$R$80)","v":0},{"$f":"SUMIF(Maio!$C$6:$R$80,A10,Maio!$O$6:$O$80)","v":0},{"$f":"SUMIF(Maio!$C$6:$R$80,A10,Maio!$R$6:$R$80)","v":0},{"$f":"SUMIF(Junho!$C$6:$R$80,A10,Junho!$O$6:$O$80)","v":0},{"$f":"SUMIF(Junho!$C$6:$R$80,A10,Junho!$R$6:$R$80)","v":0},{"$f":"SUMIF(Julho!$C$6:$R$80,A10,Julho!$O$6:$O$80)","v":0},{"$f":"SUMIF(Julho!$C$6:$R$80,A10,Julho!$R$6:$R$80)","v":0},{"$f":"SUMIF([1]Agosto!$C$6:$R$80,A10,[1]Agosto!$O$6:$O$80)","v":{"$error":"#VALUE!"}},{"$f":"SUMIF([1]Agosto!$C$6:$R$80,A10,[1]Agosto!$R$6:$R$80)","v":{"$error":"#VALUE!"}},{"$f":"SUMIF([2]Setembro!$C$6:$R$80,A10,[2]Setembro!$O$6:$O$80)","v":{"$error":"#VALUE!"}},{"$f":"SUMIF([3]SET!$C$6:$R$80,A10,[3]SET!$R$6:$R$80)","v":{"$error":"#VALUE!"}},{"$f":"SUMIF([4]Outubro!$C$6:$R$80,A10,[4]Outubro!$O$6:$O$80)","v":{"$error":"#VALUE!"}},{"$f":"SUMIF([4]Outubro!$C$6:$R$80,A10,[4]Outubro!$R$6:$R$80)","v":{"$error":"#VALUE!"}},{"$f":"SUMIF([5]Novembro!$C$6:$R$80,A10,[5]Novembro!$O$6:$O$80)","v":{"$error":"#VALUE!"}},{"$f":"SUMIF([5]Novembro!$C$6:$R$80,A10,[5]Novembro!$R$6:$R$80)","v":{"$error":"#VALUE!"}},{"$f":"SUMIF([6]Dezembro!$C$6:$R$80,D10,[6]Dezembro!$O$6:$O$80)","v":{"$error":"#VALUE!"}},{"$f":"SUMIF([6]Dezembro!$C$6:$R$80,D10,[6]Dezembro!$R$6:$R$80)","v":{"$error":"#VALUE!"}},0,0]
["Rota",null,"Quant. Total","Vlr. Total","Quant. Total","Vlr. Total","Quant. Total","Vlr. Total","Quant. Total","Vlr. Total","Quant. Total","Vlr. Total","Quant. Total","Vlr. Total","Quant. Total","Vlr. Total","Quant. Total","Vlr. Total","Quant. Total","Vlr. Total","Quant. Total","Vlr. Total","Quant. Total","Vlr. Total","Quant. Total","Vlr. Total","Quant. Total","Vlr. Total"]
[23185,null,{"$f":"SUMIF(Janeiro!$F$6:$R$77,A12,Janeiro!$O$6:$O$77)","v":0},{"$f":"SUMIF(Janeiro!$F$6:$R$77,A12,Janeiro!$R$6:$R$77)","v":0},{"$f":"SUMIF(Fevereiro!$F$6:$R$77,A12,Fevereiro!$O$6:$O$77)","v":0},{"$f":"SUMIF(Fevereiro!$F$6:$R$77,A12,Fevereiro!$R$6:$R$77)","v":0},{"$f":"SUMIF(Março!$F$6:$R$80,A12,Março!$O$6:$O$80)","v":0},{"$f":"SUMIF(Março!$F$6:$R$80,A12,Março!$R$6:$R$80)","v":0},{"$f":"SUMIF(Abril!$F$6:$R$80,A12,Abril!$O$6:$O$80)","v":0},{"$f":"SUMIF(Abril!$F$6:$R$80,A12,Abril!$R$6:$R$80)","v":0},{"$f":"SUMIF(Maio!$F$6:$R$80,A12,Maio!$O$6:$O$80)","v":0},{"$f":"SUMIF(Maio!$F$6:$R$80,A12,Maio!$R$6:$R$80)","v":0},{"$f":"SUMIF(Junho!$F$6:$R$80,A12,Junho!$O$6:$O$80)","v":0},{"$f":"SUMIF(Junho!$F$6:$R$80,A12,Junho!$R$6:$R$80)","v":0},{"$f":"SUMIF(Julho!$F$6:$R$80,A12,Julho!$O$6:$O$80)","v":0},{"$f":"SUMIF(Julho!$F$6:$R$80,A12,Julho!$R$6:$R$80)","v":0},{"$f":"SUMIF([1]Agosto!$F$6:$R$80,A12,[1]Agosto!$O$6:$O$80)","v":{"$error":"#VALUE!"}},{"$f":"SUMIF([1]Agosto!$F$6:$R$80,A12,[1]Agosto!$R$6:$R$80)","v":{"$error":"#VALUE!"}},{"$f":"SUMIF([2]Setembro!$F$6:$R$80,A12,[2]Setembro!$O$6:$O$80)","v":{"$error":"#VALUE!"}},{"$f":"SUMIF([3]SET!$F$6:$R$80,A12,[3]SET!$R$6:$R$80)","v":{"$error":"#VALUE!"}},{"$f":"SUMIF([4]Outubro!$F$6:$R$80,A12,[4]Outubro!$O$6:$O$80)","v":{"$error":"#VALUE!"}},{"$f":"SUMIF([4]Outubro!$F$6:$R$80,A12,[4]Outubro!$R$6:$R$80)","v":{"$error":"#VALUE!"}},{"$f":"SUMIF([5]Novembro!$F$6:$R$80,A12,[5]Novembro!$O$6:$O$80)","v":{"$error":"#VALUE!"}},{"$f":"SUMIF([5]Novembro!$F$6:$R$80,A12,[5]Novembro!$R$6:$R$80)","v":{"$error":"#VALUE!"}},{"$f":"SUMIF([6]Dezembro!$F$6:$R$80,D12,[6]Dezembro!$O$6:$O$80)","v":{"$error":"#VALUE!"}},{"$f":"SUMIF([6]Dezembro!$F$6:$R$80,D12,[6]Dezembro!$R$6:$R$80)","v":{"$error":"#VALUE!"}},0,0]
["xxxxx-Y",null,{"$f":"SUMIF(Janeiro!$F$6:$R$77,A13,Janeiro!$O$6:$O$77)","v":40},{"$f":"SUMIF(Janeiro!$F$6:$R$77,A13,Janeiro!$R$6:$R$77)","v":112},{"$f":"SUMIF(Fevereiro!$F$6:$R$77,A13,Fevereiro!$O$6:$O$77)","v":36},{"$f":"SUMIF(Fevereiro!$F$6:$R$77,A13,Fevereiro!$R$6:$R$77)","v":100.8},{"$f":"SUMIF(Março!$F$6:$R$80,A13,Março!$O$6:$O$80)","v":42},{"$f":"SUMIF(Março!$F$6:$R$80,A13,Março!$R$6:$R$80)","v":117.6},{"$f":"SUMIF(Abril!$F$6:$R$80,A13,Abril!$O$6:$O$80)","v":40},{"$f":"SUMIF(Abril!$F$6:$R$80,A13,Abril!$R$6:$R$80)","v":112},{"$f":"SUMIF(Maio!$F$6:$R$80,A13,Maio!$O$6:$O$80)","v":40},{"$f":"SUMIF(Maio!$F$6:$R$80,A13,Maio!$R$6:$R$80)","v":112},{"$f":"SUMIF(Junho!$F$6:$R$80,A13,Junho!$O$6:$O$80)","v":42},{"$f":"SUMIF(Junho!$F$6:$R$80,A13,Junho!$R$6:$R$80)","v":117.6},{"$f":"SUMIF(Julho!$F$6:$R$80,A13,Julho!$O$6:$O$80)","v":42},{"$f":"SUMIF(Julho!$F$6:$R$80,A13,Julho!$R$6:$R$80)","v":117.6},{"$f":"SUMIF([1]Agosto!$F$6:$R$80,A13,[1]Agosto!$O$6:$O$80)","v":{"$error":"#VALUE!"}},{"$f":"SUMIF([1]Agosto!$F$6:$R$80,A13,[1]Agosto!$R$6:$R$80)","v":{"$error":"#VALUE!"}},{"$f":"SUMIF([2]Setembro!$F$6:$R$80,A13,[2]Setembro!$O$6:$O$80)","v":{"$error":"#VALUE!"}},{"$f":"SUMIF([3]SET!$F$6:$R$80,A13,[3]SET!$R$6:$R$80)","v":{"$error":"#VALUE!"}},{"$f":"SUMIF([4]Outubro!$F$6:$R$80,A13,[4]Outubro!$O$6:$O$80)","v":{"$error":"#VALUE!"}},{"$f":"SUMIF([4]Outubro!$F$6:$R$80,A13,[4]Outubro!$R$6:$R$80)","v":{"$error":"#VALUE!"}},{"$f":"SUMIF([5]Novembro!$F$6:$R$80,A13,[5]Novembro!$O$6:$O$80)","v":{"$error":"#VALUE!"}},{"$f":"SUMIF([5]Novembro!$F$6:$R$80,A13,[5]Novembro!$R$6:$R$80)","v":{"$error":"#VALUE!"}},{"$f":"SUMIF([6]Dezembro!$F$6:$R$80,D13,[6]Dezembro!$O$6:$O$80)","v":{"$error":"#VALUE!"}},{"$f":"SUMIF([6]Dezembro!$F$6:$R$80,D13,[6]Dezembro!$R$6:$R$80)","v":{"$error":"#VALUE!"}},282,789.6]
[23184,null,{"$f":"SUMIF(Janeiro!$F$6:$R$77,A14,Janeiro!$O$6:$O$77)","v":48},{"$f":"SUMIF(Janeiro!$F$6:$R$77,A14,Janeiro!$R$6:$R$77)","v":511.20000000000005},{"$f":"SUMIF(Fevereiro!$F$6:$R$77,A14,Fevereiro!$O$6:$O$77)","v":48},{"$f":"SUMIF(Fevereiro!$F$6:$R$77,A14,Fevereiro!$R$6:$R$77)","v":511.20000000000005},{"$f":"SUMIF(Março!$F$6:$R$80,A14,Março!$O$6:$O$80)","v":48},{"$f":"SUMIF(Março!$F$6:$R$80,A14,Março!$R$6:$R$80)","v":511.20000000000005},{"$f":"SUMIF(Abril!$F$6:$R$80,A14,Abril!$O$6:$O$80)","v":48},{"$f":"SUMIF(Abril!$F$6:$R$80,A14,Abril!$R$6:$R$80)","v":511.20000000000005},{"$f":"SUMIF(Maio!$F$6:$R$80,A14,Maio!$O$6:$O$80)","v":48},{"$f":"SUMIF(Maio!$F$6:$R$80,A14,Maio!$R$6:$R$80)","v":511.20000000000005},{"$f":"SUMIF(Junho!$F$6:$R$80,A14,Junho!$O$6:$O$80)","v":48},{"$f":"SUMIF(Junho!$F$6:$R$80,A14,Junho!$R$6:$R$80)","v":511.20000000000005},{"$f":"SUMIF(Julho!$F$6:$R$80,A14,Julho!$O$6:$O$80)","v":48},{"$f":"SUMIF(Julho!$F$6:$R$80,A14,Julho!$R$6:$R$80)","v":511.20000000000005},{"$f":"SUMIF([1]Agosto!$F$6:$R$80,A14,[1]Agosto!$O$6:$O$80)","v":{"$error":"#VALUE!"}},{"$f":"SUMIF([1]Agosto!$F$6:$R$80,A14,[1]Agosto!$R$6:$R$80)","v":{"$error":"#VALUE!"}},{"$f":"SUMIF([2]Setembro!$F$6:$R$80,A14,[2]Setembro!$O$6:$O$80)","v":{"$error":"#VALUE!"}},{"$f":"SUMIF([3]SET!$F$6:$R$80,A14,[3]SET!$R$6:$R$80)","v":{"$error":"#VALUE!"}},{"$f":"SUMIF([4]Outubro!$F$6:$R$80,A14,[4]Outubro!$O$6:$O$80)","v":{"$error":"#VALUE!"}},{"$f":"SUMIF([4]Outubro!$F$6:$R$80,A14,[4]Outubro!$R$6:$R$80)","v":{"$error":"#VALUE!"}},{"$f":"SUMIF([5]Novembro!$F$6:$R$80,A14,[5]Novembro!$O$6:$O$80)","v":{"$error":"#VALUE!"}},{"$f":"SUMIF([5]Novembro!$F$6:$R$80,A14,[5]Novembro!$R$6:$R$80)","v":{"$error":"#VALUE!"}},{"$f":"SUMIF([6]Dezembro!$F$6:$R$80,D14,[6]Dezembro!$O$6:$O$80)","v":{"$error":"#VALUE!"}},{"$f":"SUMIF([6]Dezembro!$F$6:$R$80,D14,[6]Dezembro!$R$6:$R$80)","v":{"$error":"#VALUE!"}},336,3578.3999999999996]
[23196,null,{"$f":"SUMIF(Janeiro!$F$6:$R$77,A15,Janeiro!$O$6:$O$77)","v":40},{"$f":"SUMIF(Janeiro!$F$6:$R$77,A15,Janeiro!$R$6:$R$77)","v":1134},{"$f":"SUMIF(Fevereiro!$F$6:$R$77,A15,Fevereiro!$O$6:$O$77)","v":36},{"$f":"SUMIF(Fevereiro!$F$6:$R$77,A15,Fevereiro!$R$6:$R$77)","v":1020.6},{"$f":"SUMIF(Março!$F$6:$R$80,A15,Março!$O$6:$O$80)","v":42},{"$f":"SUMIF(Março!$F$6:$R$80,A15,Março!$R$6:$R$80)","v":1190.7},{"$f":"SUMIF(Abril!$F$6:$R$80,A15,Abril!$O$6:$O$80)","v":40},{"$f":"SUMIF(Abril!$F$6:$R$80,A15,Abril!$R$6:$R$80)","v":1134},{"$f":"SUMIF(Maio!$F$6:$R$80,A15,Maio!$O$6:$O$80)","v":40},{"$f":"SUMIF(Maio!$F$6:$R$80,A15,Maio!$R$6:$R$80)","v":1134},{"$f":"SUMIF(Junho!$F$6:$R$80,A15,Junho!$O$6:$O$80)","v":42},{"$f":"SUMIF(Junho!$F$6:$R$80,A15,Junho!$R$6:$R$80)","v":1190.7},{"$f":"SUMIF(Julho!$F$6:$R$80,A15,Julho!$O$6:$O$80)","v":42},{"$f":"SUMIF(Julho!$F$6:$R$80,A15,Julho!$R$6:$R$80)","v":1190.7},{"$f":"SUMIF([1]Agosto!$F$6:$R$80,A15,[1]Agosto!$O$6:$O$80)","v":{"$error":"#VALUE!"}},{"$f":"SUMIF([1]Agosto!$F$6:$R$80,A15,[1]Agosto!$R$6:$R$80)","v":{"$error":"#VALUE!"}},{"$f":"SUMIF([2]Setembro!$F$6:$R$80,A15,[2]Setembro!$O$6:$O$80)","v":{"$error":"#VALUE!"}},{"$f":"SUMIF([3]SET!$F$6:$R$80,A15,[3]SET!$R$6:$R$80)","v":{"$error":"#VALUE!"}},{"$f":"SUMIF([4]Outubro!$F$6:$R$80,A15,[4]Outubro!$O$6:$O$80)","v":{"$error":"#VALUE!"}},{"$f":"SUMIF([4]Outubro!$F$6:$R$80,A15,[4]Outubro!$R$6:$R$80)","v":{"$error":"#VALUE!"}},{"$f":"SUMIF([5]Novembro!$F$6:$R$80,A15,[5]Novembro!$O$6:$O$80)","v":{"$error":"#VALUE!"}},{"$f":"SUMIF([5]Novembro!$F$6:$R$80,A15,[5]Novembro!$R$6:$R$80)","v":{"$error":"#VALUE!"}},{"$f":"SUMIF([6]Dezembro!$F$6:$R$80,D15,[6]Dezembro!$O$6:$O$80)","v":{"$error":"#VALUE!"}},{"$f":"SUMIF([6]Dezembro!$F$6:$R$80,D15,[6]Dezembro!$R$6:$R$80)","v":{"$error":"#VALUE!"}},282,7994.7]
[23183,null,{"$f":"SUMIF(Janeiro!$F$6:$R$77,A16,Janeiro!$O$6:$O$77)","v":40},{"$f":"SUMIF(Janeiro!$F$6:$R$77,A16,Janeiro!$R$6:$R$77)","v":124},{"$f":"SUMIF(Fevereiro!$F$6:$R$77,A16,Fevereiro!$O$6:$O$77)","v":36},{"$f":"SUMIF(Fevereiro!$F$6:$R$77,A16,Fevereiro!$R$6:$R$77)","v":111.60000000000001},{"$f":"SUMIF(Março!$F$6:$R$80,A16,Março!$O$6:$O$80)","v":42},{"$f":"SUMIF(Março!$F$6:$R$80,A16,Março!$R$6:$R$80)","v":130.20000000000002},{"$f":"SUMIF(Abril!$F$6:$R$80,A16,Abril!$O$6:$O$80)","v":40},{"$f":"SUMIF(Abril!$F$6:$R$80,A16,Abril!$R$6:$R$80)","v":124},{"$f":"SUMIF(Maio!$F$6:$R$80,A16,Maio!$O$6:$O$80)","v":40},{"$f":"SUMIF(Maio!$F$6:$R$80,A16,Maio!$R$6:$R$80)","v":124},{"$f":"SUMIF(Junho!$F$6:$R$80,A16,Junho!$O$6:$O$80)","v":42},{"$f":"SUMIF(Junho!$F$6:$R$80,A16,Junho!$R$6:$R$80)","v":130.20000000000002},{"$f":"SUMIF(Julho!$F$6:$R$80,A16,Julho!$O$6:$O$80)","v":42},{"$f":"SUMIF(Julho!$F$6:$R$80,A16,Julho!$R$6:$R$80)","v":130.20000000000002},{"$f":"SUMIF([1]Agosto!$F$6:$R$80,A16,[1]Agosto!$O$6:$O$80)","v":{"$error":"#VALUE!"}},{"$f":"SUMIF([1]Agosto!$F$6:$R$80,A16,[1]Agosto!$R$6:$R$80)","v":{"$error":"#VALUE!"}},{"$f":"SUMIF([2]Setembro!$F$6:$R$80,A16,[2]Setembro!$O$6:$O$80)","v":{"$error":"#VALUE!"}},{"$f":"SUMIF([3]SET!$F$6:$R$80,A16,[3]SET!$R$6:$R$80)","v":{"$error":"#VALUE!"}},{"$f":"SUMIF([4]Outubro!$F$6:$R$80,A16,[4]Outubro!$O$6:$O$80)","v":{"$error":"#VALUE!"}},{"$f":"SUMIF([4]Outubro!$F$6:$R$80,A16,[4]Outubro!$R$6:$R$80)","v":{"$error":"#VALUE!"}},{"$f":"SUMIF([5]Novembro!$F$6:$R$80,A16,[5]Novembro!$O$6:$O$80)","v":{"$error":"#VALUE!"}},{"$f":"SUMIF([5]Novembro!$F$6:$R$80,A16,[5]Novembro!$R$6:$R$80)","v":{"$error":"#VALUE!"}},{"$f":"SUMIF([6]Dezembro!$F$6:$R$80,D16,[6]Dezembro!$O$6:$O$80)","v":{"$error":"#VALUE!"}},{"$f":"SUMIF([6]Dezembro!$F$6:$R$80,D16,[6]Dezembro!$R$6:$R$80)","v":{"$error":"#VALUE!"}},282,874.20000000000016]
["23125-M",null,{"$f":"SUMIF(Janeiro!$F$6:$R$77,A17,Janeiro!$O$6:$O$77)","v":50},{"$f":"SUMIF(Janeiro!$F$6:$R$77,A17,Janeiro!$R$6:$R$77)","v":1151.5},{"$f":"SUMIF(Fevereiro!$F$6:$R$77,A17,Fevereiro!$O$6:$O$77)","v":46},{"$f":"SUMIF(Fevereiro!$F$6:$R$77,A17,Fevereiro!$R$6:$R$77)","v":1059.3800000000001},{"$f":"SUMIF(Março!$F$6:$R$80,A17,Março!$O$6:$O$80)","v":52},{"$f":"SUMIF(Março!$F$6:$R$80,A17,Março!$R$6:$R$80)","v":1197.56},{"$f":"SUMIF(Abril!$F$6:$R$80,A17,Abril!$O$6:$O$80)","v":50},{"$f":"SUMIF(Abril!$F$6:$R$80,A17,Abril!$R$6:$R$80)","v":1151.5},{"$f":"SUMIF(Maio!$F$6:$R$80,A17,Maio!$O$6:$O$80)","v":50},{"$f":"SUMIF(Maio!$F$6:$R$80,A17,Maio!$R$6:$R$80)","v":1151.5},{"$f":"SUMIF(Junho!$F$6:$R$80,A17,Junho!$O$6:$O$80)","v":52},{"$f":"SUMIF(Junho!$F$6:$R$80,A17,Junho!$R$6:$R$80)","v":1197.56},{"$f":"SUMIF(Julho!$F$6:$R$80,A17,Julho!$O$6:$O$80)","v":52},{"$f":"SUMIF(Julho!$F$6:$R$80,A17,Julho!$R$6:$R$80)","v":1197.56},{"$f":"SUMIF([1]Agosto!$F$6:$R$80,A17,[1]Agosto!$O$6:$O$80)","v":{"$error":"#VALUE!"}},{"$f":"SUMIF([1]Agosto!$F$6:$R$80,A17,[1]Agosto!$R$6:$R$80)","v":{"$error":"#VALUE!"}},{"$f":"SUMIF([2]Setembro!$F$6:$R$80,A17,[2]Setembro!$O$6:$O$80)","v":{"$error":"#VALUE!"}},{"$f":"SUMIF([3]SET!$F$6:$R$80,A17,[3]SET!$R$6:$R$80)","v":{"$error":"#VALUE!"}},{"$f":"SUMIF([4]Outubro!$F$6:$R$80,A17,[4]Outubro!$O$6:$O$80)","v":{"$error":"#VALUE!"}},{"$f":"SUMIF([4]Outubro!$F$6:$R$80,A17,[4]Outubro!$R$6:$R$80)","v":{"$error":"#VALUE!"}},{"$f":"SUMIF([5]Novembro!$F$6:$R$80,A17,[5]Novembro!$O$6:$O$80)","v":{"$error":"#VALUE!"}},{"$f":"SUMIF([5]Novembro!$F$6:$R$80,A17,[5]Novembro!$R$6:$R$80)","v":{"$error":"#VALUE!"}},{"$f":"SUMIF([6]Dezembro!$F$6:$R$80,D17,[6]Dezembro!$O$6:$O$80)","v":{"$error":"#VALUE!"}},{"$f":"SUMIF([6]Dezembro!$F$6:$R$80,D17,[6]Dezembro!$R$6:$R$80)","v":{"$error":"#VALUE!"}},352,8106.5599999999995]
["23190-V",null,{"$f":"SUMIF(Janeiro!$F$6:$R$77,A18,Janeiro!$O$6:$O$77)","v":120},{"$f":"SUMIF(Janeiro!$F$6:$R$77,A18,Janeiro!$R$6:$R$77)","v":396},{"$f":"SUMIF(Fevereiro!$F$6:$R$77,A18,Fevereiro!$O$6:$O$77)","v":108},{"$f":"SUMIF(Fevereiro!$F$6:$R$77,A18,Fevereiro!$R$6:$R$77)","v":356.4},{"$f":"SUMIF(Março!$F$6:$R$80,A18,Março!$O$6:$O$80)","v":126},{"$f":"SUMIF(Março!$F$6:$R$80,A18,Março!$R$6:$R$80)","v":415.79999999999995},{"$f":"SUMIF(Abril!$F$6:$R$80,A18,Abril!$O$6:$O$80)","v":120},{"$f":"SUMIF(Abril!$F$6:$R$80,A18,Abril!$R$6:$R$80)","v":396},{"$f":"SUMIF(Maio!$F$6:$R$80,A18,Maio!$O$6:$O$80)","v":120},{"$f":"SUMIF(Maio!$F$6:$R$80,A18,Maio!$R$6:$R$80)","v":396},{"$f":"SUMIF(Junho!$F$6:$R$80,A18,Junho!$O$6:$O$80)","v":126},{"$f":"SUMIF(Junho!$F$6:$R$80,A18,Junho!$R$6:$R$80)","v":415.79999999999995},{"$f":"SUMIF(Julho!$F$6:$R$80,A18,Julho!$O$6:$O$80)","v":126},{"$f":"SUMIF(Julho!$F$6:$R$80,A18,Julho!$R$6:$R$80)","v":415.79999999999995},{"$f":"SUMIF([1]Agosto!$F$6:$R$80,A18,[1]Agosto!$O$6:$O$80)","v":{"$error":"#VALUE!"}},{"$f":"SUMIF([1]Agosto!$F$6:$R$80,A18,[1]Agosto!$R$6:$R$80)","v":{"$error":"#VALUE!"}},{"$f":"SUMIF([2]Setembro!$F$6:$R$80,A18,[2]Setembro!$O$6:$O$80)","v":{"$error":"#VALUE!"}},{"$f":"SUMIF([3]SET!$F$6:$R$80,A18,[3]SET!$R$6:$R$80)","v":{"$error":"#VALUE!"}},{"$f":"SUMIF([4]Outubro!$F$6:$R$80,A18,[4]Outubro!$O$6:$O$80)","v":{"$error":"#VALUE!"}},{"$f":"SUMIF([4]Outubro!$F$6:$R$80,A18,[4]Outubro!$R$6:$R$80)","v":{"$error":"#VALUE!"}},{"$f":"SUMIF([5]Novembro!$F$6:$R$80,A18,[5]Novembro!$O$6:$O$80)","v":{"$error":"#VALUE!"}},{"$f":"SUMIF([5]Novembro!$F$6:$R$80,A18,[5]Novembro!$R$6:$R$80)","v":{"$error":"#VALUE!"}},{"$f":"SUMIF([6]Dezembro!$F$6:$R$80,D18,[6]Dezembro!$O$6:$O$80)","v":{"$error":"#VALUE!"}},{"$f":"SUMIF([6]Dezembro!$F$6:$R$80,D18,[6]Dezembro!$R$6:$R$80)","v":{"$error":"#VALUE!"}},846,2791.8]
["xxxxx-Y (Pool)",null,{"$f":"SUMIF(Janeiro!$F$6:$R$77,A19,Janeiro!$O$6:$O$77)","v":10},{"$f":"SUMIF(Janeiro!$F$6:$R$77,A19,Janeiro!$R$6:$R$77)","v":650},{"$f":"SUMIF(Fevereiro!$F$6:$R$77,A19,Fevereiro!$O$6:$O$77)","v":10},{"$f":"SUMIF(Fevereiro!$F$6:$R$77,A19,Fevereiro!$R$6:$R$77)","v":650},{"$f":"SUMIF(Março!$F$6:$R$80,A19,Março!$O$6:$O$80)","v":10},{"$f":"SUMIF(Março!$F$6:$R$80,A19,Março!$R$6:$R$80)","v":650},{"$f":"SUMIF(Abril!$F$6:$R$80,A19,Abril!$O$6:$O$80)","v":10},{"$f":"SUMIF(Abril!$F$6:$R$80,A19,Abril!$R$6:$R$80)","v":650},{"$f":"SUMIF(Maio!$F$6:$R$80,A19,Maio!$O$6:$O$80)","v":10},{"$f":"SUMIF(Maio!$F$6:$R$80,A19,Maio!$R$6:$R$80)","v":650},{"$f":"SUMIF(Junho!$F$6:$R$80,A19,Junho!$O$6:$O$80)","v":10},{"$f":"SUMIF(Junho!$F$6:$R$80,A19,Junho!$R$6:$R$80)","v":650},{"$f":"SUMIF(Julho!$F$6:$R$80,A19,Julho!$O$6:$O$80)","v":10},{"$f":"SUMIF(Julho!$F$6:$R$80,A19,Julho!$R$6:$R$80)","v":650},{"$f":"SUMIF([1]Agosto!$F$6:$R$80,A19,[1]Agosto!$O$6:$O$80)","v":{"$error":"#VALUE!"}},{"$f":"SUMIF([1]Agosto!$F$6:$R$80,A19,[1]Agosto!$R$6:$R$80)","v":{"$error":"#VALUE!"}},{"$f":"SUMIF([2]Setembro!$F$6:$R$80,A19,[2]Setembro!$O$6:$O$80)","v":{"$error":"#VALUE!"}},{"$f":"SUMIF([3]SET!$F$6:$R$80,A19,[3]SET!$R$6:$R$80)","v":{"$error":"#VALUE!"}},{"$f":"SUMIF([4]Outubro!$F$6:$R$80,A19,[4]Outubro!$O$6:$O$80)","v":{"$error":"#VALUE!"}},{"$f":"SUMIF([4]Outubro!$F$6:$R$80,A19,[4]Outubro!$R$6:$R$80)","v":{"$error":"#VALUE!"}},{"$f":"SUMIF([5]Novembro!$F$6:$R$80,A19,[5]Novembro!$O$6:$O$80)","v":{"$error":"#VALUE!"}},{"$f":"SUMIF([5]Novembro!$F$6:$R$80,A19,[5]Novembro!$R$6:$R$80)","v":{"$error":"#VALUE!"}},{"$f":"SUMIF([6]Dezembro!$F$6:$R$80,D19,[6]Dezembro!$O$6:$O$80)","v":{"$error":"#VALUE!"}},{"$f":"SUMIF([6]Dezembro!$F$6:$R$80,D19,[6]Dezembro!$R$6:$R$80)","v":{"$error":"#VALUE!"}},70,4550]
["xxxxx-Y (Pool 1)",null,{"$f":"SUMIF(Janeiro!$F$6:$R$77,A20,Janeiro!$O$6:$O$77)","v":0},{"$f":"SUMIF(Janeiro!$F$6:$R$77,A20,Janeiro!$R$6:$R$77)","v":0},{"$f":"SUMIF(Fevereiro!$F$6:$R$77,A20,Fevereiro!$O$6:$O$77)","v":0},{"$f":"SUMIF(Fevereiro!$F$6:$R$77,A20,Fevereiro!$R$6:$R$77)","v":0},{"$f":"SUMIF(Março!$F$6:$R$80,A20,Março!$O$6:$O$80)","v":0},{"$f":"SUMIF(Março!$F$6:$R$80,A20,Março!$R$6:$R$80)","v":0},{"$f":"SUMIF(Abril!$F$6:$R$80,A20,Abril!$O$6:$O$80)","v":0},{"$f":"SUMIF(Abril!$F$6:$R$80,A20,Abril!$R$6:$R$80)","v":0},{"$f":"SUMIF(Maio!$F$6:$R$80,A20,Maio!$O$6:$O$80)","v":0},{"$f":"SUMIF(Maio!$F$6:$R$80,A20,Maio!$R$6:$R$80)","v":0},{"$f":"SUMIF(Junho!$F$6:$R$80,A20,Junho!$O$6:$O$80)","v":0},{"$f":"SUMIF(Junho!$F$6:$R$80,A20,Junho!$R$6:$R$80)","v":0},{"$f":"SUMIF(Julho!$F$6:$R$80,A20,Julho!$O$6:$O$80)","v":0},{"$f":"SUMIF(Julho!$F$6:$R$80,A20,Julho!$R$6:$R$80)","v":0},{"$f":"SUMIF([1]Agosto!$F$6:$R$80,A20,[1]Agosto!$O$6:$O$80)","v":{"$error":"#VALUE!"}},{"$f":"SUMIF([1]Agosto!$F$6:$R$80,A20,[1]Agosto!$R$6:$R$80)","v":{"$error":"#VALUE!"}},{"$f":"SUMIF([2]Setembro!$F$6:$R$80,A20,[2]Setembro!$O$6:$O$80)","v":{"$error":"#VALUE!"}},{"$f":"SUMIF([3]SET!$F$6:$R$80,A20,[3]SET!$R$6:$R$80)","v":{"$error":"#VALUE!"}},{"$f":"SUMIF([4]Outubro!$F$6:$R$80,A20,[4]Outubro!$O$6:$O$80)","v":{"$error":"#VALUE!"}},{"$f":"SUMIF([4]Outubro!$F$6:$R$80,A20,[4]Outubro!$R$6:$R$80)","v":{"$error":"#VALUE!"}},{"$f":"SUMIF([5]Novembro!$F$6:$R$80,A20,[5]Novembro!$O$6:$O$80)","v":{"$error":"#VALUE!"}},{"$f":"SUMIF([5]Novembro!$F$6:$R$80,A20,[5]Novembro!$R$6:$R$80)","v":{"$error":"#VALUE!"}},{"$f":"SUMIF([6]Dezembro!$F$6:$R$80,D20,[6]Dezembro!$O$6:$O$80)","v":{"$error":"#VALUE!"}},{"$f":"SUMIF([6]Dezembro!$F$6:$R$80,D20,[6]Dezembro!$R$6:$R$80)","v":{"$error":"#VALUE!"}},0,0]
[23182,null,{"$f":"SUMIF(Janeiro!$F$6:$R$77,A21,Janeiro!$O$6:$O$77)","v":25},{"$f":"SUMIF(Janeiro!$F$6:$R$77,A21,Janeiro!$R$6:$R$77)","v":251.5},{"$f":"SUMIF(Fevereiro!$F$6:$R$77,A21,Fevereiro!$O$6:$O$77)","v":25},{"$f":"SUMIF(Fevereiro!$F$6:$R$77,A21,Fevereiro!$R$6:$R$77)","v":251.5},{"$f":"SUMIF(Março!$F$6:$R$80,A21,Março!$O$6:$O$80)","v":25},{"$f":"SUMIF(Março!$F$6:$R$80,A21,Março!$R$6:$R$80)","v":251.5},{"$f":"SUMIF(Abril!$F$6:$R$80,A21,Abril!$O$6:$O$80)","v":25},{"$f":"SUMIF(Abril!$F$6:$R$80,A21,Abril!$R$6:$R$80)","v":251.5},{"$f":"SUMIF(Maio!$F$6:$R$80,A21,Maio!$O$6:$O$80)","v":25},{"$f":"SUMIF(Maio!$F$6:$R$80,A21,Maio!$R$6:$R$80)","v":251.5},{"$f":"SUMIF(Junho!$F$6:$R$80,A21,Junho!$O$6:$O$80)","v":25},{"$f":"SUMIF(Junho!$F$6:$R$80,A21,Junho!$R$6:$R$80)","v":251.5},{"$f":"SUMIF(Julho!$F$6:$R$80,A21,Julho!$O$6:$O$80)","v":25},{"$f":"SUMIF(Julho!$F$6:$R$80,A21,Julho!$R$6:$R$80)","v":251.5},{"$f":"SUMIF([1]Agosto!$F$6:$R$80,A21,[1]Agosto!$O$6:$O$80)","v":{"$error":"#VALUE!"}},{"$f":"SUMIF([1]Agosto!$F$6:$R$80,A21,[1]Agosto!$R$6:$R$80)","v":{"$error":"#VALUE!"}},{"$f":"SUMIF([2]Setembro!$F$6:$R$80,A21,[2]Setembro!$O$6:$O$80)","v":{"$error":"#VALUE!"}},{"$f":"SUMIF([3]SET!$F$6:$R$80,A21,[3]SET!$R$6:$R$80)","v":{"$error":"#VALUE!"}},{"$f":"SUMIF([4]Outubro!$F$6:$R$80,A21,[4]Outubro!$O$6:$O$80)","v":{"$error":"#VALUE!"}},{"$f":"SUMIF([4]Outubro!$F$6:$R$80,A21,[4]Outubro!$R$6:$R$80)","v":{"$error":"#VALUE!"}},{"$f":"SUMIF([5]Novembro!$F$6:$R$80,A21,[5]Novembro!$O$6:$O$80)","v":{"$error":"#VALUE!"}},{"$f":"SUMIF([5]Novembro!$F$6:$R$80,A21,[5]Novembro!$R$6:$R$80)","v":{"$error":"#VALUE!"}},{"$f":"SUMIF([6]Dezembro!$F$6:$R$80,D21,[6]Dezembro!$O$6:$O$80)","v":{"$error":"#VALUE!"}},{"$f":"SUMIF([6]Dezembro!$F$6:$R$80,D21,[6]Dezembro!$R$6:$R$80)","v":{"$error":"#VALUE!"}},175,1760.5]
["23101-A (09096)",null,{"$f":"SUMIF(Janeiro!$F$6:$R$77,A22,Janeiro!$O$6:$O$77)","v":376},{"$f":"SUMIF(Janeiro!$F$6:$R$77,A22,Janeiro!$R$6:$R$77)","v":1240.8},{"$f":"SUMIF(Fevereiro!$F$6:$R$77,A22,Fevereiro!$O$6:$O$77)","v":340},{"$f":"SUMIF(Fevereiro!$F$6:$R$77,A22,Fevereiro!$R$6:$R$77)","v":1122},{"$f":"SUMIF(Março!$F$6:$R$80,A22,Março!$O$6:$O$80)","v":394},{"$f":"SUMIF(Março!$F$6:$R$80,A22,Março!$R$6:$R$80)","v":1300.2},{"$f":"SUMIF(Abril!$F$6:$R$80,A22,Abril!$O$6:$O$80)","v":376},{"$f":"SUMIF(Abril!$F$6:$R$80,A22,Abril!$R$6:$R$80)","v":1240.8},{"$f":"SUMIF(Maio!$F$6:$R$80,A22,Maio!$O$6:$O$80)","v":376},{"$f":"SUMIF(Maio!$F$6:$R$80,A22,Maio!$R$6:$R$80)","v":1240.8},{"$f":"SUMIF(Junho!$F$6:$R$80,A22,Junho!$O$6:$O$80)","v":394},{"$f":"SUMIF(Junho!$F$6:$R$80,A22,Junho!$R$6:$R$80)","v":1300.2},{"$f":"SUMIF(Julho!$F$6:$R$80,A22,Julho!$O$6:$O$80)","v":394},{"$f":"SUMIF(Julho!$F$6:$R$80,A22,Julho!$R$6:$R$80)","v":1300.2},{"$f":"SUMIF([1]Agosto!$F$6:$R$80,A22,[1]Agosto!$O$6:$O$80)","v":{"$error":"#VALUE!"}},{"$f":"SUMIF([1]Agosto!$F$6:$R$80,A22,[1]Agosto!$R$6:$R$80)","v":{"$error":"#VALUE!"}},{"$f":"SUMIF([2]Setembro!$F$6:$R$80,A22,[2]Setembro!$O$6:$O$80)","v":{"$error":"#VALUE!"}},{"$f":"SUMIF([3]SET!$F$6:$R$80,A22,[3]SET!$R$6:$R$80)","v":{"$error":"#VALUE!"}},{"$f":"SUMIF([4]Outubro!$F$6:$R$80,A22,[4]Outubro!$O$6:$O$80)","v":{"$error":"#VALUE!"}},{"$f":"SUMIF([4]Outubro!$F$6:$R$80,A22,[4]Outubro!$R$6:$R$80)","v":{"$error":"#VALUE!"}},{"$f":"SUMIF([5]Novembro!$F$6:$R$80,A22,[5]Novembro!$O$6:$O$80)","v":{"$error":"#VALUE!"}},{"$f":"SUMIF([5]Novembro!$F$6:$R$80,A22,[5]Novembro!$R$6:$R$80)","v":{"$error":"#VALUE!"}},{"$f":"SUMIF([6]Dezembro!$F$6:$R$80,D22,[6]Dezembro!$O$6:$O$80)","v":{"$error":"#VALUE!"}},{"$f":"SUMIF([6]Dezembro!$F$6:$R$80,D22,[6]Dezembro!$R$6:$R$80)","v":{"$error":"#VALUE!"}},2650,8745]
["23101-A (19356)",null,{"$f":"SUMIF(Janeiro!$F$6:$R$77,A23,Janeiro!$O$6:$O$77)","v":0},{"$f":"SUMIF(Janeiro!$F$6:$R$77,A23,Janeiro!$R$6:$R$77)","v":0},{"$f":"SUMIF(Fevereiro!$F$6:$R$77,A23,Fevereiro!$O$6:$O$77)","v":0},{"$f":"SUMIF(Fevereiro!$F$6:$R$77,A23,Fevereiro!$R$6:$R$77)","v":0},{"$f":"SUMIF(Março!$F$6:$R$80,A23,Março!$O$6:$O$80)","v":0},{"$f":"SUMIF(Março!$F$6:$R$80,A23,Março!$R$6:$R$80)","v":0},{"$f":"SUMIF(Abril!$F$6:$R$80,A23,Abril!$O$6:$O$80)","v":0},{"$f":"SUMIF(Abril!$F$6:$R$80,A23,Abril!$R$6:$R$80)","v":0},{"$f":"SUMIF(Maio!$F$6:$R$80,A23,Maio!$O$6:$O$80)","v":0},{"$f":"SUMIF(Maio!$F$6:$R$80,A23,Maio!$R$6:$R$80)","v":0},{"$f":"SUMIF(Junho!$F$6:$R$80,A23,Junho!$O$6:$O$80)","v":0},{"$f":"SUMIF(Junho!$F$6:$R$80,A23,Junho!$R$6:$R$80)","v":0},{"$f":"SUMIF(Julho!$F$6:$R$80,A23,Julho!$O$6:$O$80)","v":0},{"$f":"SUMIF(Julho!$F$6:$R$80,A23,Julho!$R$6:$R$80)","v":0},{"$f":"SUMIF([1]Agosto!$F$6:$R$80,A23,[1]Agosto!$O$6:$O$80)","v":{"$error":"#VALUE!"}},{"$f":"SUMIF([1]Agosto!$F$6:$R$80,A23,[1]Agosto!$R$6:$R$80)","v":{"$error":"#VALUE!"}},{"$f":"SUMIF([2]Setembro!$F$6:$R$80,A23,[2]Setembro!$O$6:$O$80)","v":{"$error":"#VALUE!"}},{"$f":"SUMIF([3]SET!$F$6:$R$80,A23,[3]SET!$R$6:$R$80)","v":{"$error":"#VALUE!"}},{"$f":"SUMIF([4]Outubro!$F$6:$R$80,A23,[4]Outubro!$O$6:$O$80)","v":{"$error":"#VALUE!"}},{"$f":"SUMIF([4]Outubro!$F$6:$R$80,A23,[4]Outubro!$R$6:$R$80)","v":{"$error":"#VALUE!"}},{"$f":"SUMIF([5]Novembro!$F$6:$R$80,A23,[5]Novembro!$O$6:$O$80)","v":{"$error":"#VALUE!"}},{"$f":"SUMIF([5]Novembro!$F$6:$R$80,A23,[5]Novembro!$R$6:$R$80)","v":{"$error":"#VALUE!"}},{"$f":"SUMIF([6]Dezembro!$F$6:$R$80,D23,[6]Dezembro!$O$6:$O$80)","v":{"$error":"#VALUE!"}},{"$f":"SUMIF([6]Dezembro!$F$6:$R$80,D23,[6]Dezembro!$R$6:$R$80)","v":{"$error":"#VALUE!"}},0,0]
["23140-T",null,{"$f":"SUMIF(Janeiro!$F$6:$R$77,A24,Janeiro!$O$6:$O$77)","v":0},{"$f":"SUMIF(Janeiro!$F$6:$R$77,A24,Janeiro!$R$6:$R$77)","v":0},{"$f":"SUMIF(Fevereiro!$F$6:$R$77,A24,Fevereiro!$O$6:$O$77)","v":0},{"$f":"SUMIF(Fevereiro!$F$6:$R$77,A24,Fevereiro!$R$6:$R$77)","v":0},{"$f":"SUMIF(Março!$F$6:$R$80,A24,Março!$O$6:$O$80)","v":0},{"$f":"SUMIF(Março!$F$6:$R$80,A24,Março!$R$6:$R$80)","v":0},{"$f":"SUMIF(Abril!$F$6:$R$80,A24,Abril!$O$6:$O$80)","v":0},{"$f":"SUMIF(Abril!$F$6:$R$80,A24,Abril!$R$6:$R$80)","v":0},{"$f":"SUMIF(Maio!$F$6:$R$80,A24,Maio!$O$6:$O$80)","v":0},{"$f":"SUMIF(Maio!$F$6:$R$80,A24,Maio!$R$6:$R$80)","v":0},{"$f":"SUMIF(Junho!$F$6:$R$80,A24,Junho!$O$6:$O$80)","v":0},{"$f":"SUMIF(Junho!$F$6:$R$80,A24,Junho!$R$6:$R$80)","v":0},{"$f":"SUMIF(Julho!$F$6:$R$80,A24,Julho!$O$6:$O$80)","v":0},{"$f":"SUMIF(Julho!$F$6:$R$80,A24,Julho!$R$6:$R$80)","v":0},{"$f":"SUMIF([1]Agosto!$F$6:$R$80,A24,[1]Agosto!$O$6:$O$80)","v":{"$error":"#VALUE!"}},{"$f":"SUMIF([1]Agosto!$F$6:$R$80,A24,[1]Agosto!$R$6:$R$80)","v":{"$error":"#VALUE!"}},{"$f":"SUMIF([2]Setembro!$F$6:$R$80,A24,[2]Setembro!$O$6:$O$80)","v":{"$error":"#VALUE!"}},{"$f":"SUMIF([3]SET!$F$6:$R$80,A24,[3]SET!$R$6:$R$80)","v":{"$error":"#VALUE!"}},{"$f":"SUMIF([4]Outubro!$F$6:$R$80,A24,[4]Outubro!$O$6:$O$80)","v":{"$error":"#VALUE!"}},{"$f":"SUMIF([4]Outubro!$F$6:$R$80,A24,[4]Outubro!$R$6:$R$80)","v":{"$error":"#VALUE!"}},{"$f":"SUMIF([5]Novembro!$F$6:$R$80,A24,[5]Novembro!$O$6:$O$80)","v":{"$error":"#VALUE!"}},{"$f":"SUMIF([5]Novembro!$F$6:$R$80,A24,[5]Novembro!$R$6:$R$80)","v":{"$error":"#VALUE!"}},{"$f":"SUMIF([6]Dezembro!$F$6:$R$80,D24,[6]Dezembro!$O$6:$O$80)","v":{"$error":"#VALUE!"}},{"$f":"SUMIF([6]Dezembro!$F$6:$R$80,D24,[6]Dezembro!$R$6:$R$80)","v":{"$error":"#VALUE!"}},0,0]
[23181,null,{"$f":"SUMIF(Janeiro!$F$6:$R$77,A25,Janeiro!$O$6:$O$77)","v":0},{"$f":"SUMIF(Janeiro!$F$6:$R$77,A25,Janeiro!$R$6:$R$77)","v":0},{"$f":"SUMIF(Fevereiro!$F$6:$R$77,A25,Fevereiro!$O$6:$O$77)","v":0},{"$f":"SUMIF(Fevereiro!$F$6:$R$77,A25,Fevereiro!$R$6:$R$77)","v":0},{"$f":"SUMIF(Março!$F$6:$R$80,A25,Março!$O$6:$O$80)","v":0},{"$f":"SUMIF(Março!$F$6:$R$80,A25,Março!$R$6:$R$80)","v":0},{"$f":"SUMIF(Abril!$F$6:$R$80,A25,Abril!$O$6:$O$80)","v":0},{"$f":"SUMIF(Abril!$F$6:$R$80,A25,Abril!$R$6:$R$80)","v":0},{"$f":"SUMIF(Maio!$F$6:$R$80,A25,Maio!$O$6:$O$80)","v":0},{"$f":"SUMIF(Maio!$F$6:$R$80,A25,Maio!$R$6:$R$80)","v":0},{"$f":"SUMIF(Junho!$F$6:$R$80,A25,Junho!$O$6:$O$80)","v":0},{"$f":"SUMIF(Junho!$F$6:$R$80,A25,Junho!$R$6:$R$80)","v":0},{"$f":"SUMIF(Julho!$F$6:$R$80,A25,Julho!$O$6:$O$80)","v":0},{"$f":"SUMIF(Julho!$F$6:$R$80,A25,Julho!$R$6:$R$80)","v":0},{"$f":"SUMIF([1]Agosto!$F$6:$R$80,A25,[1]Agosto!$O$6:$O$80)","v":{"$error":"#VALUE!"}},{"$f":"SUMIF([1]Agosto!$F$6:$R$80,A25,[1]Agosto!$R$6:$R$80)","v":{"$error":"#VALUE!"}},{"$f":"SUMIF([2]Setembro!$F$6:$R$80,A25,[2]Setembro!$O$6:$O$80)","v":{"$error":"#VALUE!"}},{"$f":"SUMIF([3]SET!$F$6:$R$80,A25,[3]SET!$R$6:$R$80)","v":{"$error":"#VALUE!"}},{"$f":"SUMIF([4]Outubro!$F$6:$R$80,A25,[4]Outubro!$O$6:$O$80)","v":{"$error":"#VALUE!"}},{"$f":"SUMIF([4]Outubro!$F$6:$R$80,A25,[4]Outubro!$R$6:$R$80)","v":{"$error":"#VALUE!"}},{"$f":"SUMIF([5]Novembro!$F$6:$R$80,A25,[5]Novembro!$O$6:$O$80)","v":{"$error":"#VALUE!"}},{"$f":"SUMIF([5]Novembro!$F$6:$R$80,A25,[5]Novembro!$R$6:$R$80)","v":{"$error":"#VALUE!"}},{"$f":"SUMIF([6]Dezembro!$F$6:$R$80,D25,[6]Dezembro!$O$6:$O$80)","v":{"$error":"#VALUE!"}},{"$f":"SUMIF([6]Dezembro!$F$6:$R$80,D25,[6]Dezembro!$R$6:$R$80)","v":{"$error":"#VALUE!"}},0,0]
["23170-I",null,{"$f":"SUMIF(Janeiro!$F$6:$R$77,A26,Janeiro!$O$6:$O$77)","v":52},{"$f":"SUMIF(Janeiro!$F$6:$R$77,A26,Janeiro!$R$6:$R$77)","v":161.20000000000002},{"$f":"SUMIF(Fevereiro!$F$6:$R$77,A26,Fevereiro!$O$6:$O$77)","v":48},{"$f":"SUMIF(Fevereiro!$F$6:$R$77,A26,Fevereiro!$R$6:$R$77)","v":148.80000000000001},{"$f":"SUMIF(Março!$F$6:$R$80,A26,Março!$O$6:$O$80)","v":54},{"$f":"SUMIF(Março!$F$6:$R$80,A26,Março!$R$6:$R$80)","v":167.4},{"$f":"SUMIF(Abril!$F$6:$R$80,A26,Abril!$O$6:$O$80)","v":140},{"$f":"SUMIF(Abril!$F$6:$R$80,A26,Abril!$R$6:$R$80)","v":434.00000000000006},{"$f":"SUMIF(Maio!$F$6:$R$80,A26,Maio!$O$6:$O$80)","v":52},{"$f":"SUMIF(Maio!$F$6:$R$80,A26,Maio!$R$6:$R$80)","v":161.20000000000002},{"$f":"SUMIF(Junho!$F$6:$R$80,A26,Junho!$O$6:$O$80)","v":54},{"$f":"SUMIF(Junho!$F$6:$R$80,A26,Junho!$R$6:$R$80)","v":167.4},{"$f":"SUMIF(Julho!$F$6:$R$80,A26,Julho!$O$6:$O$80)","v":54},{"$f":"SUMIF(Julho!$F$6:$R$80,A26,Julho!$R$6:$R$80)","v":167.4},{"$f":"SUMIF([1]Agosto!$F$6:$R$80,A26,[1]Agosto!$O$6:$O$80)","v":{"$error":"#VALUE!"}},{"$f":"SUMIF([1]Agosto!$F$6:$R$80,A26,[1]Agosto!$R$6:$R$80)","v":{"$error":"#VALUE!"}},{"$f":"SUMIF([2]Setembro!$F$6:$R$80,A26,[2]Setembro!$O$6:$O$80)","v":{"$error":"#VALUE!"}},{"$f":"SUMIF([3]SET!$F$6:$R$80,A26,[3]SET!$R$6:$R$80)","v":{"$error":"#VALUE!"}},{"$f":"SUMIF([4]Outubro!$F$6:$R$80,A26,[4]Outubro!$O$6:$O$80)","v":{"$error":"#VALUE!"}},{"$f":"SUMIF([4]Outubro!$F$6:$R$80,A26,[4]Outubro!$R$6:$R$80)","v":{"$error":"#VALUE!"}},{"$f":"SUMIF([5]Novembro!$F$6:$R$80,A26,[5]Novembro!$O$6:$O$80)","v":{"$error":"#VALUE!"}},{"$f":"SUMIF([5]Novembro!$F$6:$R$80,A26,[5]Novembro!$R$6:$R$80)","v":{"$error":"#VALUE!"}},{"$f":"SUMIF([6]Dezembro!$F$6:$R$80,D26,[6]Dezembro!$O$6:$O$80)","v":{"$error":"#VALUE!"}},{"$f":"SUMIF([6]Dezembro!$F$6:$R$80,D26,[6]Dezembro!$R$6:$R$80)","v":{"$error":"#VALUE!"}},454,1407.4000000000003]
[23195,null,{"$f":"SUMIF(Janeiro!$F$6:$R$77,A27,Janeiro!$O$6:$O$77)","v":0},{"$f":"SUMIF(Janeiro!$F$6:$R$77,A27,Janeiro!$R$6:$R$77)","v":0},{"$f":"SUMIF(Fevereiro!$F$6:$R$77,A27,Fevereiro!$O$6:$O$77)","v":0},{"$f":"SUMIF(Fevereiro!$F$6:$R$77,A27,Fevereiro!$R$6:$R$77)","v":0},{"$f":"SUMIF(Março!$F$6:$R$80,A27,Março!$O$6:$O$80)","v":0},{"$f":"SUMIF(Março!$F$6:$R$80,A27,Março!$R$6:$R$80)","v":0},{"$f":"SUMIF(Abril!$F$6:$R$80,A27,Abril!$O$6:$O$80)","v":38},{"$f":"SUMIF(Abril!$F$6:$R$80,A27,Abril!$R$6:$R$80)","v":195.7},{"$f":"SUMIF(Maio!$F$6:$R$80,A27,Maio!$O$6:$O$80)","v":0},{"$f":"SUMIF(Maio!$F$6:$R$80,A27,Maio!$R$6:$R$80)","v":0},{"$f":"SUMIF(Junho!$F$6:$R$80,A27,Junho!$O$6:$O$80)","v":0},{"$f":"SUMIF(Junho!$F$6:$R$80,A27,Junho!$R$6:$R$80)","v":0},{"$f":"SUMIF(Julho!$F$6:$R$80,A27,Julho!$O$6:$O$80)","v":0},{"$f":"SUMIF(Julho!$F$6:$R$80,A27,Julho!$R$6:$R$80)","v":0},{"$f":"SUMIF([1]Agosto!$F$6:$R$80,A27,[1]Agosto!$O$6:$O$80)","v":{"$error":"#VALUE!"}},{"$f":"SUMIF([1]Agosto!$F$6:$R$80,A27,[1]Agosto!$R$6:$R$80)","v":{"$error":"#VALUE!"}},{"$f":"SUMIF([2]Setembro!$F$6:$R$80,A27,[2]Setembro!$O$6:$O$80)","v":{"$error":"#VALUE!"}},{"$f":"SUMIF([3]SET!$F$6:$R$80,A27,[3]SET!$R$6:$R$80)","v":{"$error":"#VALUE!"}},{"$f":"SUMIF([4]Outubro!$F$6:$R$80,A27,[4]Outubro!$O$6:$O$80)","v":{"$error":"#VALUE!"}},{"$f":"SUMIF([4]Outubro!$F$6:$R$80,A27,[4]Outubro!$R$6:$R$80)","v":{"$error":"#VALUE!"}},{"$f":"SUMIF([5]Novembro!$F$6:$R$80,A27,[5]Novembro!$O$6:$O$80)","v":{"$error":"#VALUE!"}},{"$f":"SUMIF([5]Novembro!$F$6:$R$80,A27,[5]Novembro!$R$6:$R$80)","v":{"$error":"#VALUE!"}},{"$f":"SUMIF([6]Dezembro!$F$6:$R$80,D27,[6]Dezembro!$O$6:$O$80)","v":{"$error":"#VALUE!"}},{"$f":"SUMIF([6]Dezembro!$F$6:$R$80,D27,[6]Dezembro!$R$6:$R$80)","v":{"$error":"#VALUE!"}},38,195.7]
["00000-0",null,{"$f":"SUMIF(Janeiro!$F$6:$R$77,A28,Janeiro!$O$6:$O$77)","v":0},{"$f":"SUMIF(Janeiro!$F$6:$R$77,A28,Janeiro!$R$6:$R$77)","v":0},{"$f":"SUMIF(Fevereiro!$F$6:$R$77,A28,Fevereiro!$O$6:$O$77)","v":0},{"$f":"SUMIF(Fevereiro!$F$6:$R$77,A28,Fevereiro!$R$6:$R$77)","v":0},{"$f":"SUMIF(Março!$F$6:$R$80,A28,Março!$O$6:$O$80)","v":0},{"$f":"SUMIF(Março!$F$6:$R$80,A28,Março!$R$6:$R$80)","v":0},{"$f":"SUMIF(Abril!$F$6:$R$80,A28,Abril!$O$6:$O$80)","v":0},{"$f":"SUMIF(Abril!$F$6:$R$80,A28,Abril!$R$6:$R$80)","v":0},{"$f":"SUMIF(Maio!$F$6:$R$80,A28,Maio!$O$6:$O$80)","v":0},{"$f":"SUMIF(Maio!$F$6:$R$80,A28,Maio!$R$6:$R$80)","v":0},{"$f":"SUMIF(Junho!$F$6:$R$80,A28,Junho!$O$6:$O$80)","v":0},{"$f":"SUMIF(Junho!$F$6:$R$80,A28,Junho!$R$6:$R$80)","v":0},{"$f":"SUMIF(Julho!$F$6:$R$80,A28,Julho!$O$6:$O$80)","v":0},{"$f":"SUMIF(Julho!$F$6:$R$80,A28,Julho!$R$6:$R$80)","v":0},{"$f":"SUMIF([1]Agosto!$F$6:$R$80,A28,[1]Agosto!$O$6:$O$80)","v":{"$error":"#VALUE!"}},{"$f":"SUMIF([1]Agosto!$F$6:$R$80,A28,[1]Agosto!$R$6:$R$80)","v":{"$error":"#VALUE!"}},{"$f":"SUMIF([2]Setembro!$F$6:$R$80,A28,[2]Setembro!$O$6:$O$80)","v":{"$error":"#VALUE!"}},{"$f":"SUMIF([3]SET!$F$6:$R$80,A28,[3]SET!$R$6:$R$80)","v":{"$error":"#VALUE!"}},{"$f":"SUMIF([4]Outubro!$F$6:$R$80,A28,[4]Outubro!$O$6:$O$80)","v":{"$error":"#VALUE!"}},{"$f":"SUMIF([4]Outubro!$F$6:$R$80,A28,[4]Outubro!$R$6:$R$80)","v":{"$error":"#VALUE!"}},{"$f":"SUMIF([5]Novembro!$F$6:$R$80,A28,[5]Novembro!$O$6:$O$80)","v":{"$error":"#VALUE!"}},{"$f":"SUMIF([5]Novembro!$F$6:$R$80,A28,[5]Novembro!$R$6:$R$80)","v":{"$error":"#VALUE!"}},{"$f":"SUMIF([6]Dezembro!$F$6:$R$80,D28,[6]Dezembro!$O$6:$O$80)","v":{"$error":"#VALUE!"}},{"$f":"SUMIF([6]Dezembro!$F$6:$R$80,D28,[6]Dezembro!$R$6:$R$80)","v":{"$error":"#VALUE!"}},0,0]
["Tipo",null,"Quant. Total","Vlr. Total","Quant. Total","Vlr. Total","Quant. Total","Vlr. Total","Quant. Total","Vlr. Total","Quant. Total","Vlr. Total","Quant. Total","Vlr. Total","Quant. Total","Vlr. Total","Quant. Total","Vlr. Total","Quant. Total","Vlr. Total","Quant. Total","Vlr. Total","Quant. Total","Vlr. Total","Quant. Total","Vlr. Total","Quant. Total","Vlr. Total"]
["Intermunicipal",null,{"$f":"SUMIF(Janeiro!$J$6:$R$77,A30,Janeiro!$O$6:$O$77)","v":333},{"$f":"SUMIF(Janeiro!$J$6:$R$77,A30,Janeiro!$R$6:$R$77)","v":4206.2},{"$f":"SUMIF(Fevereiro!$J$6:$R$77,A30,Fevereiro!$O$6:$O$77)","v":309},{"$f":"SUMIF(Fevereiro!$J$6:$R$77,A30,Fevereiro!$R$6:$R$77)","v":3949.8800000000006},{"$f":"SUMIF(Março!$J$6:$R$80,A30,Março!$O$6:$O$80)","v":345},{"$f":"SUMIF(Março!$J$6:$R$80,A30,Março!$R$6:$R$80)","v":4334.3600000000006},{"$f":"SUMIF(Abril!$J$6:$R$80,A30,Abril!$O$6:$O$80)","v":371},{"$f":"SUMIF(Abril!$J$6:$R$80,A30,Abril!$R$6:$R$80)","v":4401.8999999999996},{"$f":"SUMIF(Maio!$J$6:$R$80,A30,Maio!$O$6:$O$80)","v":333},{"$f":"SUMIF(Maio!$J$6:$R$80,A30,Maio!$R$6:$R$80)","v":4206.2},{"$f":"SUMIF(Junho!$J$6:$R$80,A30,Junho!$O$6:$O$80)","v":345},{"$f":"SUMIF(Junho!$J$6:$R$80,A30,Junho!$R$6:$R$80)","v":4334.3600000000006},{"$f":"SUMIF(Julho!$J$6:$R$80,A30,Julho!$O$6:$O$80)","v":345},{"$f":"SUMIF(Julho!$J$6:$R$80,A30,Julho!$R$6:$R$80)","v":4334.3600000000006},{"$f":"SUMIF([1]Agosto!$J$6:$R$80,A30,[1]Agosto!$O$6:$O$80)","v":{"$error":"#VALUE!"}},{"$f":"SUMIF([1]Agosto!$J$6:$R$80,A30,[1]Agosto!$R$6:$R$80)","v":{"$error":"#VALUE!"}},{"$f":"SUMIF([2]Setembro!$J$6:$R$80,A30,[2]Setembro!$O$6:$O$80)","v":{"$error":"#VALUE!"}},{"$f":"SUMIF([3]SET!$J$6:$R$80,A30,[3]SET!$R$6:$R$80)","v":{"$error":"#VALUE!"}},{"$f":"SUMIF([4]Outubro!$J$6:$R$80,A30,[4]Outubro!$O$6:$O$80)","v":{"$error":"#VALUE!"}},{"$f":"SUMIF([4]Outubro!$J$6:$R$80,A30,[4]Outubro!$R$6:$R$80)","v":{"$error":"#VALUE!"}},{"$f":"SUMIF([5]Novembro!$J$6:$R$80,A30,[5]Novembro!$O$6:$O$80)","v":{"$error":"#VALUE!"}},{"$f":"SUMIF([5]Novembro!$J$6:$R$80,A30,[5]Novembro!$R$6:$R$80)","v":{"$error":"#VALUE!"}},{"$f":"SUMIF([6]Dezembro!$J$6:$R$80,D30,[6]Dezembro!$O$6:$O$80)","v":{"$error":"#VALUE!"}},{"$f":"SUMIF([6]Dezembro!$J$6:$R$80,D30,[6]Dezembro!$R$6:$R$80)","v":{"$error":"#VALUE!"}},2381,29767.260000000002]
["Urbano",null,{"$f":"SUMIF(Janeiro!$J$6:$R$77,A31,Janeiro!$O$6:$O$77)","v":468},{"$f":"SUMIF(Janeiro!$J$6:$R$77,A31,Janeiro!$R$6:$R$77)","v":1526.0000000000002},{"$f":"SUMIF(Fevereiro!$J$6:$R$77,A31,Fevereiro!$O$6:$O$77)","v":424},{"$f":"SUMIF(Fevereiro!$J$6:$R$77,A31,Fevereiro!$R$6:$R$77)","v":1382.3999999999999},{"$f":"SUMIF(Março!$J$6:$R$80,A31,Março!$O$6:$O$80)","v":490},{"$f":"SUMIF(Março!$J$6:$R$80,A31,Março!$R$6:$R$80)","v":1597.8000000000002},{"$f":"SUMIF(Abril!$J$6:$R$80,A31,Abril!$O$6:$O$80)","v":556},{"$f":"SUMIF(Abril!$J$6:$R$80,A31,Abril!$R$6:$R$80)","v":1798.8000000000004},{"$f":"SUMIF(Maio!$J$6:$R$80,A31,Maio!$O$6:$O$80)","v":468},{"$f":"SUMIF(Maio!$J$6:$R$80,A31,Maio!$R$6:$R$80)","v":1526.0000000000002},{"$f":"SUMIF(Junho!$J$6:$R$80,A31,Junho!$O$6:$O$80)","v":490},{"$f":"SUMIF(Junho!$J$6:$R$80,A31,Junho!$R$6:$R$80)","v":1597.8000000000002},{"$f":"SUMIF(Julho!$J$6:$R$80,A31,Julho!$O$6:$O$80)","v":490},{"$f":"SUMIF(Julho!$J$6:$R$80,A31,Julho!$R$6:$R$80)","v":1597.8000000000002},{"$f":"SUMIF([1]Agosto!$J$6:$R$80,A31,[1]Agosto!$O$6:$O$80)","v":{"$error":"#VALUE!"}},{"$f":"SUMIF([1]Agosto!$J$6:$R$80,A31,[1]Agosto!$R$6:$R$80)","v":{"$error":"#VALUE!"}},{"$f":"SUMIF([2]Setembro!$J$6:$R$80,A31,[2]Setembro!$O$6:$O$80)","v":{"$error":"#VALUE!"}},{"$f":"SUMIF([3]SET!$J$6:$R$80,A31,[3]SET!$R$6:$R$80)","v":{"$error":"#VALUE!"}},{"$f":"SUMIF([4]Outubro!$J$6:$R$80,A31,[4]Outubro!$O$6:$O$80)","v":{"$error":"#VALUE!"}},{"$f":"SUMIF([4]Outubro!$J$6:$R$80,A31,[4]Outubro!$R$6:$R$80)","v":{"$error":"#VALUE!"}},{"$f":"SUMIF([5]Novembro!$J$6:$R$80,A31,[5]Novembro!$O$6:$O$80)","v":{"$error":"#VALUE!"}},{"$f":"SUMIF([5]Novembro!$J$6:$R$80,A31,[5]Novembro!$R$6:$R$80)","v":{"$error":"#VALUE!"}},{"$f":"SUMIF([6]Dezembro!$J$6:$R$80,D31,[6]Dezembro!$O$6:$O$80)","v":{"$error":"#VALUE!"}},{"$f":"SUMIF([6]Dezembro!$J$6:$R$80,D31,[6]Dezembro!$R$6:$R$80)","v":{"$error":"#VALUE!"}},3386,11026.600000000002]
["Empresa",null,"Quant. Total","Vlr. Total","Quant. Total","Vlr. Total","Quant. Total","Vlr. Total","Quant. Total","Vlr. Total","Quant. Total","Vlr. Total","Quant. Total","Vlr. Total","Quant. Total","Vlr. Total","Quant. Total","Vlr. Total","Quant. Total","Vlr. Total","Quant. Total","Vlr. Total","Quant. Total","Vlr. Total","Quant. Total","Vlr. Total","Quant. Total","Vlr. Total"]
["Águia Branca",null,{"$f":"SUMIF(Janeiro!$K$6:$R$77,A33,Janeiro!$O$6:$O$77)","v":0},{"$f":"SUMIF(Janeiro!$K$6:$R$77,A33,Janeiro!$R$6:$R$77)","v":0},{"$f":"SUMIF(Fevereiro!$K$6:$R$77,A33,Fevereiro!$O$6:$O$77)","v":0},{"$f":"SUMIF(Fevereiro!$K$6:$R$77,A33,Fevereiro!$R$6:$R$77)","v":0},{"$f":"SUMIF(Março!$K$6:$R$80,A33,Março!$O$6:$O$80)","v":0},{"$f":"SUMIF(Março!$K$6:$R$80,A33,Março!$R$6:$R$80)","v":0},{"$f":"SUMIF(Abril!$K$6:$R$80,A33,Abril!$O$6:$O$80)","v":0},{"$f":"SUMIF(Abril!$K$6:$R$80,A33,Abril!$R$6:$R$80)","v":0},{"$f":"SUMIF(Maio!$K$6:$R$80,A33,Maio!$O$6:$O$80)","v":0},{"$f":"SUMIF(Maio!$K$6:$R$80,A33,Maio!$R$6:$R$80)","v":0},{"$f":"SUMIF(Junho!$K$6:$R$80,A33,Junho!$O$6:$O$80)","v":0},{"$f":"SUMIF(Junho!$K$6:$R$80,A33,Junho!$R$6:$R$80)","v":0},{"$f":"SUMIF(Julho!$K$6:$R$80,A33,Julho!$O$6:$O$80)","v":0},{"$f":"SUMIF(Julho!$K$6:$R$80,A33,Julho!$R$6:$R$80)","v":0},{"$f":"SUMIF([1]Agosto!$K$6:$R$80,A33,[1]Agosto!$O$6:$O$80)","v":{"$error":"#VALUE!"}},{"$f":"SUMIF([1]Agosto!$K$6:$R$80,A33,[1]Agosto!$R$6:$R$80)","v":{"$error":"#VALUE!"}},{"$f":"SUMIF([2]Setembro!$K$6:$R$80,A33,[2]Setembro!$O$6:$O$80)","v":{"$error":"#VALUE!"}},{"$f":"SUMIF([2]Setembro!$K$6:$R$80,A33,[2]Setembro!$R$6:$R$80)","v":{"$error":"#VALUE!"}},{"$f":"SUMIF([4]Outubro!$K$6:$R$80,A33,[4]Outubro!$O$6:$O$80)","v":{"$error":"#VALUE!"}},{"$f":"SUMIF([4]Outubro!$K$6:$R$80,A33,[4]Outubro!$R$6:$R$80)","v":{"$error":"#VALUE!"}},{"$f":"SUMIF([5]Novembro!$K$6:$R$80,A33,[5]Novembro!$O$6:$O$80)","v":{"$error":"#VALUE!"}},{"$f":"SUMIF([5]Novembro!$K$6:$R$80,A33,[5]Novembro!$R$6:$R$80)","v":{"$error":"#VALUE!"}},{"$f":"SUMIF([6]Dezembro!$K$6:$R$80,D33,[6]Dezembro!$O$6:$O$80)","v":{"$error":"#VALUE!"}},{"$f":"SUMIF([6]Dezembro!$K$6:$R$80,D33,[6]Dezembro!$R$6:$R$80)","v":{"$error":"#VALUE!"}},0,0]
["Aracaju Card",null,{"$f":"SUMIF(Janeiro!$K$6:$R$77,A34,Janeiro!$O$6:$O$77)","v":52},{"$f":"SUMIF(Janeiro!$K$6:$R$77,A34,Janeiro!$R$6:$R$77)","v":161.20000000000002},{"$f":"SUMIF(Fevereiro!$K$6:$R$77,A34,Fevereiro!$O$6:$O$77)","v":48},{"$f":"SUMIF(Fevereiro!$K$6:$R$77,A34,Fevereiro!$R$6:$R$77)","v":148.80000000000001},{"$f":"SUMIF(Março!$K$6:$R$80,A34,Março!$O$6:$O$80)","v":54},{"$f":"SUMIF(Março!$K$6:$R$80,A34,Março!$R$6:$R$80)","v":167.4},{"$f":"SUMIF(Abril!$K$6:$R$80,A34,Abril!$O$6:$O$80)","v":140},{"$f":"SUMIF(Abril!$K$6:$R$80,A34,Abril!$R$6:$R$80)","v":434.00000000000006},{"$f":"SUMIF(Maio!$K$6:$R$80,A34,Maio!$O$6:$O$80)","v":52},{"$f":"SUMIF(Maio!$K$6:$R$80,A34,Maio!$R$6:$R$80)","v":161.20000000000002},{"$f":"SUMIF(Junho!$K$6:$R$80,A34,Junho!$O$6:$O$80)","v":54},{"$f":"SUMIF(Junho!$K$6:$R$80,A34,Junho!$R$6:$R$80)","v":167.4},{"$f":"SUMIF(Julho!$K$6:$R$80,A34,Julho!$O$6:$O$80)","v":54},{"$f":"SUMIF(Julho!$K$6:$R$80,A34,Julho!$R$6:$R$80)","v":167.4},{"$f":"SUMIF([1]Agosto!$K$6:$R$80,A34,[1]Agosto!$O$6:$O$80)","v":{"$error":"#VALUE!"}},{"$f":"SUMIF([1]Agosto!$K$6:$R$80,A34,[1]Agosto!$R$6:$R$80)","v":{"$error":"#VALUE!"}},{"$f":"SUMIF([2]Setembro!$K$6:$R$80,A34,[2]Setembro!$O$6:$O$80)","v":{"$error":"#VALUE!"}},{"$f":"SUMIF([2]Setembro!$K$6:$R$80,A34,[2]Setembro!$R$6:$R$80)","v":{"$error":"#VALUE!"}},{"$f":"SUMIF([4]Outubro!$K$6:$R$80,A34,[4]Outubro!$O$6:$O$80)","v":{"$error":"#VALUE!"}},{"$f":"SUMIF([4]Outubro!$K$6:$R$80,A34,[4]Outubro!$R$6:$R$80)","v":{"$error":"#VALUE!"}},{"$f":"SUMIF([5]Novembro!$K$6:$R$80,A34,[5]Novembro!$O$6:$O$80)","v":{"$error":"#VALUE!"}},{"$f":"SUMIF([5]Novembro!$K$6:$R$80,A34,[5]Novembro!$R$6:$R$80)","v":{"$error":"#VALUE!"}},{"$f":"SUMIF([6]Dezembro!$K$6:$R$80,D34,[6]Dezembro!$O$6:$O$80)","v":{"$error":"#VALUE!"}},{"$f":"SUMIF([6]Dezembro!$K$6:$R$80,D34,[6]Dezembro!$R$6:$R$80)","v":{"$error":"#VALUE!"}},{"$f":"IF(ISERROR(C34),0,C34)+IF(ISERROR(E34),0,E34)+IF(ISERROR(G34),0,G34)+IF(ISERROR(I34),0,I34)+IF(ISERROR(K34),0,K34)+IF(ISERROR(M34),0,M34)+IF(ISERROR(O34),0,O34)+IF(ISERROR(Q34),0,Q34)+IF(ISERROR(S34),0,S34)+IF(ISERROR(U34),0,U34)+IF(ISERROR(W34),0,W34)+IF(ISERROR(Y34),0,Y34)","v":454},{"$f":"IF(ISERROR(D34),0,D34)+IF(ISERROR(F34),0,F34)+IF(ISERROR(H34),0,H34)+IF(ISERROR(J34),0,J34)+IF(ISERROR(L34),0,L34)+IF(ISERROR(N34),0,N34)+IF(ISERROR(P34),0,P34)+IF(ISERROR(R34),0,R34)+IF(ISERROR(T34),0,T34)+IF(ISERROR(V34),0,V34)+IF(ISERROR(X34),0,X34)+IF(ISERROR(Z34),0,Z34)","v":1407.4000000000003}]
["Cidade das Águas",null,{"$f":"SUMIF(Janeiro!$K$6:$R$77,A35,Janeiro!$O$6:$O$77)","v":40},{"$f":"SUMIF(Janeiro!$K$6:$R$77,A35,Janeiro!$R$6:$R$77)","v":112},{"$f":"SUMIF(Fevereiro!$K$6:$R$77,A35,Fevereiro!$O$6:$O$77)","v":36},{"$f":"SUMIF(Fevereiro!$K$6:$R$77,A35,Fevereiro!$R$6:$R$77)","v":100.8},{"$f":"SUMIF(Março!$K$6:$R$80,A35,Março!$O$6:$O$80)","v":42},{"$f":"SUMIF(Março!$K$6:$R$80,A35,Março!$R$6:$R$80)","v":117.6},{"$f":"SUMIF(Abril!$K$6:$R$80,A35,Abril!$O$6:$O$80)","v":40},{"$f":"SUMIF(Abril!$K$6:$R$80,A35,Abril!$R$6:$R$80)","v":112},{"$f":"SUMIF(Maio!$K$6:$R$80,A35,Maio!$O$6:$O$80)","v":40},{"$f":"SUMIF(Maio!$K$6:$R$80,A35,Maio!$R$6:$R$80)","v":112},{"$f":"SUMIF(Junho!$K$6:$R$80,A35,Junho!$O$6:$O$80)","v":42},{"$f":"SUMIF(Junho!$K$6:$R$80,A35,Junho!$R$6:$R$80)","v":117.6},{"$f":"SUMIF(Julho!$K$6:$R$80,A35,Julho!$O$6:$O$80)","v":42},{"$f":"SUMIF(Julho!$K$6:$R$80,A35,Julho!$R$6:$R$80)","v":117.6},{"$f":"SUMIF([1]Agosto!$K$6:$R$80,A35,[1]Agosto!$O$6:$O$80)","v":{"$error":"#VALUE!"}},{"$f":"SUMIF([1]Agosto!$K$6:$R$80,A35,[1]Agosto!$R$6:$R$80)","v":{"$error":"#VALUE!"}},{"$f":"SUMIF([2]Setembro!$K$6:$R$80,A35,[2]Setembro!$O$6:$O$80)","v":{"$error":"#VALUE!"}},{"$f":"SUMIF([2]Setembro!$K$6:$R$80,A35,[2]Setembro!$R$6:$R$80)","v":{"$error":"#VALUE!"}},{"$f":"SUMIF([4]Outubro!$K$6:$R$80,A35,[4]Outubro!$O$6:$O$80)","v":{"$error":"#VALUE!"}},{"$f":"SUMIF([4]Outubro!$K$6:$R$80,A35,[4]Outubro!$R$6:$R$80)","v":{"$error":"#VALUE!"}},{"$f":"SUMIF([5]Novembro!$K$6:$R$80,A35,[5]Novembro!$O$6:$O$80)","v":{"$error":"#VALUE!"}},{"$f":"SUMIF([5]Novembro!$K$6:$R$80,A35,[5]Novembro!$R$6:$R$80)","v":{"$error":"#VALUE!"}},{"$f":"SUMIF([6]Dezembro!$K$6:$R$80,D35,[6]Dezembro!$O$6:$O$80)","v":{"$error":"#VALUE!"}},{"$f":"SUMIF([6]Dezembro!$K$6:$R$80,D35,[6]Dezembro!$R$6:$R$80)","v":{"$error":"#VALUE!"}},282,789.6]
["Cidade Sol",null,{"$f":"SUMIF(Janeiro!$K$6:$R$77,A36,Janeiro!$O$6:$O$77)","v":88},{"$f":"SUMIF(Janeiro!$K$6:$R$77,A36,Janeiro!$R$6:$R$77)","v":1645.2},{"$f":"SUMIF(Fevereiro!$K$6:$R$77,A36,Fevereiro!$O$6:$O$77)","v":84},{"$f":"SUMIF(Fevereiro!$K$6:$R$77,A36,Fevereiro!$R$6:$R$77)","v":1531.8000000000002},{"$f":"SUMIF(Março!$K$6:$R$80,A36,Março!$O$6:$O$80)","v":90},{"$f":"SUMIF(Março!$K$6:$R$80,A36,Março!$R$6:$R$80)","v":1701.9},{"$f":"SUMIF(Abril!$K$6:$R$80,A36,Abril!$O$6:$O$80)","v":88},{"$f":"SUMIF(Abril!$K$6:$R$80,A36,Abril!$R$6:$R$80)","v":1645.2},{"$f":"SUMIF(Maio!$K$6:$R$80,A36,Maio!$O$6:$O$80)","v":88},{"$f":"SUMIF(Maio!$K$6:$R$80,A36,Maio!$R$6:$R$80)","v":1645.2},{"$f":"SUMIF(Junho!$K$6:$R$80,A36,Junho!$O$6:$O$80)","v":90},{"$f":"SUMIF(Junho!$K$6:$R$80,A36,Junho!$R$6:$R$80)","v":1701.9},{"$f":"SUMIF(Julho!$K$6:$R$80,A36,Julho!$O$6:$O$80)","v":90},{"$f":"SUMIF(Julho!$K$6:$R$80,A36,Julho!$R$6:$R$80)","v":1701.9},{"$f":"SUMIF([1]Agosto!$K$6:$R$80,A36,[1]Agosto!$O$6:$O$80)","v":{"$error":"#VALUE!"}},{"$f":"SUMIF([1]Agosto!$K$6:$R$80,A36,[1]Agosto!$R$6:$R$80)","v":{"$error":"#VALUE!"}},{"$f":"SUMIF([2]Setembro!$K$6:$R$80,A36,[2]Setembro!$O$6:$O$80)","v":{"$error":"#VALUE!"}},{"$f":"SUMIF([2]Setembro!$K$6:$R$80,A36,[2]Setembro!$R$6:$R$80)","v":{"$error":"#VALUE!"}},{"$f":"SUMIF([4]Outubro!$K$6:$R$80,A36,[4]Outubro!$O$6:$O$80)","v":{"$error":"#VALUE!"}},{"$f":"SUMIF([4]Outubro!$K$6:$R$80,A36,[4]Outubro!$R$6:$R$80)","v":{"$error":"#VALUE!"}},{"$f":"SUMIF([5]Novembro!$K$6:$R$80,A36,[5]Novembro!$O$6:$O$80)","v":{"$error":"#VALUE!"}},{"$f":"SUMIF([5]Novembro!$K$6:$R$80,A36,[5]Novembro!$R$6:$R$80)","v":{"$error":"#VALUE!"}},{"$f":"SUMIF([6]Dezembro!$K$6:$R$80,D36,[6]Dezembro!$O$6:$O$80)","v":{"$error":"#VALUE!"}},{"$f":"SUMIF([6]Dezembro!$K$6:$R$80,D36,[6]Dezembro!$R$6:$R$80)","v":{"$error":"#VALUE!"}},618,11573.099999999999]
["Metropasse",null,{"$f":"SUMIF(Janeiro!$K$6:$R$77,A37,Janeiro!$O$6:$O$77)","v":120},{"$f":"SUMIF(Janeiro!$K$6:$R$77,A37,Janeiro!$R$6:$R$77)","v":396},{"$f":"SUMIF(Fevereiro!$K$6:$R$77,A37,Fevereiro!$O$6:$O$77)","v":108},{"$f":"SUMIF(Fevereiro!$K$6:$R$77,A37,Fevereiro!$R$6:$R$77)","v":356.4},{"$f":"SUMIF(Março!$K$6:$R$80,A37,Março!$O$6:$O$80)","v":126},{"$f":"SUMIF(Março!$K$6:$R$80,A37,Março!$R$6:$R$80)","v":415.79999999999995},{"$f":"SUMIF(Abril!$K$6:$R$80,A37,Abril!$O$6:$O$80)","v":120},{"$f":"SUMIF(Abril!$K$6:$R$80,A37,Abril!$R$6:$R$80)","v":396},{"$f":"SUMIF(Maio!$K$6:$R$80,A37,Maio!$O$6:$O$80)","v":120},{"$f":"SUMIF(Maio!$K$6:$R$80,A37,Maio!$R$6:$R$80)","v":396},{"$f":"SUMIF(Junho!$K$6:$R$80,A37,Junho!$O$6:$O$80)","v":126},{"$f":"SUMIF(Junho!$K$6:$R$80,A37,Junho!$R$6:$R$80)","v":415.79999999999995},{"$f":"SUMIF(Julho!$K$6:$R$80,A37,Julho!$O$6:$O$80)","v":126},{"$f":"SUMIF(Julho!$K$6:$R$80,A37,Julho!$R$6:$R$80)","v":415.79999999999995},{"$f":"SUMIF([1]Agosto!$K$6:$R$80,A37,[1]Agosto!$O$6:$O$80)","v":{"$error":"#VALUE!"}},{"$f":"SUMIF([1]Agosto!$K$6:$R$80,A37,[1]Agosto!$R$6:$R$80)","v":{"$error":"#VALUE!"}},{"$f":"SUMIF([2]Setembro!$K$6:$R$80,A37,[2]Setembro!$O$6:$O$80)","v":{"$error":"#VALUE!"}},{"$f":"SUMIF([2]Setembro!$K$6:$R$80,A37,[2]Setembro!$R$6:$R$80)","v":{"$error":"#VALUE!"}},{"$f":"SUMIF([4]Outubro!$K$6:$R$80,A37,[4]Outubro!$O$6:$O$80)","v":{"$error":"#VALUE!"}},{"$f":"SUMIF([4]Outubro!$K$6:$R$80,A37,[4]Outubro!$R$6:$R$80)","v":{"$error":"#VALUE!"}},{"$f":"SUMIF([5]Novembro!$K$6:$R$80,A37,[5]Novembro!$O$6:$O$80)","v":{"$error":"#VALUE!"}},{"$f":"SUMIF([5]Novembro!$K$6:$R$80,A37,[5]Novembro!$R$6:$R$80)","v":{"$error":"#VALUE!"}},{"$f":"SUMIF([6]Dezembro!$K$6:$R$80,D37,[6]Dezembro!$O$6:$O$80)","v":{"$error":"#VALUE!"}},{"$f":"SUMIF([6]Dezembro!$K$6:$R$80,D37,[6]Dezembro!$R$6:$R$80)","v":{"$error":"#VALUE!"}}]
["Viação Rosa",null,{"$f":"SUMIF(Janeiro!$K$6:$R$77,A38,Janeiro!$O$6:$O$77)","v":0},{"$f":"SUMIF(Janeiro!$K$6:$R$77,A38,Janeiro!$R$6:$R$77)","v":0},{"$f":"SUMIF(Fevereiro!$K$6:$R$77,A38,Fevereiro!$O$6:$O$77)","v":0},{"$f":"SUMIF(Fevereiro!$K$6:$R$77,A38,Fevereiro!$R$6:$R$77)","v":0},{"$f":"SUMIF(Março!$K$6:$R$80,A38,Março!$O$6:$O$80)","v":0},{"$f":"SUMIF(Março!$K$6:$R$80,A38,Março!$R$6:$R$80)","v":0},{"$f":"SUMIF(Abril!$K$6:$R$80,A38,Abril!$O$6:$O$80)","v":0},{"$f":"SUMIF(Abril!$K$6:$R$80,A38,Abril!$R$6:$R$80)","v":0},{"$f":"SUMIF(Maio!$K$6:$R$80,A38,Maio!$O$6:$O$80)","v":0},{"$f":"SUMIF(Maio!$K$6:$R$80,A38,Maio!$R$6:$R$80)","v":0},{"$f":"SUMIF(Junho!$K$6:$R$80,A38,Junho!$O$6:$O$80)","v":0},{"$f":"SUMIF(Junho!$K$6:$R$80,A38,Junho!$R$6:$R$80)","v":0},{"$f":"SUMIF(Julho!$K$6:$R$80,A38,Julho!$O$6:$O$80)","v":0},{"$f":"SUMIF(Julho!$K$6:$R$80,A38,Julho!$R$6:$R$80)","v":0},{"$f":"SUMIF([1]Agosto!$K$6:$R$80,A38,[1]Agosto!$O$6:$O$80)","v":{"$error":"#VALUE!"}},{"$f":"SUMIF([1]Agosto!$K$6:$R$80,A38,[1]Agosto!$R$6:$R$80)","v":{"$error":"#VALUE!"}},{"$f":"SUMIF([2]Setembro!$K$6:$R$80,A38,[2]Setembro!$O$6:$O$80)","v":{"$error":"#VALUE!"}},{"$f":"SUMIF([2]Setembro!$K$6:$R$80,A38,[2]Setembro!$R$6:$R$80)","v":{"$error":"#VALUE!"}},{"$f":"SUMIF([4]Outubro!$K$6:$R$80,A38,[4]Outubro!$O$6:$O$80)","v":{"$error":"#VALUE!"}},{"$f":"SUMIF([4]Outubro!$K$6:$R$80,A38,[4]Outubro!$R$6:$R$80)","v":{"$error":"#VALUE!"}},{"$f":"SUMIF([5]Novembro!$K$6:$R$80,A38,[5]Novembro!$O$6:$O$80)","v":{"$error":"#VALUE!"}},{"$f":"SUMIF([5]Novembro!$K$6:$R$80,A38,[5]Novembro!$R$6:$R$80)","v":{"$error":"#VALUE!"}},{"$f":"SUMIF([6]Dezembro!$K$6:$R$80,D38,[6]Dezembro!$O$6:$O$80)","v":{"$error":"#VALUE!"}},{"$f":"SUMIF([6]Dezembro!$K$6:$R$80,D38,[6]Dezembro!$R$6:$R$80)","v":{"$error":"#VALUE!"}},0,0]
["Viação Jauá",null,{"$f":"SUMIF(Janeiro!$K$6:$R$77,A39,Janeiro!$O$6:$O$77)","v":50},{"$f":"SUMIF(Janeiro!$K$6:$R$77,A39,Janeiro!$R$6:$R$77)","v":1151.5},{"$f":"SUMIF(Fevereiro!$K$6:$R$77,A39,Fevereiro!$O$6:$O$77)","v":46},{"$f":"SUMIF(Fevereiro!$K$6:$R$77,A39,Fevereiro!$R$6:$R$77)","v":1059.3800000000001},{"$f":"SUMIF(Março!$K$6:$R$80,A39,Março!$O$6:$O$80)","v":52},{"$f":"SUMIF(Março!$K$6:$R$80,A39,Março!$R$6:$R$80)","v":1197.56},{"$f":"SUMIF(Abril!$K$6:$R$80,A39,Abril!$O$6:$O$80)","v":50},{"$f":"SUMIF(Abril!$K$6:$R$80,A39,Abril!$R$6:$R$80)","v":1151.5},{"$f":"SUMIF(Maio!$K$6:$R$80,A39,Maio!$O$6:$O$80)","v":50},{"$f":"SUMIF(Maio!$K$6:$R$80,A39,Maio!$R$6:$R$80)","v":1151.5},{"$f":"SUMIF(Junho!$K$6:$R$80,A39,Junho!$O$6:$O$80)","v":52},{"$f":"SUMIF(Junho!$K$6:$R$80,A39,Junho!$R$6:$R$80)","v":1197.56},{"$f":"SUMIF(Julho!$K$6:$R$80,A39,Julho!$O$6:$O$80)","v":52},{"$f":"SUMIF(Julho!$K$6:$R$80,A39,Julho!$R$6:$R$80)","v":1197.56},{"$f":"SUMIF([1]Agosto!$K$6:$R$80,A39,[1]Agosto!$O$6:$O$80)","v":{"$error":"#VALUE!"}},{"$f":"SUMIF([1]Agosto!$K$6:$R$80,A39,[1]Agosto!$R$6:$R$80)","v":{"$error":"#VALUE!"}},{"$f":"SUMIF([2]Setembro!$K$6:$R$80,A39,[2]Setembro!$O$6:$O$80)","v":{"$error":"#VALUE!"}},{"$f":"SUMIF([2]Setembro!$K$6:$R$80,A39,[2]Setembro!$R$6:$R$80)","v":{"$error":"#VALUE!"}},{"$f":"SUMIF([4]Outubro!$K$6:$R$80,A39,[4]Outubro!$O$6:$O$80)","v":{"$error":"#VALUE!"}},{"$f":"SUMIF([4]Outubro!$K$6:$R$80,A39,[4]Outubro!$R$6:$R$80)","v":{"$error":"#VALUE!"}},{"$f":"SUMIF([5]Novembro!$K$6:$R$80,A39,[5]Novembro!$O$6:$O$80)","v":{"$error":"#VALUE!"}},{"$f":"SUMIF([5]Novembro!$K$6:$R$80,A39,[5]Novembro!$R$6:$R$80)","v":{"$error":"#VALUE!"}},{"$f":"SUMIF([6]Dezembro!$K$6:$R$80,D39,[6]Dezembro!$O$6:$O$80)","v":{"$error":"#VALUE!"}},{"$f":"SUMIF([6]Dezembro!$K$6:$R$80,D39,[6]Dezembro!$R$6:$R$80)","v":{"$error":"#VALUE!"}},352,8106.5599999999995]
["Lis Transportes",null,{"$f":"SUMIF(Janeiro!$K$6:$R$77,A40,Janeiro!$O$6:$O$77)","v":10},{"$f":"SUMIF(Janeiro!$K$6:$R$77,A40,Janeiro!$R$6:$R$77)","v":650},{"$f":"SUMIF(Fevereiro!$K$6:$R$77,A40,Fevereiro!$O$6:$O$77)","v":10},{"$f":"SUMIF(Fevereiro!$K$6:$R$77,A40,Fevereiro!$R$6:$R$77)","v":650},{"$f":"SUMIF(Março!$K$6:$R$80,A40,Março!$O$6:$O$80)","v":10},{"$f":"SUMIF(Março!$K$6:$R$80,A40,Março!$R$6:$R$80)","v":650},{"$f":"SUMIF(Abril!$K$6:$R$80,A40,Abril!$O$6:$O$80)","v":10},{"$f":"SUMIF(Abril!$K$6:$R$80,A40,Abril!$R$6:$R$80)","v":650},{"$f":"SUMIF(Maio!$K$6:$R$80,A40,Maio!$O$6:$O$80)","v":10},{"$f":"SUMIF(Maio!$K$6:$R$80,A40,Maio!$R$6:$R$80)","v":650},{"$f":"SUMIF(Junho!$K$6:$R$80,A40,Junho!$O$6:$O$80)","v":10},{"$f":"SUMIF(Junho!$K$6:$R$80,A40,Junho!$R$6:$R$80)","v":650},{"$f":"SUMIF(Julho!$K$6:$R$80,A40,Julho!$O$6:$O$80)","v":10},{"$f":"SUMIF(Julho!$K$6:$R$80,A40,Julho!$R$6:$R$80)","v":650},{"$f":"SUMIF([1]Agosto!$K$6:$R$80,A40,[1]Agosto!$O$6:$O$80)","v":{"$error":"#VALUE!"}},{"$f":"SUMIF([1]Agosto!$K$6:$R$80,A40,[1]Agosto!$R$6:$R$80)","v":{"$error":"#VALUE!"}},{"$f":"SUMIF([2]Setembro!$K$6:$R$80,A40,[2]Setembro!$O$6:$O$80)","v":{"$error":"#VALUE!"}},{"$f":"SUMIF([2]Setembro!$K$6:$R$80,A40,[2]Setembro!$R$6:$R$80)","v":{"$error":"#VALUE!"}},{"$f":"SUMIF([4]Outubro!$K$6:$R$80,A40,[4]Outubro!$O$6:$O$80)","v":{"$error":"#VALUE!"}},{"$f":"SUMIF([4]Outubro!$K$6:$R$80,A40,[4]Outubro!$R$6:$R$80)","v":{"$error":"#VALUE!"}},{"$f":"SUMIF([5]Novembro!$K$6:$R$80,A40,[5]Novembro!$O$6:$O$80)","v":{"$error":"#VALUE!"}},{"$f":"SUMIF([5]Novembro!$K$6:$R$80,A40,[5]Novembro!$R$6:$R$80)","v":{"$error":"#VALUE!"}},{"$f":"SUMIF([6]Dezembro!$K$6:$R$80,D40,[6]Dezembro!$O$6:$O$80)","v":{"$error":"#VALUE!"}},{"$f":"SUMIF([6]Dezembro!$K$6:$R$80,D40,[6]Dezembro!$R$6:$R$80)","v":{"$error":"#VALUE!"}},70,4550]
["RD Transportes",null,{"$f":"SUMIF(Janeiro!$K$6:$R$77,A41,Janeiro!$O$6:$O$77)","v":25},{"$f":"SUMIF(Janeiro!$K$6:$R$77,A41,Janeiro!$R$6:$R$77)","v":251.5},{"$f":"SUMIF(Fevereiro!$K$6:$R$77,A41,Fevereiro!$O$6:$O$77)","v":25},{"$f":"SUMIF(Fevereiro!$K$6:$R$77,A41,Fevereiro!$R$6:$R$77)","v":251.5},{"$f":"SUMIF(Março!$K$6:$R$80,A41,Março!$O$6:$O$80)","v":25},{"$f":"SUMIF(Março!$K$6:$R$80,A41,Março!$R$6:$R$80)","v":251.5},{"$f":"SUMIF(Abril!$K$6:$R$80,A41,Abril!$O$6:$O$80)","v":25},{"$f":"SUMIF(Abril!$K$6:$R$80,A41,Abril!$R$6:$R$80)","v":251.5},{"$f":"SUMIF(Maio!$K$6:$R$80,A41,Maio!$O$6:$O$80)","v":25},{"$f":"SUMIF(Maio!$K$6:$R$80,A41,Maio!$R$6:$R$80)","v":251.5},{"$f":"SUMIF(Junho!$K$6:$R$80,A41,Junho!$O$6:$O$80)","v":25},{"$f":"SUMIF(Junho!$K$6:$R$80,A41,Junho!$R$6:$R$80)","v":251.5},{"$f":"SUMIF(Julho!$K$6:$R$80,A41,Julho!$O$6:$O$80)","v":25},{"$f":"SUMIF(Julho!$K$6:$R$80,A41,Julho!$R$6:$R$80)","v":251.5},{"$f":"SUMIF([1]Agosto!$K$6:$R$80,A41,[1]Agosto!$O$6:$O$80)","v":{"$error":"#VALUE!"}},{"$f":"SUMIF([1]Agosto!$K$6:$R$80,A41,[1]Agosto!$R$6:$R$80)","v":{"$error":"#VALUE!"}},{"$f":"SUMIF([2]Setembro!$K$6:$R$80,A41,[2]Setembro!$O$6:$O$80)","v":{"$error":"#VALUE!"}},{"$f":"SUMIF([2]Setembro!$K$6:$R$80,A41,[2]Setembro!$R$6:$R$80)","v":{"$error":"#VALUE!"}},{"$f":"SUMIF([4]Outubro!$K$6:$R$80,A41,[4]Outubro!$O$6:$O$80)","v":{"$error":"#VALUE!"}},{"$f":"SUMIF([4]Outubro!$K$6:$R$80,A41,[4]Outubro!$R$6:$R$80)","v":{"$error":"#VALUE!"}},{"$f":"SUMIF([5]Novembro!$K$6:$R$80,A41,[5]Novembro!$O$6:$O$80)","v":{"$error":"#VALUE!"}},{"$f":"SUMIF([5]Novembro!$K$6:$R$80,A41,[5]Novembro!$R$6:$R$80)","v":{"$error":"#VALUE!"}},{"$f":"SUMIF([6]Dezembro!$K$6:$R$80,D41,[6]Dezembro!$O$6:$O$80)","v":{"$error":"#VALUE!"}},{"$f":"SUMIF([6]Dezembro!$K$6:$R$80,D41,[6]Dezembro!$R$6:$R$80)","v":{"$error":"#VALUE!"}},175,1760.5]
["Salvador Card",null,{"$f":"SUMIF(Janeiro!$K$6:$R$77,A42,Janeiro!$O$6:$O$77)","v":376},{"$f":"SUMIF(Janeiro!$K$6:$R$77,A42,Janeiro!$R$6:$R$77)","v":1240.8},{"$f":"SUMIF(Fevereiro!$K$6:$R$77,A42,Fevereiro!$O$6:$O$77)","v":340},{"$f":"SUMIF(Fevereiro!$K$6:$R$77,A42,Fevereiro!$R$6:$R$77)","v":1122},{"$f":"SUMIF(Março!$K$6:$R$80,A42,Março!$O$6:$O$80)","v":394},{"$f":"SUMIF(Março!$K$6:$R$80,A42,Março!$R$6:$R$80)","v":1300.2},{"$f":"SUMIF(Abril!$K$6:$R$80,A42,Abril!$O$6:$O$80)","v":376},{"$f":"SUMIF(Abril!$K$6:$R$80,A42,Abril!$R$6:$R$80)","v":1240.8},{"$f":"SUMIF(Maio!$K$6:$R$80,A42,Maio!$O$6:$O$80)","v":376},{"$f":"SUMIF(Maio!$K$6:$R$80,A42,Maio!$R$6:$R$80)","v":1240.8},{"$f":"SUMIF(Junho!$K$6:$R$80,A42,Junho!$O$6:$O$80)","v":394},{"$f":"SUMIF(Junho!$K$6:$R$80,A42,Junho!$R$6:$R$80)","v":1300.2},{"$f":"SUMIF(Julho!$K$6:$R$80,A42,Julho!$O$6:$O$80)","v":394},{"$f":"SUMIF(Julho!$K$6:$R$80,A42,Julho!$R$6:$R$80)","v":1300.2},{"$f":"SUMIF([1]Agosto!$K$6:$R$80,A42,[1]Agosto!$O$6:$O$80)","v":{"$error":"#VALUE!"}},{"$f":"SUMIF([1]Agosto!$K$6:$R$80,A42,[1]Agosto!$R$6:$R$80)","v":{"$error":"#VALUE!"}},{"$f":"SUMIF([2]Setembro!$K$6:$R$80,A42,[2]Setembro!$O$6:$O$80)","v":{"$error":"#VALUE!"}},{"$f":"SUMIF([2]Setembro!$K$6:$R$80,A42,[2]Setembro!$R$6:$R$80)","v":{"$error":"#VALUE!"}},{"$f":"SUMIF([4]Outubro!$K$6:$R$80,A42,[4]Outubro!$O$6:$O$80)","v":{"$error":"#VALUE!"}},{"$f":"SUMIF([4]Outubro!$K$6:$R$80,A42,[4]Outubro!$R$6:$R$80)","v":{"$error":"#VALUE!"}},{"$f":"SUMIF([5]Novembro!$K$6:$R$80,A42,[5]Novembro!$O$6:$O$80)","v":{"$error":"#VALUE!"}},{"$f":"SUMIF([5]Novembro!$K$6:$R$80,A42,[5]Novembro!$R$6:$R$80)","v":{"$error":"#VALUE!"}},{"$f":"SUMIF([6]Dezembro!$K$6:$R$80,D42,[6]Dezembro!$O$6:$O$80)","v":{"$error":"#VALUE!"}},{"$f":"SUMIF([6]Dezembro!$K$6:$R$80,D42,[6]Dezembro!$R$6:$R$80)","v":{"$error":"#VALUE!"}},{"$f":"IF(ISERROR(C42),0,C42)+IF(ISERROR(E42),0,E42)+IF(ISERROR(G42),0,G42)+IF(ISERROR(I42),0,I42)+IF(ISERROR(K42),0,K42)+IF(ISERROR(M42),0,M42)+IF(ISERROR(O42),0,O42)+IF(ISERROR(Q42),0,Q42)+IF(ISERROR(S42),0,S42)+IF(ISERROR(U42),0,U42)+IF(ISERROR(W42),0,W42)+IF(ISERROR(Y42),0,Y42)","v":2650},{"$f":"IF(ISERROR(D42),0,D42)+IF(ISERROR(F42),0,F42)+IF(ISERROR(H42),0,H42)+IF(ISERROR(J42),0,J42)+IF(ISERROR(L42),0,L42)+IF(ISERROR(N42),0,N42)+IF(ISERROR(P42),0,P42)+IF(ISERROR(R42),0,R42)+IF(ISERROR(T42),0,T42)+IF(ISERROR(V42),0,V42)+IF(ISERROR(X42),0,X42)+IF(ISERROR(Z42),0,Z42)","v":8745}]
["Santana e São Paulo",null,{"$f":"SUMIF(Janeiro!$K$6:$R$77,A43,Janeiro!$O$6:$O$77)","v":0},{"$f":"SUMIF(Janeiro!$K$6:$R$77,A43,Janeiro!$R$6:$R$77)","v":0},{"$f":"SUMIF(Fevereiro!$K$6:$R$77,A43,Fevereiro!$O$6:$O$77)","v":0},{"$f":"SUMIF(Fevereiro!$K$6:$R$77,A43,Fevereiro!$R$6:$R$77)","v":0},{"$f":"SUMIF(Março!$K$6:$R$80,A43,Março!$O$6:$O$80)","v":0},{"$f":"SUMIF(Março!$K$6:$R$80,A43,Março!$R$6:$R$80)","v":0},{"$f":"SUMIF(Abril!$K$6:$R$80,A43,Abril!$O$6:$O$80)","v":0},{"$f":"SUMIF(Abril!$K$6:$R$80,A43,Abril!$R$6:$R$80)","v":0},{"$f":"SUMIF(Maio!$K$6:$R$80,A43,Maio!$O$6:$O$80)","v":0},{"$f":"SUMIF(Maio!$K$6:$R$80,A43,Maio!$R$6:$R$80)","v":0},{"$f":"SUMIF(Junho!$K$6:$R$80,A43,Junho!$O$6:$O$80)","v":0},{"$f":"SUMIF(Junho!$K$6:$R$80,A43,Junho!$R$6:$R$80)","v":0},{"$f":"SUMIF(Julho!$K$6:$R$80,A43,Julho!$O$6:$O$80)","v":0},{"$f":"SUMIF(Julho!$K$6:$R$80,A43,Julho!$R$6:$R$80)","v":0},{"$f":"SUMIF([1]Agosto!$K$6:$R$80,A43,[1]Agosto!$O$6:$O$80)","v":{"$error":"#VALUE!"}},{"$f":"SUMIF([1]Agosto!$K$6:$R$80,A43,[1]Agosto!$R$6:$R$80)","v":{"$error":"#VALUE!"}},{"$f":"SUMIF([2]Setembro!$K$6:$R$80,A43,[2]Setembro!$O$6:$O$80)","v":{"$error":"#VALUE!"}},{"$f":"SUMIF([2]Setembro!$K$6:$R$80,A43,[2]Setembro!$R$6:$R$80)","v":{"$error":"#VALUE!"}},{"$f":"SUMIF([4]Outubro!$K$6:$R$80,A43,[4]Outubro!$O$6:$O$80)","v":{"$error":"#VALUE!"}},{"$f":"SUMIF([4]Outubro!$K$6:$R$80,A43,[4]Outubro!$R$6:$R$80)","v":{"$error":"#VALUE!"}},{"$f":"SUMIF([5]Novembro!$K$6:$R$80,A43,[5]Novembro!$O$6:$O$80)","v":{"$error":"#VALUE!"}},{"$f":"SUMIF([5]Novembro!$K$6:$R$80,A43,[5]Novembro!$R$6:$R$80)","v":{"$error":"#VALUE!"}},{"$f":"SUMIF([6]Dezembro!$K$6:$R$80,D43,[6]Dezembro!$O$6:$O$80)","v":{"$error":"#VALUE!"}},{"$f":"SUMIF([6]Dezembro!$K$6:$R$80,D43,[6]Dezembro!$R$6:$R$80)","v":{"$error":"#VALUE!"}},0,0]
["São João",null,{"$f":"SUMIF(Janeiro!$K$6:$R$77,A44,Janeiro!$O$6:$O$77)","v":0},{"$f":"SUMIF(Janeiro!$K$6:$R$77,A44,Janeiro!$R$6:$R$77)","v":0},{"$f":"SUMIF(Fevereiro!$K$6:$R$77,A44,Fevereiro!$O$6:$O$77)","v":0},{"$f":"SUMIF(Fevereiro!$K$6:$R$77,A44,Fevereiro!$R$6:$R$77)","v":0},{"$f":"SUMIF(Março!$K$6:$R$80,A44,Março!$O$6:$O$80)","v":0},{"$f":"SUMIF(Março!$K$6:$R$80,A44,Março!$R$6:$R$80)","v":0},{"$f":"SUMIF(Abril!$K$6:$R$80,A44,Abril!$O$6:$O$80)","v":0},{"$f":"SUMIF(Abril!$K$6:$R$80,A44,Abril!$R$6:$R$80)","v":0},{"$f":"SUMIF(Maio!$K$6:$R$80,A44,Maio!$O$6:$O$80)","v":0},{"$f":"SUMIF(Maio!$K$6:$R$80,A44,Maio!$R$6:$R$80)","v":0},{"$f":"SUMIF(Junho!$K$6:$R$80,A44,Junho!$O$6:$O$80)","v":0},{"$f":"SUMIF(Junho!$K$6:$R$80,A44,Junho!$R$6:$R$80)","v":0},{"$f":"SUMIF(Julho!$K$6:$R$80,A44,Julho!$O$6:$O$80)","v":0},{"$f":"SUMIF(Julho!$K$6:$R$80,A44,Julho!$R$6:$R$80)","v":0},{"$f":"SUMIF([1]Agosto!$K$6:$R$80,A44,[1]Agosto!$O$6:$O$80)","v":{"$error":"#VALUE!"}},{"$f":"SUMIF([1]Agosto!$K$6:$R$80,A44,[1]Agosto!$R$6:$R$80)","v":{"$error":"#VALUE!"}},{"$f":"SUMIF([2]Setembro!$K$6:$R$80,A44,[2]Setembro!$O$6:$O$80)","v":{"$error":"#VALUE!"}},{"$f":"SUMIF([2]Setembro!$K$6:$R$80,A44,[2]Setembro!$R$6:$R$80)","v":{"$error":"#VALUE!"}},{"$f":"SUMIF([4]Outubro!$K$6:$R$80,A44,[4]Outubro!$O$6:$O$80)","v":{"$error":"#VALUE!"}},{"$f":"SUMIF([4]Outubro!$K$6:$R$80,A44,[4]Outubro!$R$6:$R$80)","v":{"$error":"#VALUE!"}},{"$f":"SUMIF([5]Novembro!$K$6:$R$80,A44,[5]Novembro!$O$6:$O$80)","v":{"$error":"#VALUE!"}},{"$f":"SUMIF([5]Novembro!$K$6:$R$80,A44,[5]Novembro!$R$6:$R$80)","v":{"$error":"#VALUE!"}},{"$f":"SUMIF([6]Dezembro!$K$6:$R$80,D44,[6]Dezembro!$O$6:$O$80)","v":{"$error":"#VALUE!"}},{"$f":"SUMIF([6]Dezembro!$K$6:$R$80,D44,[6]Dezembro!$R$6:$R$80)","v":{"$error":"#VALUE!"}},0,0]
["Vera Cruz Transportes",null,{"$f":"SUMIF(Janeiro!$K$6:$R$77,A45,Janeiro!$O$6:$O$77)","v":0},{"$f":"SUMIF(Janeiro!$K$6:$R$77,A45,Janeiro!$R$6:$R$77)","v":0},{"$f":"SUMIF(Fevereiro!$K$6:$R$77,A45,Fevereiro!$O$6:$O$77)","v":0},{"$f":"SUMIF(Fevereiro!$K$6:$R$77,A45,Fevereiro!$R$6:$R$77)","v":0},{"$f":"SUMIF(Março!$K$6:$R$80,A45,Março!$O$6:$O$80)","v":0},{"$f":"SUMIF(Março!$K$6:$R$80,A45,Março!$R$6:$R$80)","v":0},{"$f":"SUMIF(Abril!$K$6:$R$80,A45,Abril!$O$6:$O$80)","v":38},{"$f":"SUMIF(Abril!$K$6:$R$80,A45,Abril!$R$6:$R$80)","v":195.7},{"$f":"SUMIF(Maio!$K$6:$R$80,A45,Maio!$O$6:$O$80)","v":0},{"$f":"SUMIF(Maio!$K$6:$R$80,A45,Maio!$R$6:$R$80)","v":0},{"$f":"SUMIF(Junho!$K$6:$R$80,A45,Junho!$O$6:$O$80)","v":0},{"$f":"SUMIF(Junho!$K$6:$R$80,A45,Junho!$R$6:$R$80)","v":0},{"$f":"SUMIF(Julho!$K$6:$R$80,A45,Julho!$O$6:$O$80)","v":0},{"$f":"SUMIF(Julho!$K$6:$R$80,A45,Julho!$R$6:$R$80)","v":0},{"$f":"SUMIF([1]Agosto!$K$6:$R$80,A45,[1]Agosto!$O$6:$O$80)","v":{"$error":"#VALUE!"}},{"$f":"SUMIF([1]Agosto!$K$6:$R$80,A45,[1]Agosto!$R$6:$R$80)","v":{"$error":"#VALUE!"}},{"$f":"SUMIF([2]Setembro!$K$6:$R$80,A45,[2]Setembro!$O$6:$O$80)","v":{"$error":"#VALUE!"}},{"$f":"SUMIF([2]Setembro!$K$6:$R$80,A45,[2]Setembro!$R$6:$R$80)","v":{"$error":"#VALUE!"}},{"$f":"SUMIF([4]Outubro!$K$6:$R$80,A45,[4]Outubro!$O$6:$O$80)","v":{"$error":"#VALUE!"}},{"$f":"SUMIF([4]Outubro!$K$6:$R$80,A45,[4]Outubro!$R$6:$R$80)","v":{"$error":"#VALUE!"}},{"$f":"SUMIF([5]Novembro!$K$6:$R$80,A45,[5]Novembro!$O$6:$O$80)","v":{"$error":"#VALUE!"}},{"$f":"SUMIF([5]Novembro!$K$6:$R$80,A45,[5]Novembro!$R$6:$R$80)","v":{"$error":"#VALUE!"}},{"$f":"SUMIF([6]Dezembro!$K$6:$R$80,D45,[6]Dezembro!$O$6:$O$80)","v":{"$error":"#VALUE!"}},{"$f":"SUMIF([6]Dezembro!$K$6:$R$80,D45,[6]Dezembro!$R$6:$R$80)","v":{"$error":"#VALUE!"}},38,195.7]
[]
["Matrícula","Empregado","Quant. Total","Vlr. Total","Quant. Total","Vlr. Total","Quant. Total","Vlr. Total","Quant. Total","Vlr. Total","Quant. Total","Vlr. Total","Quant. Total","Vlr. Total","Quant. Total","Vlr. Total","Quant. Total","Vlr. Total","Quant. Total","Vlr. Total","Quant. Total","Vlr. Total","Quant. Total","Vlr. Total","Quant. Total","Vlr. Total","Quant. Total","Vlr. Total"]
[97144,"Júlio Cesar Santana",{"$f":"SUMIF(Janeiro!$B$6:$R$77,B48,Janeiro!$O$6:$O$77)","v":0},{"$f":"SUMIF(Janeiro!$B$6:$R$80,B48,Janeiro!$R$6:$R$80)","v":0},{"$f":"SUMIF(Fevereiro!$A$6:$R$77,A48,Fevereiro!$O$6:$O$77)","v":0},{"$f":"SUMIF(Fevereiro!$A$6:$R$77,A48,Fevereiro!$R$6:$R$77)","v":0},{"$f":"SUMIF(Março!$A$6:$R$80,A48,Março!$O$6:$O$80)","v":0},{"$f":"SUMIF(Março!$A$6:$R$80,A48,Março!$R$6:$R$80)","v":0},{"$f":"SUMIF(Abril!$A$6:$R$80,A48,Abril!$O$6:$O$80)","v":0},{"$f":"SUMIF(Abril!$A$6:$R$80,A48,Abril!$R$6:$R$80)","v":0},{"$f":"SUMIF(Maio!$A$6:$R$80,A48,Maio!$O$6:$O$80)","v":0},{"$f":"SUMIF(Maio!$A$6:$R$80,A48,Maio!$R$6:$R$80)","v":0},{"$f":"SUMIF(Junho!$A$6:$R$80,A48,Junho!$O$6:$O$80)","v":0},{"$f":"SUMIF(Junho!$A$6:$R$80,A48,Junho!$R$6:$R$80)","v":0},{"$f":"SUMIF(Julho!$A$6:$R$80,A48,Julho!$O$6:$O$80)","v":0},{"$f":"SUMIF(Julho!$A$6:$R$80,A48,Julho!$R$6:$R$80)","v":0},{"$f":"SUMIF([1]Agosto!$A$6:$R$80,A48,[1]Agosto!$O$6:$O$80)","v":{"$error":"#VALUE!"}},{"$f":"SUMIF([1]Agosto!$A$6:$R$80,A48,[1]Agosto!$R$6:$R$80)","v":{"$error":"#VALUE!"}},{"$f":"SUMIF([2]Setembro!$A$6:$R$80,A48,[2]Setembro!$O$6:$O$80)","v":{"$error":"#VALUE!"}},{"$f":"SUMIF([2]Setembro!$A$6:$R$80,A48,[2]Setembro!$R$6:$R$80)","v":{"$error":"#VALUE!"}},{"$f":"SUMIF([4]Outubro!$A$6:$R$80,A48,[4]Outubro!$O$6:$O$80)","v":{"$error":"#VALUE!"}},{"$f":"SUMIF([4]Outubro!$A$6:$R$80,A48,[4]Outubro!$R$6:$R$80)","v":{"$error":"#VALUE!"}},{"$f":"SUMIF([5]Novembro!$A$6:$R$80,A48,[5]Novembro!$O$6:$O$80)","v":{"$error":"#VALUE!"}},{"$f":"SUMIF([5]Novembro!$A$6:$R$80,A48,[5]Novembro!$R$6:$R$80)","v":{"$error":"#VALUE!"}},{"$f":"SUMIF([6]Dezembro!$A$6:$R$80,C48,[6]Dezembro!$O$6:$O$80)","v":{"$error":"#VALUE!"}},{"$f":"SUMIF([6]Dezembro!$A$6:$R$80,C48,[6]Dezembro!$R$6:$R$80)","v":{"$error":"#VALUE!"}},{"$f":"IF(ISERROR(C48),0,C48)+IF(ISERROR(E48),0,E48)+IF(ISERROR(G48),0,G48)+IF(ISERROR(I48),0,I48)+IF(ISERROR(K48),0,K48)+IF(ISERROR(M48),0,M48)+IF(ISERROR(O48),0,O48)+IF(ISERROR(Q48),0,Q48)+IF(ISERROR(S48),0,S48)+IF(ISERROR(U48),0,U48)+IF(ISERROR(W48),0,W48)+IF(ISERROR(Y48),0,Y48)","v":0},{"$f":"IF(ISERROR(D48),0,D48)+IF(ISERROR(F48),0,F48)+IF(ISERROR(H48),0,H48)+IF(ISERROR(J48),0,J48)+IF(ISERROR(L48),0,L48)+IF(ISERROR(N48),0,N48)+IF(ISERROR(P48),0,P48)+IF(ISERROR(R48),0,R48)+IF(ISERROR(T48),0,T48)+IF(ISERROR(V48),0,V48)+IF(ISERROR(X48),0,X48)+IF(ISERROR(Z48),0,Z48)","v":0}]
[187038,"João Neris",{"$f":"SUMIF(Janeiro!$B$6:$R$77,B49,Janeiro!$O$6:$O$77)","v":0},{"$f":"SUMIF(Janeiro!$B$6:$R$80,B49,Janeiro!$R$6:$R$80)","v":0},{"$f":"SUMIF(Fevereiro!$A$6:$R$77,A49,Fevereiro!$O$6:$O$77)","v":0},{"$f":"SUMIF(Fevereiro!$A$6:$R$77,A49,Fevereiro!$R$6:$R$77)","v":0},{"$f":"SUMIF(Março!$A$6:$R$80,A49,Março!$O$6:$O$80)","v":0},{"$f":"SUMIF(Março!$A$6:$R$80,A49,Março!$R$6:$R$80)","v":0},{"$f":"SUMIF(Abril!$A$6:$R$80,A49,Abril!$O$6:$O$80)","v":0},{"$f":"SUMIF(Abril!$A$6:$R$80,A49,Abril!$R$6:$R$80)","v":0},{"$f":"SUMIF(Maio!$A$6:$R$80,A49,Maio!$O$6:$O$80)","v":0},{"$f":"SUMIF(Maio!$A$6:$R$80,A49,Maio!$R$6:$R$80)","v":0},{"$f":"SUMIF(Junho!$A$6:$R$80,A49,Junho!$O$6:$O$80)","v":0},{"$f":"SUMIF(Junho!$A$6:$R$80,A49,Junho!$R$6:$R$80)","v":0},{"$f":"SUMIF(Julho!$A$6:$R$80,A49,Julho!$O$6:$O$80)","v":0},{"$f":"SUMIF(Julho!$A$6:$R$80,A49,Julho!$R$6:$R$80)","v":0},{"$f":"SUMIF([1]Agosto!$A$6:$R$80,A49,[1]Agosto!$O$6:$O$80)","v":{"$error":"#VALUE!"}},{"$f":"SUMIF([1]Agosto!$A$6:$R$80,A49,[1]Agosto!$R$6:$R$80)","v":{"$error":"#VALUE!"}},{"$f":"SUMIF([2]Setembro!$A$6:$R$80,A49,[2]Setembro!$O$6:$O$80)","v":{"$error":"#VALUE!"}},{"$f":"SUMIF([2]Setembro!$A$6:$R$80,A49,[2]Setembro!$R$6:$R$80)","v":{"$error":"#VALUE!"}},{"$f":"SUMIF([4]Outubro!$A$6:$R$80,A49,[4]Outubro!$O$6:$O$80)","v":{"$error":"#VALUE!"}},{"$f":"SUMIF([4]Outubro!$A$6:$R$80,A49,[4]Outubro!$R$6:$R$80)","v":{"$error":"#VALUE!"}},{"$f":"SUMIF([5]Novembro!$A$6:$R$80,A49,[5]Novembro!$O$6:$O$80)","v":{"$error":"#VALUE!"}},{"$f":"SUMIF([5]Novembro!$A$6:$R$80,A49,[5]Novembro!$R$6:$R$80)","v":{"$error":"#VALUE!"}},{"$f":"SUMIF([6]Dezembro!$A$6:$R$80,C49,[6]Dezembro!$O$6:$O$80)","v":{"$error":"#VALUE!"}},{"$f":"SUMIF([6]Dezembro!$A$6:$R$80,C49,[6]Dezembro!$R$6:$R$80)","v":{"$error":"#VALUE!"}},0,0]
[203610,"Jair Neris",{"$f":"SUMIF(Janeiro!$B$6:$R$77,B50,Janeiro!$O$6:$O$77)","v":0},{"$f":"SUMIF(Janeiro!$B$6:$R$80,B50,Janeiro!$R$6:$R$80)","v":0},{"$f":"SUMIF(Fevereiro!$A$6:$R$77,A50,Fevereiro!$O$6:$O$77)","v":0},{"$f":"SUMIF(Fevereiro!$A$6:$R$77,A50,Fevereiro!$R$6:$R$77)","v":0},{"$f":"SUMIF(Março!$A$6:$R$80,A50,Março!$O$6:$O$80)","v":0},{"$f":"SUMIF(Março!$A$6:$R$80,A50,Março!$R$6:$R$80)","v":0},{"$f":"SUMIF(Abril!$A$6:$R$80,A50,Abril!$O$6:$O$80)","v":0},{"$f":"SUMIF(Abril!$A$6:$R$80,A50,Abril!$R$6:$R$80)","v":0},{"$f":"SUMIF(Maio!$A$6:$R$80,A50,Maio!$O$6:$O$80)","v":0},{"$f":"SUMIF(Maio!$A$6:$R$80,A50,Maio!$R$6:$R$80)","v":0},{"$f":"SUMIF(Junho!$A$6:$R$80,A50,Junho!$O$6:$O$80)","v":0},{"$f":"SUMIF(Junho!$A$6:$R$80,A50,Junho!$R$6:$R$80)","v":0},{"$f":"SUMIF(Julho!$A$6:$R$80,A50,Julho!$O$6:$O$80)","v":0},{"$f":"SUMIF(Julho!$A$6:$R$80,A50,Julho!$R$6:$R$80)","v":0},{"$f":"SUMIF([1]Agosto!$A$6:$R$80,A50,[1]Agosto!$O$6:$O$80)","v":{"$error":"#VALUE!"}},{"$f":"SUMIF([1]Agosto!$A$6:$R$80,A50,[1]Agosto!$R$6:$R$80)","v":{"$error":"#VALUE!"}},{"$f":"SUMIF([2]Setembro!$A$6:$R$80,A50,[2]Setembro!$O$6:$O$80)","v":{"$error":"#VALUE!"}},{"$f":"SUMIF([2]Setembro!$A$6:$R$80,A50,[2]Setembro!$R$6:$R$80)","v":{"$error":"#VALUE!"}},{"$f":"SUMIF([4]Outubro!$A$6:$R$80,A50,[4]Outubro!$O$6:$O$80)","v":{"$error":"#VALUE!"}},{"$f":"SUMIF([4]Outubro!$A$6:$R$80,A50,[4]Outubro!$R$6:$R$80)","v":{"$error":"#VALUE!"}},{"$f":"SUMIF([5]Novembro!$A$6:$R$80,A50,[5]Novembro!$O$6:$O$80)","v":{"$error":"#VALUE!"}},{"$f":"SUMIF([5]Novembro!$A$6:$R$80,A50,[5]Novembro!$R$6:$R$80)","v":{"$error":"#VALUE!"}},{"$f":"SUMIF([6]Dezembro!$A$6:$R$80,C50,[6]Dezembro!$O$6:$O$80)","v":{"$error":"#VALUE!"}},{"$f":"SUMIF([6]Dezembro!$A$6:$R$80,C50,[6]Dezembro!$R$6:$R$80)","v":{"$error":"#VALUE!"}},0,0]
[171689,"Antonio Nascimento Barbosa de Lima",{"$f":"SUMIF(Janeiro!$B$6:$R$77,B51,Janeiro!$O$6:$O$77)","v":0},{"$f":"SUMIF(Janeiro!$B$6:$R$80,B51,Janeiro!$R$6:$R$80)","v":0},{"$f":"SUMIF(Fevereiro!$A$6:$R$77,A51,Fevereiro!$O$6:$O$77)","v":0},{"$f":"SUMIF(Fevereiro!$A$6:$R$77,A51,Fevereiro!$R$6:$R$77)","v":0},{"$f":"SUMIF(Março!$A$6:$R$80,A51,Março!$O$6:$O$80)","v":0},{"$f":"SUMIF(Março!$A$6:$R$80,A51,Março!$R$6:$R$80)","v":0},{"$f":"SUMIF(Abril!$A$6:$R$80,A51,Abril!$O$6:$O$80)","v":0},{"$f":"SUMIF(Abril!$A$6:$R$80,A51,Abril!$R$6:$R$80)","v":0},{"$f":"SUMIF(Maio!$A$6:$R$80,A51,Maio!$O$6:$O$80)","v":0},{"$f":"SUMIF(Maio!$A$6:$R$80,A51,Maio!$R$6:$R$80)","v":0},{"$f":"SUMIF(Junho!$A$6:$R$80,A51,Junho!$O$6:$O$80)","v":0},{"$f":"SUMIF(Junho!$A$6:$R$80,A51,Junho!$R$6:$R$80)","v":0},{"$f":"SUMIF(Julho!$A$6:$R$80,A51,Julho!$O$6:$O$80)","v":0},{"$f":"SUMIF(Julho!$A$6:$R$80,A51,Julho!$R$6:$R$80)","v":0},{"$f":"SUMIF([1]Agosto!$A$6:$R$80,A51,[1]Agosto!$O$6:$O$80)","v":{"$error":"#VALUE!"}},{"$f":"SUMIF([1]Agosto!$A$6:$R$80,A51,[1]Agosto!$R$6:$R$80)","v":{"$error":"#VALUE!"}},{"$f":"SUMIF([2]Setembro!$A$6:$R$80,A51,[2]Setembro!$O$6:$O$80)","v":{"$error":"#VALUE!"}},{"$f":"SUMIF([2]Setembro!$A$6:$R$80,A51,[2]Setembro!$R$6:$R$80)","v":{"$error":"#VALUE!"}},{"$f":"SUMIF([4]Outubro!$A$6:$R$80,A51,[4]Outubro!$O$6:$O$80)","v":{"$error":"#VALUE!"}},{"$f":"SUMIF([4]Outubro!$A$6:$R$80,A51,[4]Outubro!$R$6:$R$80)","v":{"$error":"#VALUE!"}},{"$f":"SUMIF([5]Novembro!$A$6:$R$80,A51,[5]Novembro!$O$6:$O$80)","v":{"$error":"#VALUE!"}},{"$f":"SUMIF([5]Novembro!$A$6:$R$80,A51,[5]Novembro!$R$6:$R$80)","v":{"$error":"#VALUE!"}},{"$f":"SUMIF([6]Dezembro!$A$6:$R$80,C51,[6]Dezembro!$O$6:$O$80)","v":{"$error":"#VALUE!"}},{"$f":"SUMIF([6]Dezembro!$A$6:$R$80,C51,[6]Dezembro!$R$6:$R$80)","v":{"$error":"#VALUE!"}},0,0]
[252700,"Manuela Dativo das Chagas",{"$f":"SUMIF(Janeiro!$B$6:$R$77,B52,Janeiro!$O$6:$O$77)","v":0},{"$f":"SUMIF(Janeiro!$B$6:$R$80,B52,Janeiro!$R$6:$R$80)","v":0},{"$f":"SUMIF(Fevereiro!$A$6:$R$77,A52,Fevereiro!$O$6:$O$77)","v":0},{"$f":"SUMIF(Fevereiro!$A$6:$R$77,A52,Fevereiro!$R$6:$R$77)","v":0},{"$f":"SUMIF(Março!$A$6:$R$80,A52,Março!$O$6:$O$80)","v":0},{"$f":"SUMIF(Março!$A$6:$R$80,A52,Março!$R$6:$R$80)","v":0},{"$f":"SUMIF(Abril!$A$6:$R$80,A52,Abril!$O$6:$O$80)","v":0},{"$f":"SUMIF(Abril!$A$6:$R$80,A52,Abril!$R$6:$R$80)","v":0},{"$f":"SUMIF(Maio!$A$6:$R$80,A52,Maio!$O$6:$O$80)","v":0},{"$f":"SUMIF(Maio!$A$6:$R$80,A52,Maio!$R$6:$R$80)","v":0},{"$f":"SUMIF(Junho!$A$6:$R$80,A52,Junho!$O$6:$O$80)","v":0},{"$f":"SUMIF(Junho!$A$6:$R$80,A52,Junho!$R$6:$R$80)","v":0},{"$f":"SUMIF(Julho!$A$6:$R$80,A52,Julho!$O$6:$O$80)","v":0},{"$f":"SUMIF(Julho!$A$6:$R$80,A52,Julho!$R$6:$R$80)","v":0},{"$f":"SUMIF([1]Agosto!$A$6:$R$80,A52,[1]Agosto!$O$6:$O$80)","v":{"$error":"#VALUE!"}},{"$f":"SUMIF([1]Agosto!$A$6:$R$80,A52,[1]Agosto!$R$6:$R$80)","v":{"$error":"#VALUE!"}},{"$f":"SUMIF([2]Setembro!$A$6:$R$80,A52,[2]Setembro!$O$6:$O$80)","v":{"$error":"#VALUE!"}},{"$f":"SUMIF([2]Setembro!$A$6:$R$80,A52,[2]Setembro!$R$6:$R$80)","v":{"$error":"#VALUE!"}},{"$f":"SUMIF([4]Outubro!$A$6:$R$80,A52,[4]Outubro!$O$6:$O$80)","v":{"$error":"#VALUE!"}},{"$f":"SUMIF([4]Outubro!$A$6:$R$80,A52,[4]Outubro!$R$6:$R$80)","v":{"$error":"#VALUE!"}},{"$f":"SUMIF([5]Novembro!$A$6:$R$80,A52,[5]Novembro!$O$6:$O$80)","v":{"$error":"#VALUE!"}},{"$f":"SUMIF([5]Novembro!$A$6:$R$80,A52,[5]Novembro!$R$6:$R$80)","v":{"$error":"#VALUE!"}},{"$f":"SUMIF([6]Dezembro!$A$6:$R$80,C52,[6]Dezembro!$O$6:$O$80)","v":{"$error":"#VALUE!"}},{"$f":"SUMIF([6]Dezembro!$A$6:$R$80,C52,[6]Dezembro!$R$6:$R$80)","v":{"$error":"#VALUE!"}},0,0]
[252719,"Jainara Dativo Batista",{"$f":"SUMIF(Janeiro!$B$6:$R$77,B53,Janeiro!$O$6:$O$77)","v":0},{"$f":"SUMIF(Janeiro!$B$6:$R$80,B53,Janeiro!$R$6:$R$80)","v":0},{"$f":"SUMIF(Fevereiro!$A$6:$R$77,A53,Fevereiro!$O$6:$O$77)","v":0},{"$f":"SUMIF(Fevereiro!$A$6:$R$77,A53,Fevereiro!$R$6:$R$77)","v":0},{"$f":"SUMIF(Março!$A$6:$R$80,A53,Março!$O$6:$O$80)","v":0},{"$f":"SUMIF(Março!$A$6:$R$80,A53,Março!$R$6:$R$80)","v":0},{"$f":"SUMIF(Abril!$A$6:$R$80,A53,Abril!$O$6:$O$80)","v":0},{"$f":"SUMIF(Abril!$A$6:$R$80,A53,Abril!$R$6:$R$80)","v":0},{"$f":"SUMIF(Maio!$A$6:$R$80,A53,Maio!$O$6:$O$80)","v":0},{"$f":"SUMIF(Maio!$A$6:$R$80,A53,Maio!$R$6:$R$80)","v":0},{"$f":"SUMIF(Junho!$A$6:$R$80,A53,Junho!$O$6:$O$80)","v":0},{"$f":"SUMIF(Junho!$A$6:$R$80,A53,Junho!$R$6:$R$80)","v":0},{"$f":"SUMIF(Julho!$A$6:$R$80,A53,Julho!$O$6:$O$80)","v":0},{"$f":"SUMIF(Julho!$A$6:$R$80,A53,Julho!$R$6:$R$80)","v":0},{"$f":"SUMIF([1]Agosto!$A$6:$R$80,A53,[1]Agosto!$O$6:$O$80)","v":{"$error":"#VALUE!"}},{"$f":"SUMIF([1]Agosto!$A$6:$R$80,A53,[1]Agosto!$R$6:$R$80)","v":{"$error":"#VALUE!"}},{"$f":"SUMIF([2]Setembro!$A$6:$R$80,A53,[2]Setembro!$O$6:$O$80)","v":{"$error":"#VALUE!"}},{"$f":"SUMIF([2]Setembro!$A$6:$R$80,A53,[2]Setembro!$R$6:$R$80)","v":{"$error":"#VALUE!"}},{"$f":"SUMIF([4]Outubro!$A$6:$R$80,A53,[4]Outubro!$O$6:$O$80)","v":{"$error":"#VALUE!"}},{"$f":"SUMIF([4]Outubro!$A$6:$R$80,A53,[4]Outubro!$R$6:$R$80)","v":{"$error":"#VALUE!"}},{"$f":"SUMIF([5]Novembro!$A$6:$R$80,A53,[5]Novembro!$O$6:$O$80)","v":{"$error":"#VALUE!"}},{"$f":"SUMIF([5]Novembro!$A$6:$R$80,A53,[5]Novembro!$R$6:$R$80)","v":{"$error":"#VALUE!"}},{"$f":"SUMIF([6]Dezembro!$A$6:$R$80,C53,[6]Dezembro!$O$6:$O$80)","v":{"$error":"#VALUE!"}},{"$f":"SUMIF([6]Dezembro!$A$6:$R$80,C53,[6]Dezembro!$R$6:$R$80)","v":{"$error":"#VALUE!"}},0,0]
[252670,"Thiago Teles Silva",{"$f":"SUMIF(Janeiro!$B$6:$R$77,B54,Janeiro!$O$6:$O$77)","v":0},{"$f":"SUMIF(Janeiro!$B$6:$R$80,B54,Janeiro!$R$6:$R$80)","v":0},{"$f":"SUMIF(Fevereiro!$A$6:$R$77,A54,Fevereiro!$O$6:$O$77)","v":0},{"$f":"SUMIF(Fevereiro!$A$6:$R$77,A54,Fevereiro!$R$6:$R$77)","v":0},{"$f":"SUMIF(Março!$A$6:$R$80,A54,Março!$O$6:$O$80)","v":0},{"$f":"SUMIF(Março!$A$6:$R$80,A54,Março!$R$6:$R$80)","v":0},{"$f":"SUMIF(Abril!$A$6:$R$80,A54,Abril!$O$6:$O$80)","v":0},{"$f":"SUMIF(Abril!$A$6:$R$80,A54,Abril!$R$6:$R$80)","v":0},{"$f":"SUMIF(Maio!$A$6:$R$80,A54,Maio!$O$6:$O$80)","v":0},{"$f":"SUMIF(Maio!$A$6:$R$80,A54,Maio!$R$6:$R$80)","v":0},{"$f":"SUMIF(Junho!$A$6:$R$80,A54,Junho!$O$6:$O$80)","v":0},{"$f":"SUMIF(Junho!$A$6:$R$80,A54,Junho!$R$6:$R$80)","v":0},{"$f":"SUMIF(Julho!$A$6:$R$80,A54,Julho!$O$6:$O$80)","v":0},{"$f":"SUMIF(Julho!$A$6:$R$80,A54,Julho!$R$6:$R$80)","v":0},{"$f":"SUMIF([1]Agosto!$A$6:$R$80,A54,[1]Agosto!$O$6:$O$80)","v":{"$error":"#VALUE!"}},{"$f":"SUMIF([1]Agosto!$A$6:$R$80,A54,[1]Agosto!$R$6:$R$80)","v":{"$error":"#VALUE!"}},{"$f":"SUMIF([2]Setembro!$A$6:$R$80,A54,[2]Setembro!$O$6:$O$80)","v":{"$error":"#VALUE!"}},{"$f":"SUMIF([2]Setembro!$A$6:$R$80,A54,[2]Setembro!$R$6:$R$80)","v":{"$error":"#VALUE!"}},{"$f":"SUMIF([4]Outubro!$A$6:$R$80,A54,[4]Outubro!$O$6:$O$80)","v":{"$error":"#VALUE!"}},{"$f":"SUMIF([4]Outubro!$A$6:$R$80,A54,[4]Outubro!$R$6:$R$80)","v":{"$error":"#VALUE!"}},{"$f":"SUMIF([5]Novembro!$A$6:$R$80,A54,[5]Novembro!$O$6:$O$80)","v":{"$error":"#VALUE!"}},{"$f":"SUMIF([5]Novembro!$A$6:$R$80,A54,[5]Novembro!$R$6:$R$80)","v":{"$error":"#VALUE!"}},{"$f":"SUMIF([6]Dezembro!$A$6:$R$80,C54,[6]Dezembro!$O$6:$O$80)","v":{"$error":"#VALUE!"}},{"$f":"SUMIF([6]Dezembro!$A$6:$R$80,C54,[6]Dezembro!$R$6:$R$80)","v":{"$error":"#VALUE!"}},0,0]
[252689,"Rafael dos Santos Araújo",{"$f":"SUMIF(Janeiro!$B$6:$R$77,B55,Janeiro!$O$6:$O$77)","v":0},{"$f":"SUMIF(Janeiro!$B$6:$R$80,B55,Janeiro!$R$6:$R$80)","v":0},{"$f":"SUMIF(Fevereiro!$A$6:$R$77,A55,Fevereiro!$O$6:$O$77)","v":0},{"$f":"SUMIF(Fevereiro!$A$6:$R$77,A55,Fevereiro!$R$6:$R$77)","v":0},{"$f":"SUMIF(Março!$A$6:$R$80,A55,Março!$O$6:$O$80)","v":0},{"$f":"SUMIF(Março!$A$6:$R$80,A55,Março!$R$6:$R$80)","v":0},{"$f":"SUMIF(Abril!$A$6:$R$80,A55,Abril!$O$6:$O$80)","v":0},{"$f":"SUMIF(Abril!$A$6:$R$80,A55,Abril!$R$6:$R$80)","v":0},{"$f":"SUMIF(Maio!$A$6:$R$80,A55,Maio!$O$6:$O$80)","v":0},{"$f":"SUMIF(Maio!$A$6:$R$80,A55,Maio!$R$6:$R$80)","v":0},{"$f":"SUMIF(Junho!$A$6:$R$80,A55,Junho!$O$6:$O$80)","v":0},{"$f":"SUMIF(Junho!$A$6:$R$80,A55,Junho!$R$6:$R$80)","v":0},{"$f":"SUMIF(Julho!$A$6:$R$80,A55,Julho!$O$6:$O$80)","v":0},{"$f":"SUMIF(Julho!$A$6:$R$80,A55,Julho!$R$6:$R$80)","v":0},{"$f":"SUMIF([1]Agosto!$A$6:$R$80,A55,[1]Agosto!$O$6:$O$80)","v":{"$error":"#VALUE!"}},{"$f":"SUMIF([1]Agosto!$A$6:$R$80,A55,[1]Agosto!$R$6:$R$80)","v":{"$error":"#VALUE!"}},{"$f":"SUMIF([2]Setembro!$A$6:$R$80,A55,[2]Setembro!$O$6:$O$80)","v":{"$error":"#VALUE!"}},{"$f":"SUMIF([2]Setembro!$A$6:$R$80,A55,[2]Setembro!$R$6:$R$80)","v":{"$error":"#VALUE!"}},{"$f":"SUMIF([4]Outubro!$A$6:$R$80,A55,[4]Outubro!$O$6:$O$80)","v":{"$error":"#VALUE!"}},{"$f":"SUMIF([4]Outubro!$A$6:$R$80,A55,[4]Outubro!$R$6:$R$80)","v":{"$error":"#VALUE!"}},{"$f":"SUMIF([5]Novembro!$A$6:$R$80,A55,[5]Novembro!$O$6:$O$80)","v":{"$error":"#VALUE!"}},{"$f":"SUMIF([5]Novembro!$A$6:$R$80,A55,[5]Novembro!$R$6:$R$80)","v":{"$error":"#VALUE!"}},{"$f":"SUMIF([6]Dezembro!$A$6:$R$80,C55,[6]Dezembro!$O$6:$O$80)","v":{"$error":"#VALUE!"}},{"$f":"SUMIF([6]Dezembro!$A$6:$R$80,C55,[6]Dezembro!$R$6:$R$80)","v":{"$error":"#VALUE!"}},0,0]
[218510,"José Leônio de Goes Guimarães",{"$f":"SUMIF(Janeiro!$B$6:$R$77,B56,Janeiro!$O$6:$O$77)","v":0},{"$f":"SUMIF(Janeiro!$B$6:$R$80,B56,Janeiro!$R$6:$R$80)","v":0},{"$f":"SUMIF(Fevereiro!$A$6:$R$77,A56,Fevereiro!$O$6:$O$77)","v":0},{"$f":"SUMIF(Fevereiro!$A$6:$R$77,A56,Fevereiro!$R$6:$R$77)","v":0},{"$f":"SUMIF(Março!$A$6:$R$80,A56,Março!$O$6:$O$80)","v":0},{"$f":"SUMIF(Março!$A$6:$R$80,A56,Março!$R$6:$R$80)","v":0},{"$f":"SUMIF(Abril!$A$6:$R$80,A56,Abril!$O$6:$O$80)","v":38},{"$f":"SUMIF(Abril!$A$6:$R$80,A56,Abril!$R$6:$R$80)","v":117.8},{"$f":"SUMIF(Maio!$A$6:$R$80,A56,Maio!$O$6:$O$80)","v":0},{"$f":"SUMIF(Maio!$A$6:$R$80,A56,Maio!$R$6:$R$80)","v":0},{"$f":"SUMIF(Junho!$A$6:$R$80,A56,Junho!$O$6:$O$80)","v":0},{"$f":"SUMIF(Junho!$A$6:$R$80,A56,Junho!$R$6:$R$80)","v":0},{"$f":"SUMIF(Julho!$A$6:$R$80,A56,Julho!$O$6:$O$80)","v":0},{"$f":"SUMIF(Julho!$A$6:$R$80,A56,Julho!$R$6:$R$80)","v":0},{"$f":"SUMIF([1]Agosto!$A$6:$R$80,A56,[1]Agosto!$O$6:$O$80)","v":{"$error":"#VALUE!"}},{"$f":"SUMIF([1]Agosto!$A$6:$R$80,A56,[1]Agosto!$R$6:$R$80)","v":{"$error":"#VALUE!"}},{"$f":"SUMIF([2]Setembro!$A$6:$R$80,A56,[2]Setembro!$O$6:$O$80)","v":{"$error":"#VALUE!"}},{"$f":"SUMIF([2]Setembro!$A$6:$R$80,A56,[2]Setembro!$R$6:$R$80)","v":{"$error":"#VALUE!"}},{"$f":"SUMIF([4]Outubro!$A$6:$R$80,A56,[4]Outubro!$O$6:$O$80)","v":{"$error":"#VALUE!"}},{"$f":"SUMIF([4]Outubro!$A$6:$R$80,A56,[4]Outubro!$R$6:$R$80)","v":{"$error":"#VALUE!"}},{"$f":"SUMIF([5]Novembro!$A$6:$R$80,A56,[5]Novembro!$O$6:$O$80)","v":{"$error":"#VALUE!"}},{"$f":"SUMIF([5]Novembro!$A$6:$R$80,A56,[5]Novembro!$R$6:$R$80)","v":{"$error":"#VALUE!"}},{"$f":"SUMIF([6]Dezembro!$A$6:$R$80,C56,[6]Dezembro!$O$6:$O$80)","v":{"$error":"#VALUE!"}},{"$f":"SUMIF([6]Dezembro!$A$6:$R$80,C56,[6]Dezembro!$R$6:$R$80)","v":{"$error":"#VALUE!"}},38,117.8]
[252611,"Jonas Caldas Teodoro",{"$f":"SUMIF(Janeiro!$B$6:$R$77,B57,Janeiro!$O$6:$O$77)","v":0},{"$f":"SUMIF(Janeiro!$B$6:$R$80,B57,Janeiro!$R$6:$R$80)","v":0},{"$f":"SUMIF(Fevereiro!$A$6:$R$77,A57,Fevereiro!$O$6:$O$77)","v":0},{"$f":"SUMIF(Fevereiro!$A$6:$R$77,A57,Fevereiro!$R$6:$R$77)","v":0},{"$f":"SUMIF(Março!$A$6:$R$80,A57,Março!$O$6:$O$80)","v":0},{"$f":"SUMIF(Março!$A$6:$R$80,A57,Março!$R$6:$R$80)","v":0},{"$f":"SUMIF(Abril!$A$6:$R$80,A57,Abril!$O$6:$O$80)","v":0},{"$f":"SUMIF(Abril!$A$6:$R$80,A57,Abril!$R$6:$R$80)","v":0},{"$f":"SUMIF(Maio!$A$6:$R$80,A57,Maio!$O$6:$O$80)","v":0},{"$f":"SUMIF(Maio!$A$6:$R$80,A57,Maio!$R$6:$R$80)","v":0},{"$f":"SUMIF(Junho!$A$6:$R$80,A57,Junho!$O$6:$O$80)","v":0},{"$f":"SUMIF(Junho!$A$6:$R$80,A57,Junho!$R$6:$R$80)","v":0},{"$f":"SUMIF(Julho!$A$6:$R$80,A57,Julho!$O$6:$O$80)","v":0},{"$f":"SUMIF(Julho!$A$6:$R$80,A57,Julho!$R$6:$R$80)","v":0},{"$f":"SUMIF([1]Agosto!$A$6:$R$80,A57,[1]Agosto!$O$6:$O$80)","v":{"$error":"#VALUE!"}},{"$f":"SUMIF([1]Agosto!$A$6:$R$80,A57,[1]Agosto!$R$6:$R$80)","v":{"$error":"#VALUE!"}},{"$f":"SUMIF([2]Setembro!$A$6:$R$80,A57,[2]Setembro!$O$6:$O$80)","v":{"$error":"#VALUE!"}},{"$f":"SUMIF([2]Setembro!$A$6:$R$80,A57,[2]Setembro!$R$6:$R$80)","v":{"$error":"#VALUE!"}},{"$f":"SUMIF([4]Outubro!$A$6:$R$80,A57,[4]Outubro!$O$6:$O$80)","v":{"$error":"#VALUE!"}},{"$f":"SUMIF([4]Outubro!$A$6:$R$80,A57,[4]Outubro!$R$6:$R$80)","v":{"$error":"#VALUE!"}},{"$f":"SUMIF([5]Novembro!$A$6:$R$80,A57,[5]Novembro!$O$6:$O$80)","v":{"$error":"#VALUE!"}},{"$f":"SUMIF([5]Novembro!$A$6:$R$80,A57,[5]Novembro!$R$6:$R$80)","v":{"$error":"#VALUE!"}},{"$f":"SUMIF([6]Dezembro!$A$6:$R$80,C57,[6]Dezembro!$O$6:$O$80)","v":{"$error":"#VALUE!"}},{"$f":"SUMIF([6]Dezembro!$A$6:$R$80,C57,[6]Dezembro!$R$6:$R$80)","v":{"$error":"#VALUE!"}},0,0]
[252603,"Maria Eduarda de Jesus Osório ",{"$f":"SUMIF(Janeiro!$B$6:$R$77,B58,Janeiro!$O$6:$O$77)","v":0},{"$f":"SUMIF(Janeiro!$B$6:$R$80,B58,Janeiro!$R$6:$R$80)","v":0},{"$f":"SUMIF(Fevereiro!$A$6:$R$77,A58,Fevereiro!$O$6:$O$77)","v":0},{"$f":"SUMIF(Fevereiro!$A$6:$R$77,A58,Fevereiro!$R$6:$R$77)","v":0},{"$f":"SUMIF(Março!$A$6:$R$80,A58,Março!$O$6:$O$80)","v":0},{"$f":"SUMIF(Março!$A$6:$R$80,A58,Março!$R$6:$R$80)","v":0},{"$f":"SUMIF(Abril!$A$6:$R$80,A58,Abril!$O$6:$O$80)","v":0},{"$f":"SUMIF(Abril!$A$6:$R$80,A58,Abril!$R$6:$R$80)","v":0},{"$f":"SUMIF(Maio!$A$6:$R$80,A58,Maio!$O$6:$O$80)","v":0},{"$f":"SUMIF(Maio!$A$6:$R$80,A58,Maio!$R$6:$R$80)","v":0},{"$f":"SUMIF(Junho!$A$6:$R$80,A58,Junho!$O$6:$O$80)","v":0},{"$f":"SUMIF(Junho!$A$6:$R$80,A58,Junho!$R$6:$R$80)","v":0},{"$f":"SUMIF(Julho!$A$6:$R$80,A58,Julho!$O$6:$O$80)","v":0},{"$f":"SUMIF(Julho!$A$6:$R$80,A58,Julho!$R$6:$R$80)","v":0},{"$f":"SUMIF([1]Agosto!$A$6:$R$80,A58,[1]Agosto!$O$6:$O$80)","v":{"$error":"#VALUE!"}},{"$f":"SUMIF([1]Agosto!$A$6:$R$80,A58,[1]Agosto!$R$6:$R$80)","v":{"$error":"#VALUE!"}},{"$f":"SUMIF([2]Setembro!$A$6:$R$80,A58,[2]Setembro!$O$6:$O$80)","v":{"$error":"#VALUE!"}},{"$f":"SUMIF([2]Setembro!$A$6:$R$80,A58,[2]Setembro!$R$6:$R$80)","v":{"$error":"#VALUE!"}},{"$f":"SUMIF([4]Outubro!$A$6:$R$80,A58,[4]Outubro!$O$6:$O$80)","v":{"$error":"#VALUE!"}},{"$f":"SUMIF([4]Outubro!$A$6:$R$80,A58,[4]Outubro!$R$6:$R$80)","v":{"$error":"#VALUE!"}},{"$f":"SUMIF([5]Novembro!$A$6:$R$80,A58,[5]Novembro!$O$6:$O$80)","v":{"$error":"#VALUE!"}},{"$f":"SUMIF([5]Novembro!$A$6:$R$80,A58,[5]Novembro!$R$6:$R$80)","v":{"$error":"#VALUE!"}},{"$f":"SUMIF([6]Dezembro!$A$6:$R$80,C58,[6]Dezembro!$O$6:$O$80)","v":{"$error":"#VALUE!"}},{"$f":"SUMIF([6]Dezembro!$A$6:$R$80,C58,[6]Dezembro!$R$6:$R$80)","v":{"$error":"#VALUE!"}},0,0]
[252620,"Michele Santos da Conceição",{"$f":"SUMIF(Janeiro!$B$6:$R$77,B59,Janeiro!$O$6:$O$77)","v":0},{"$f":"SUMIF(Janeiro!$B$6:$R$80,B59,Janeiro!$R$6:$R$80)","v":0},{"$f":"SUMIF(Fevereiro!$A$6:$R$77,A59,Fevereiro!$O$6:$O$77)","v":0},{"$f":"SUMIF(Fevereiro!$A$6:$R$77,A59,Fevereiro!$R$6:$R$77)","v":0},{"$f":"SUMIF(Março!$A$6:$R$80,A59,Março!$O$6:$O$80)","v":0},{"$f":"SUMIF(Março!$A$6:$R$80,A59,Março!$R$6:$R$80)","v":0},{"$f":"SUMIF(Abril!$A$6:$R$80,A59,Abril!$O$6:$O$80)","v":0},{"$f":"SUMIF(Abril!$A$6:$R$80,A59,Abril!$R$6:$R$80)","v":0},{"$f":"SUMIF(Maio!$A$6:$R$80,A59,Maio!$O$6:$O$80)","v":0},{"$f":"SUMIF(Maio!$A$6:$R$80,A59,Maio!$R$6:$R$80)","v":0},{"$f":"SUMIF(Junho!$A$6:$R$80,A59,Junho!$O$6:$O$80)","v":0},{"$f":"SUMIF(Junho!$A$6:$R$80,A59,Junho!$R$6:$R$80)","v":0},{"$f":"SUMIF(Julho!$A$6:$R$80,A59,Julho!$O$6:$O$80)","v":0},{"$f":"SUMIF(Julho!$A$6:$R$80,A59,Julho!$R$6:$R$80)","v":0},{"$f":"SUMIF([1]Agosto!$A$6:$R$80,A59,[1]Agosto!$O$6:$O$80)","v":{"$error":"#VALUE!"}},{"$f":"SUMIF([1]Agosto!$A$6:$R$80,A59,[1]Agosto!$R$6:$R$80)","v":{"$error":"#VALUE!"}},{"$f":"SUMIF([2]Setembro!$A$6:$R$80,A59,[2]Setembro!$O$6:$O$80)","v":{"$error":"#VALUE!"}},{"$f":"SUMIF([2]Setembro!$A$6:$R$80,A59,[2]Setembro!$R$6:$R$80)","v":{"$error":"#VALUE!"}},{"$f":"SUMIF([4]Outubro!$A$6:$R$80,A59,[4]Outubro!$O$6:$O$80)","v":{"$error":"#VALUE!"}},{"$f":"SUMIF([4]Outubro!$A$6:$R$80,A59,[4]Outubro!$R$6:$R$80)","v":{"$error":"#VALUE!"}},{"$f":"SUMIF([5]Novembro!$A$6:$R$80,A59,[5]Novembro!$O$6:$O$80)","v":{"$error":"#VALUE!"}},{"$f":"SUMIF([5]Novembro!$A$6:$R$80,A59,[5]Novembro!$R$6:$R$80)","v":{"$error":"#VALUE!"}},{"$f":"SUMIF([6]Dezembro!$A$6:$R$80,C59,[6]Dezembro!$O$6:$O$80)","v":{"$error":"#VALUE!"}},{"$f":"SUMIF([6]Dezembro!$A$6:$R$80,C59,[6]Dezembro!$R$6:$R$80)","v":{"$error":"#VALUE!"}},0,0]
[252654,"Jade Silva Santos",{"$f":"SUMIF(Janeiro!$B$6:$R$77,B60,Janeiro!$O$6:$O$77)","v":0},{"$f":"SUMIF(Janeiro!$B$6:$R$80,B60,Janeiro!$R$6:$R$80)","v":0},{"$f":"SUMIF(Fevereiro!$A$6:$R$77,A60,Fevereiro!$O$6:$O$77)","v":0},{"$f":"SUMIF(Fevereiro!$A$6:$R$77,A60,Fevereiro!$R$6:$R$77)","v":0},{"$f":"SUMIF(Março!$A$6:$R$80,A60,Março!$O$6:$O$80)","v":0},{"$f":"SUMIF(Março!$A$6:$R$80,A60,Março!$R$6:$R$80)","v":0},{"$f":"SUMIF(Abril!$A$6:$R$80,A60,Abril!$O$6:$O$80)","v":0},{"$f":"SUMIF(Abril!$A$6:$R$80,A60,Abril!$R$6:$R$80)","v":0},{"$f":"SUMIF(Maio!$A$6:$R$80,A60,Maio!$O$6:$O$80)","v":0},{"$f":"SUMIF(Maio!$A$6:$R$80,A60,Maio!$R$6:$R$80)","v":0},{"$f":"SUMIF(Junho!$A$6:$R$80,A60,Junho!$O$6:$O$80)","v":0},{"$f":"SUMIF(Junho!$A$6:$R$80,A60,Junho!$R$6:$R$80)","v":0},{"$f":"SUMIF(Julho!$A$6:$R$80,A60,Julho!$O$6:$O$80)","v":0},{"$f":"SUMIF(Julho!$A$6:$R$80,A60,Julho!$R$6:$R$80)","v":0},{"$f":"SUMIF([1]Agosto!$A$6:$R$80,A60,[1]Agosto!$O$6:$O$80)","v":{"$error":"#VALUE!"}},{"$f":"SUMIF([1]Agosto!$A$6:$R$80,A60,[1]Agosto!$R$6:$R$80)","v":{"$error":"#VALUE!"}},{"$f":"SUMIF([2]Setembro!$A$6:$R$80,A60,[2]Setembro!$O$6:$O$80)","v":{"$error":"#VALUE!"}},{"$f":"SUMIF([2]Setembro!$A$6:$R$80,A60,[2]Setembro!$R$6:$R$80)","v":{"$error":"#VALUE!"}},{"$f":"SUMIF([4]Outubro!$A$6:$R$80,A60,[4]Outubro!$O$6:$O$80)","v":{"$error":"#VALUE!"}},{"$f":"SUMIF([4]Outubro!$A$6:$R$80,A60,[4]Outubro!$R$6:$R$80)","v":{"$error":"#VALUE!"}},{"$f":"SUMIF([5]Novembro!$A$6:$R$80,A60,[5]Novembro!$O$6:$O$80)","v":{"$error":"#VALUE!"}},{"$f":"SUMIF([5]Novembro!$A$6:$R$80,A60,[5]Novembro!$R$6:$R$80)","v":{"$error":"#VALUE!"}},{"$f":"SUMIF([6]Dezembro!$A$6:$R$80,C60,[6]Dezembro!$O$6:$O$80)","v":{"$error":"#VALUE!"}},{"$f":"SUMIF([6]Dezembro!$A$6:$R$80,C60,[6]Dezembro!$R$6:$R$80)","v":{"$error":"#VALUE!"}},0,0]
[252662,"Taiane Silva Cabral",{"$f":"SUMIF(Janeiro!$B$6:$R$77,B61,Janeiro!$O$6:$O$77)","v":0},{"$f":"SUMIF(Janeiro!$B$6:$R$80,B61,Janeiro!$R$6:$R$80)","v":0},{"$f":"SUMIF(Fevereiro!$A$6:$R$77,A61,Fevereiro!$O$6:$O$77)","v":0},{"$f":"SUMIF(Fevereiro!$A$6:$R$77,A61,Fevereiro!$R$6:$R$77)","v":0},{"$f":"SUMIF(Março!$A$6:$R$80,A61,Março!$O$6:$O$80)","v":0},{"$f":"SUMIF(Março!$A$6:$R$80,A61,Março!$R$6:$R$80)","v":0},{"$f":"SUMIF(Abril!$A$6:$R$80,A61,Abril!$O$6:$O$80)","v":0},{"$f":"SUMIF(Abril!$A$6:$R$80,A61,Abril!$R$6:$R$80)","v":0},{"$f":"SUMIF(Maio!$A$6:$R$80,A61,Maio!$O$6:$O$80)","v":0},{"$f":"SUMIF(Maio!$A$6:$R$80,A61,Maio!$R$6:$R$80)","v":0},{"$f":"SUMIF(Junho!$A$6:$R$80,A61,Junho!$O$6:$O$80)","v":0},{"$f":"SUMIF(Junho!$A$6:$R$80,A61,Junho!$R$6:$R$80)","v":0},{"$f":"SUMIF(Julho!$A$6:$R$80,A61,Julho!$O$6:$O$80)","v":0},{"$f":"SUMIF(Julho!$A$6:$R$80,A61,Julho!$R$6:$R$80)","v":0},{"$f":"SUMIF([1]Agosto!$A$6:$R$80,A61,[1]Agosto!$O$6:$O$80)","v":{"$error":"#VALUE!"}},{"$f":"SUMIF([1]Agosto!$A$6:$R$80,A61,[1]Agosto!$R$6:$R$80)","v":{"$error":"#VALUE!"}},{"$f":"SUMIF([2]Setembro!$A$6:$R$80,A61,[2]Setembro!$O$6:$O$80)","v":{"$error":"#VALUE!"}},{"$f":"SUMIF([2]Setembro!$A$6:$R$80,A61,[2]Setembro!$R$6:$R$80)","v":{"$error":"#VALUE!"}},{"$f":"SUMIF([4]Outubro!$A$6:$R$80,A61,[4]Outubro!$O$6:$O$80)","v":{"$error":"#VALUE!"}},{"$f":"SUMIF([4]Outubro!$A$6:$R$80,A61,[4]Outubro!$R$6:$R$80)","v":{"$error":"#VALUE!"}},{"$f":"SUMIF([5]Novembro!$A$6:$R$80,A61,[5]Novembro!$O$6:$O$80)","v":{"$error":"#VALUE!"}},{"$f":"SUMIF([5]Novembro!$A$6:$R$80,A61,[5]Novembro!$R$6:$R$80)","v":{"$error":"#VALUE!"}},{"$f":"SUMIF([6]Dezembro!$A$6:$R$80,C61,[6]Dezembro!$O$6:$O$80)","v":{"$error":"#VALUE!"}},{"$f":"SUMIF([6]Dezembro!$A$6:$R$80,C61,[6]Dezembro!$R$6:$R$80)","v":{"$error":"#VALUE!"}},0,0]
[252697,"Cintia Soares da Silva",{"$f":"SUMIF(Janeiro!$B$6:$R$77,B62,Janeiro!$O$6:$O$77)","v":0},{"$f":"SUMIF(Janeiro!$B$6:$R$80,B62,Janeiro!$R$6:$R$80)","v":0},{"$f":"SUMIF(Fevereiro!$A$6:$R$77,A62,Fevereiro!$O$6:$O$77)","v":0},{"$f":"SUMIF(Fevereiro!$A$6:$R$77,A62,Fevereiro!$R$6:$R$77)","v":0},{"$f":"SUMIF(Março!$A$6:$R$80,A62,Março!$O$6:$O$80)","v":0},{"$f":"SUMIF(Março!$A$6:$R$80,A62,Março!$R$6:$R$80)","v":0},{"$f":"SUMIF(Abril!$A$6:$R$80,A62,Abril!$O$6:$O$80)","v":0},{"$f":"SUMIF(Abril!$A$6:$R$80,A62,Abril!$R$6:$R$80)","v":0},{"$f":"SUMIF(Maio!$A$6:$R$80,A62,Maio!$O$6:$O$80)","v":0},{"$f":"SUMIF(Maio!$A$6:$R$80,A62,Maio!$R$6:$R$80)","v":0},{"$f":"SUMIF(Junho!$A$6:$R$80,A62,Junho!$O$6:$O$80)","v":0},{"$f":"SUMIF(Junho!$A$6:$R$80,A62,Junho!$R$6:$R$80)","v":0},{"$f":"SUMIF(Julho!$A$6:$R$80,A62,Julho!$O$6:$O$80)","v":0},{"$f":"SUMIF(Julho!$A$6:$R$80,A62,Julho!$R$6:$R$80)","v":0},{"$f":"SUMIF([1]Agosto!$A$6:$R$80,A62,[1]Agosto!$O$6:$O$80)","v":{"$error":"#VALUE!"}},{"$f":"SUMIF([1]Agosto!$A$6:$R$80,A62,[1]Agosto!$R$6:$R$80)","v":{"$error":"#VALUE!"}},{"$f":"SUMIF([2]Setembro!$A$6:$R$80,A62,[2]Setembro!$O$6:$O$80)","v":{"$error":"#VALUE!"}},{"$f":"SUMIF([2]Setembro!$A$6:$R$80,A62,[2]Setembro!$R$6:$R$80)","v":{"$error":"#VALUE!"}},{"$f":"SUMIF([4]Outubro!$A$6:$R$80,A62,[4]Outubro!$O$6:$O$80)","v":{"$error":"#VALUE!"}},{"$f":"SUMIF([4]Outubro!$A$6:$R$80,A62,[4]Outubro!$R$6:$R$80)","v":{"$error":"#VALUE!"}},{"$f":"SUMIF([5]Novembro!$A$6:$R$80,A62,[5]Novembro!$O$6:$O$80)","v":{"$error":"#VALUE!"}},{"$f":"SUMIF([5]Novembro!$A$6:$R$80,A62,[5]Novembro!$R$6:$R$80)","v":{"$error":"#VALUE!"}},{"$f":"SUMIF([6]Dezembro!$A$6:$R$80,C62,[6]Dezembro!$O$6:$O$80)","v":{"$error":"#VALUE!"}},{"$f":"SUMIF([6]Dezembro!$A$6:$R$80,C62,[6]Dezembro!$R$6:$R$80)","v":{"$error":"#VALUE!"}},0,0]
[252743,"Esther Paula Pinto Macedo Lima ",{"$f":"SUMIF(Janeiro!$B$6:$R$77,B63,Janeiro!$O$6:$O$77)","v":0},{"$f":"SUMIF(Janeiro!$B$6:$R$80,B63,Janeiro!$R$6:$R$80)","v":0},{"$f":"SUMIF(Fevereiro!$A$6:$R$77,A63,Fevereiro!$O$6:$O$77)","v":0},{"$f":"SUMIF(Fevereiro!$A$6:$R$77,A63,Fevereiro!$R$6:$R$77)","v":0},{"$f":"SUMIF(Março!$A$6:$R$80,A63,Março!$O$6:$O$80)","v":0},{"$f":"SUMIF(Março!$A$6:$R$80,A63,Março!$R$6:$R$80)","v":0},{"$f":"SUMIF(Abril!$A$6:$R$80,A63,Abril!$O$6:$O$80)","v":0},{"$f":"SUMIF(Abril!$A$6:$R$80,A63,Abril!$R$6:$R$80)","v":0},{"$f":"SUMIF(Maio!$A$6:$R$80,A63,Maio!$O$6:$O$80)","v":0},{"$f":"SUMIF(Maio!$A$6:$R$80,A63,Maio!$R$6:$R$80)","v":0},{"$f":"SUMIF(Junho!$A$6:$R$80,A63,Junho!$O$6:$O$80)","v":0},{"$f":"SUMIF(Junho!$A$6:$R$80,A63,Junho!$R$6:$R$80)","v":0},{"$f":"SUMIF(Julho!$A$6:$R$80,A63,Julho!$O$6:$O$80)","v":0},{"$f":"SUMIF(Julho!$A$6:$R$80,A63,Julho!$R$6:$R$80)","v":0},{"$f":"SUMIF([1]Agosto!$A$6:$R$80,A63,[1]Agosto!$O$6:$O$80)","v":{"$error":"#VALUE!"}},{"$f":"SUMIF([1]Agosto!$A$6:$R$80,A63,[1]Agosto!$R$6:$R$80)","v":{"$error":"#VALUE!"}},{"$f":"SUMIF([2]Setembro!$A$6:$R$80,A63,[2]Setembro!$O$6:$O$80)","v":{"$error":"#VALUE!"}},{"$f":"SUMIF([2]Setembro!$A$6:$R$80,A63,[2]Setembro!$R$6:$R$80)","v":{"$error":"#VALUE!"}},{"$f":"SUMIF([4]Outubro!$A$6:$R$80,A63,[4]Outubro!$O$6:$O$80)","v":{"$error":"#VALUE!"}},{"$f":"SUMIF([4]Outubro!$A$6:$R$80,A63,[4]Outubro!$R$6:$R$80)","v":{"$error":"#VALUE!"}},{"$f":"SUMIF([5]Novembro!$A$6:$R$80,A63,[5]Novembro!$O$6:$O$80)","v":{"$error":"#VALUE!"}},{"$f":"SUMIF([5]Novembro!$A$6:$R$80,A63,[5]Novembro!$R$6:$R$80)","v":{"$error":"#VALUE!"}},{"$f":"SUMIF([6]Dezembro!$A$6:$R$80,C63,[6]Dezembro!$O$6:$O$80)","v":{"$error":"#VALUE!"}},{"$f":"SUMIF([6]Dezembro!$A$6:$R$80,C63,[6]Dezembro!$R$6:$R$80)","v":{"$error":"#VALUE!"}},0,0]
[187755,"Raimundo Freitas",{"$f":"SUMIF(Janeiro!$B$6:$R$77,B64,Janeiro!$O$6:$O$77)","v":0},{"$f":"SUMIF(Janeiro!$B$6:$R$80,B64,Janeiro!$R$6:$R$80)","v":0},{"$f":"SUMIF(Fevereiro!$A$6:$R$77,A64,Fevereiro!$O$6:$O$77)","v":0},{"$f":"SUMIF(Fevereiro!$A$6:$R$77,A64,Fevereiro!$R$6:$R$77)","v":0},{"$f":"SUMIF(Março!$A$6:$R$80,A64,Março!$O$6:$O$80)","v":0},{"$f":"SUMIF(Março!$A$6:$R$80,A64,Março!$R$6:$R$80)","v":0},{"$f":"SUMIF(Abril!$A$6:$R$80,A64,Abril!$O$6:$O$80)","v":0},{"$f":"SUMIF(Abril!$A$6:$R$80,A64,Abril!$R$6:$R$80)","v":0},{"$f":"SUMIF(Maio!$A$6:$R$80,A64,Maio!$O$6:$O$80)","v":0},{"$f":"SUMIF(Maio!$A$6:$R$80,A64,Maio!$R$6:$R$80)","v":0},{"$f":"SUMIF(Junho!$A$6:$R$80,A64,Junho!$O$6:$O$80)","v":0},{"$f":"SUMIF(Junho!$A$6:$R$80,A64,Junho!$R$6:$R$80)","v":0},{"$f":"SUMIF(Julho!$A$6:$R$80,A64,Julho!$O$6:$O$80)","v":0},{"$f":"SUMIF(Julho!$A$6:$R$80,A64,Julho!$R$6:$R$80)","v":0},{"$f":"SUMIF([1]Agosto!$A$6:$R$80,A64,[1]Agosto!$O$6:$O$80)","v":{"$error":"#VALUE!"}},{"$f":"SUMIF([1]Agosto!$A$6:$R$80,A64,[1]Agosto!$R$6:$R$80)","v":{"$error":"#VALUE!"}},{"$f":"SUMIF([2]Setembro!$A$6:$R$80,A64,[2]Setembro!$O$6:$O$80)","v":{"$error":"#VALUE!"}},{"$f":"SUMIF([2]Setembro!$A$6:$R$80,A64,[2]Setembro!$R$6:$R$80)","v":{"$error":"#VALUE!"}},{"$f":"SUMIF([4]Outubro!$A$6:$R$80,A64,[4]Outubro!$O$6:$O$80)","v":{"$error":"#VALUE!"}},{"$f":"SUMIF([4]Outubro!$A$6:$R$80,A64,[4]Outubro!$R$6:$R$80)","v":{"$error":"#VALUE!"}},{"$f":"SUMIF([5]Novembro!$A$6:$R$80,A64,[5]Novembro!$O$6:$O$80)","v":{"$error":"#VALUE!"}},{"$f":"SUMIF([5]Novembro!$A$6:$R$80,A64,[5]Novembro!$R$6:$R$80)","v":{"$error":"#VALUE!"}},{"$f":"SUMIF([6]Dezembro!$A$6:$R$80,C64,[6]Dezembro!$O$6:$O$80)","v":{"$error":"#VALUE!"}},{"$f":"SUMIF([6]Dezembro!$A$6:$R$80,C64,[6]Dezembro!$R$6:$R$80)","v":{"$error":"#VALUE!"}},0,0]
[234370,"Cléber Alves Vieira",{"$f":"SUMIF(Janeiro!$B$6:$R$77,B65,Janeiro!$O$6:$O$77)","v":0},{"$f":"SUMIF(Janeiro!$B$6:$R$80,B65,Janeiro!$R$6:$R$80)","v":0},{"$f":"SUMIF(Fevereiro!$A$6:$R$77,A65,Fevereiro!$O$6:$O$77)","v":0},{"$f":"SUMIF(Fevereiro!$A$6:$R$77,A65,Fevereiro!$R$6:$R$77)","v":0},{"$f":"SUMIF(Março!$A$6:$R$80,A65,Março!$O$6:$O$80)","v":0},{"$f":"SUMIF(Março!$A$6:$R$80,A65,Março!$R$6:$R$80)","v":0},{"$f":"SUMIF(Abril!$A$6:$R$80,A65,Abril!$O$6:$O$80)","v":0},{"$f":"SUMIF(Abril!$A$6:$R$80,A65,Abril!$R$6:$R$80)","v":0},{"$f":"SUMIF(Maio!$A$6:$R$80,A65,Maio!$O$6:$O$80)","v":0},{"$f":"SUMIF(Maio!$A$6:$R$80,A65,Maio!$R$6:$R$80)","v":0},{"$f":"SUMIF(Junho!$A$6:$R$80,A65,Junho!$O$6:$O$80)","v":0},{"$f":"SUMIF(Junho!$A$6:$R$80,A65,Junho!$R$6:$R$80)","v":0},{"$f":"SUMIF(Julho!$A$6:$R$80,A65,Julho!$O$6:$O$80)","v":0},{"$f":"SUMIF(Julho!$A$6:$R$80,A65,Julho!$R$6:$R$80)","v":0},{"$f":"SUMIF([1]Agosto!$A$6:$R$80,A65,[1]Agosto!$O$6:$O$80)","v":{"$error":"#VALUE!"}},{"$f":"SUMIF([1]Agosto!$A$6:$R$80,A65,[1]Agosto!$R$6:$R$80)","v":{"$error":"#VALUE!"}},{"$f":"SUMIF([2]Setembro!$A$6:$R$80,A65,[2]Setembro!$O$6:$O$80)","v":{"$error":"#VALUE!"}},{"$f":"SUMIF([2]Setembro!$A$6:$R$80,A65,[2]Setembro!$R$6:$R$80)","v":{"$error":"#VALUE!"}},{"$f":"SUMIF([4]Outubro!$A$6:$R$80,A65,[4]Outubro!$O$6:$O$80)","v":{"$error":"#VALUE!"}},{"$f":"SUMIF([4]Outubro!$A$6:$R$80,A65,[4]Outubro!$R$6:$R$80)","v":{"$error":"#VALUE!"}},{"$f":"SUMIF([5]Novembro!$A$6:$R$80,A65,[5]Novembro!$O$6:$O$80)","v":{"$error":"#VALUE!"}},{"$f":"SUMIF([5]Novembro!$A$6:$R$80,A65,[5]Novembro!$R$6:$R$80)","v":{"$error":"#VALUE!"}},{"$f":"SUMIF([6]Dezembro!$A$6:$R$80,C65,[6]Dezembro!$O$6:$O$80)","v":{"$error":"#VALUE!"}},{"$f":"SUMIF([6]Dezembro!$A$6:$R$80,C65,[6]Dezembro!$R$6:$R$80)","v":{"$error":"#VALUE!"}},0,0]
[228834,"Alexandre Caldas Chagas",{"$f":"SUMIF(Janeiro!$B$6:$R$77,B66,Janeiro!$O$6:$O$77)","v":0},{"$f":"SUMIF(Janeiro!$B$6:$R$80,B66,Janeiro!$R$6:$R$80)","v":0},{"$f":"SUMIF(Fevereiro!$A$6:$R$77,A66,Fevereiro!$O$6:$O$77)","v":0},{"$f":"SUMIF(Fevereiro!$A$6:$R$77,A66,Fevereiro!$R$6:$R$77)","v":0},{"$f":"SUMIF(Março!$A$6:$R$80,A66,Março!$O$6:$O$80)","v":0},{"$f":"SUMIF(Março!$A$6:$R$80,A66,Março!$R$6:$R$80)","v":0},{"$f":"SUMIF(Abril!$A$6:$R$80,A66,Abril!$O$6:$O$80)","v":0},{"$f":"SUMIF(Abril!$A$6:$R$80,A66,Abril!$R$6:$R$80)","v":0},{"$f":"SUMIF(Maio!$A$6:$R$80,A66,Maio!$O$6:$O$80)","v":0},{"$f":"SUMIF(Maio!$A$6:$R$80,A66,Maio!$R$6:$R$80)","v":0},{"$f":"SUMIF(Junho!$A$6:$R$80,A66,Junho!$O$6:$O$80)","v":0},{"$f":"SUMIF(Junho!$A$6:$R$80,A66,Junho!$R$6:$R$80)","v":0},{"$f":"SUMIF(Julho!$A$6:$R$80,A66,Julho!$O$6:$O$80)","v":0},{"$f":"SUMIF(Julho!$A$6:$R$80,A66,Julho!$R$6:$R$80)","v":0},{"$f":"SUMIF([1]Agosto!$A$6:$R$80,A66,[1]Agosto!$O$6:$O$80)","v":{"$error":"#VALUE!"}},{"$f":"SUMIF([1]Agosto!$A$6:$R$80,A66,[1]Agosto!$R$6:$R$80)","v":{"$error":"#VALUE!"}},{"$f":"SUMIF([2]Setembro!$A$6:$R$80,A66,[2]Setembro!$O$6:$O$80)","v":{"$error":"#VALUE!"}},{"$f":"SUMIF([2]Setembro!$A$6:$R$80,A66,[2]Setembro!$R$6:$R$80)","v":{"$error":"#VALUE!"}},{"$f":"SUMIF([4]Outubro!$A$6:$R$80,A66,[4]Outubro!$O$6:$O$80)","v":{"$error":"#VALUE!"}},{"$f":"SUMIF([4]Outubro!$A$6:$R$80,A66,[4]Outubro!$R$6:$R$80)","v":{"$error":"#VALUE!"}},{"$f":"SUMIF([5]Novembro!$A$6:$R$80,A66,[5]Novembro!$O$6:$O$80)","v":{"$error":"#VALUE!"}},{"$f":"SUMIF([5]Novembro!$A$6:$R$80,A66,[5]Novembro!$R$6:$R$80)","v":{"$error":"#VALUE!"}},{"$f":"SUMIF([6]Dezembro!$A$6:$R$80,C66,[6]Dezembro!$O$6:$O$80)","v":{"$error":"#VALUE!"}},{"$f":"SUMIF([6]Dezembro!$A$6:$R$80,C66,[6]Dezembro!$R$6:$R$80)","v":{"$error":"#VALUE!"}},0,0]
[220213,"Alexsandro de Oliveira Barboza",{"$f":"SUMIF(Janeiro!$B$6:$R$77,B67,Janeiro!$O$6:$O$77)","v":0},{"$f":"SUMIF(Janeiro!$B$6:$R$80,B67,Janeiro!$R$6:$R$80)","v":0},{"$f":"SUMIF(Fevereiro!$A$6:$R$77,A67,Fevereiro!$O$6:$O$77)","v":0},{"$f":"SUMIF(Fevereiro!$A$6:$R$77,A67,Fevereiro!$R$6:$R$77)","v":0},{"$f":"SUMIF(Março!$A$6:$R$80,A67,Março!$O$6:$O$80)","v":0},{"$f":"SUMIF(Março!$A$6:$R$80,A67,Março!$R$6:$R$80)","v":0},{"$f":"SUMIF(Abril!$A$6:$R$80,A67,Abril!$O$6:$O$80)","v":0},{"$f":"SUMIF(Abril!$A$6:$R$80,A67,Abril!$R$6:$R$80)","v":0},{"$f":"SUMIF(Maio!$A$6:$R$80,A67,Maio!$O$6:$O$80)","v":0},{"$f":"SUMIF(Maio!$A$6:$R$80,A67,Maio!$R$6:$R$80)","v":0},{"$f":"SUMIF(Junho!$A$6:$R$80,A67,Junho!$O$6:$O$80)","v":0},{"$f":"SUMIF(Junho!$A$6:$R$80,A67,Junho!$R$6:$R$80)","v":0},{"$f":"SUMIF(Julho!$A$6:$R$80,A67,Julho!$O$6:$O$80)","v":0},{"$f":"SUMIF(Julho!$A$6:$R$80,A67,Julho!$R$6:$R$80)","v":0},{"$f":"SUMIF([1]Agosto!$A$6:$R$80,A67,[1]Agosto!$O$6:$O$80)","v":{"$error":"#VALUE!"}},{"$f":"SUMIF([1]Agosto!$A$6:$R$80,A67,[1]Agosto!$R$6:$R$80)","v":{"$error":"#VALUE!"}},{"$f":"SUMIF([2]Setembro!$A$6:$R$80,A67,[2]Setembro!$O$6:$O$80)","v":{"$error":"#VALUE!"}},{"$f":"SUMIF([2]Setembro!$A$6:$R$80,A67,[2]Setembro!$R$6:$R$80)","v":{"$error":"#VALUE!"}},{"$f":"SUMIF([4]Outubro!$A$6:$R$80,A67,[4]Outubro!$O$6:$O$80)","v":{"$error":"#VALUE!"}},{"$f":"SUMIF([4]Outubro!$A$6:$R$80,A67,[4]Outubro!$R$6:$R$80)","v":{"$error":"#VALUE!"}},{"$f":"SUMIF([5]Novembro!$A$6:$R$80,A67,[5]Novembro!$O$6:$O$80)","v":{"$error":"#VALUE!"}},{"$f":"SUMIF([5]Novembro!$A$6:$R$80,A67,[5]Novembro!$R$6:$R$80)","v":{"$error":"#VALUE!"}},{"$f":"SUMIF([6]Dezembro!$A$6:$R$80,C67,[6]Dezembro!$O$6:$O$80)","v":{"$error":"#VALUE!"}},{"$f":"SUMIF([6]Dezembro!$A$6:$R$80,C67,[6]Dezembro!$R$6:$R$80)","v":{"$error":"#VALUE!"}},0,0]
[224251,"Getúlio Lima da Silva",{"$f":"SUMIF(Janeiro!$B$6:$R$77,B68,Janeiro!$O$6:$O$77)","v":0},{"$f":"SUMIF(Janeiro!$B$6:$R$80,B68,Janeiro!$R$6:$R$80)","v":0},{"$f":"SUMIF(Fevereiro!$A$6:$R$77,A68,Fevereiro!$O$6:$O$77)","v":0},{"$f":"SUMIF(Fevereiro!$A$6:$R$77,A68,Fevereiro!$R$6:$R$77)","v":0},{"$f":"SUMIF(Março!$A$6:$R$80,A68,Março!$O$6:$O$80)","v":0},{"$f":"SUMIF(Março!$A$6:$R$80,A68,Março!$R$6:$R$80)","v":0},{"$f":"SUMIF(Abril!$A$6:$R$80,A68,Abril!$O$6:$O$80)","v":0},{"$f":"SUMIF(Abril!$A$6:$R$80,A68,Abril!$R$6:$R$80)","v":0},{"$f":"SUMIF(Maio!$A$6:$R$80,A68,Maio!$O$6:$O$80)","v":0},{"$f":"SUMIF(Maio!$A$6:$R$80,A68,Maio!$R$6:$R$80)","v":0},{"$f":"SUMIF(Junho!$A$6:$R$80,A68,Junho!$O$6:$O$80)","v":0},{"$f":"SUMIF(Junho!$A$6:$R$80,A68,Junho!$R$6:$R$80)","v":0},{"$f":"SUMIF(Julho!$A$6:$R$80,A68,Julho!$O$6:$O$80)","v":0},{"$f":"SUMIF(Julho!$A$6:$R$80,A68,Julho!$R$6:$R$80)","v":0},{"$f":"SUMIF([1]Agosto!$A$6:$R$80,A68,[1]Agosto!$O$6:$O$80)","v":{"$error":"#VALUE!"}},{"$f":"SUMIF([1]Agosto!$A$6:$R$80,A68,[1]Agosto!$R$6:$R$80)","v":{"$error":"#VALUE!"}},{"$f":"SUMIF([2]Setembro!$A$6:$R$80,A68,[2]Setembro!$O$6:$O$80)","v":{"$error":"#VALUE!"}},{"$f":"SUMIF([2]Setembro!$A$6:$R$80,A68,[2]Setembro!$R$6:$R$80)","v":{"$error":"#VALUE!"}},{"$f":"SUMIF([4]Outubro!$A$6:$R$80,A68,[4]Outubro!$O$6:$O$80)","v":{"$error":"#VALUE!"}},{"$f":"SUMIF([4]Outubro!$A$6:$R$80,A68,[4]Outubro!$R$6:$R$80)","v":{"$error":"#VALUE!"}},{"$f":"SUMIF([5]Novembro!$A$6:$R$80,A68,[5]Novembro!$O$6:$O$80)","v":{"$error":"#VALUE!"}},{"$f":"SUMIF([5]Novembro!$A$6:$R$80,A68,[5]Novembro!$R$6:$R$80)","v":{"$error":"#VALUE!"}},{"$f":"SUMIF([6]Dezembro!$A$6:$R$80,C68,[6]Dezembro!$O$6:$O$80)","v":{"$error":"#VALUE!"}},{"$f":"SUMIF([6]Dezembro!$A$6:$R$80,C68,[6]Dezembro!$R$6:$R$80)","v":{"$error":"#VALUE!"}},0,0]
[252646,"Thawane Bianca da S. Neves",{"$f":"SUMIF(Janeiro!$B$6:$R$77,B69,Janeiro!$O$6:$O$77)","v":0},{"$f":"SUMIF(Janeiro!$B$6:$R$80,B69,Janeiro!$R$6:$R$80)","v":0},{"$f":"SUMIF(Fevereiro!$A$6:$R$77,A69,Fevereiro!$O$6:$O$77)","v":0},{"$f":"SUMIF(Fevereiro!$A$6:$R$77,A69,Fevereiro!$R$6:$R$77)","v":0},{"$f":"SUMIF(Março!$A$6:$R$80,A69,Março!$O$6:$O$80)","v":0},{"$f":"SUMIF(Março!$A$6:$R$80,A69,Março!$R$6:$R$80)","v":0},{"$f":"SUMIF(Abril!$A$6:$R$80,A69,Abril!$O$6:$O$80)","v":0},{"$f":"SUMIF(Abril!$A$6:$R$80,A69,Abril!$R$6:$R$80)","v":0},{"$f":"SUMIF(Maio!$A$6:$R$80,A69,Maio!$O$6:$O$80)","v":0},{"$f":"SUMIF(Maio!$A$6:$R$80,A69,Maio!$R$6:$R$80)","v":0},{"$f":"SUMIF(Junho!$A$6:$R$80,A69,Junho!$O$6:$O$80)","v":0},{"$f":"SUMIF(Junho!$A$6:$R$80,A69,Junho!$R$6:$R$80)","v":0},{"$f":"SUMIF(Julho!$A$6:$R$80,A69,Julho!$O$6:$O$80)","v":0},{"$f":"SUMIF(Julho!$A$6:$R$80,A69,Julho!$R$6:$R$80)","v":0},{"$f":"SUMIF([1]Agosto!$A$6:$R$80,A69,[1]Agosto!$O$6:$O$80)","v":{"$error":"#VALUE!"}},{"$f":"SUMIF([1]Agosto!$A$6:$R$80,A69,[1]Agosto!$R$6:$R$80)","v":{"$error":"#VALUE!"}},{"$f":"SUMIF([2]Setembro!$A$6:$R$80,A69,[2]Setembro!$O$6:$O$80)","v":{"$error":"#VALUE!"}},{"$f":"SUMIF([2]Setembro!$A$6:$R$80,A69,[2]Setembro!$R$6:$R$80)","v":{"$error":"#VALUE!"}},{"$f":"SUMIF([4]Outubro!$A$6:$R$80,A69,[4]Outubro!$O$6:$O$80)","v":{"$error":"#VALUE!"}},{"$f":"SUMIF([4]Outubro!$A$6:$R$80,A69,[4]Outubro!$R$6:$R$80)","v":{"$error":"#VALUE!"}},{"$f":"SUMIF([5]Novembro!$A$6:$R$80,A69,[5]Novembro!$O$6:$O$80)","v":{"$error":"#VALUE!"}},{"$f":"SUMIF([5]Novembro!$A$6:$R$80,A69,[5]Novembro!$R$6:$R$80)","v":{"$error":"#VALUE!"}},{"$f":"SUMIF([6]Dezembro!$A$6:$R$80,C69,[6]Dezembro!$O$6:$O$80)","v":{"$error":"#VALUE!"}},{"$f":"SUMIF([6]Dezembro!$A$6:$R$80,C69,[6]Dezembro!$R$6:$R$80)","v":{"$error":"#VALUE!"}},0,0]
[250686,"Taislane Santos Reis",{"$f":"SUMIF(Janeiro!$B$6:$R$77,B70,Janeiro!$O$6:$O$77)","v":0},{"$f":"SUMIF(Janeiro!$B$6:$R$80,B70,Janeiro!$R$6:$R$80)","v":0},{"$f":"SUMIF(Fevereiro!$A$6:$R$77,A70,Fevereiro!$O$6:$O$77)","v":0},{"$f":"SUMIF(Fevereiro!$A$6:$R$77,A70,Fevereiro!$R$6:$R$77)","v":0},{"$f":"SUMIF(Março!$A$6:$R$80,A70,Março!$O$6:$O$80)","v":0},{"$f":"SUMIF(Março!$A$6:$R$80,A70,Março!$R$6:$R$80)","v":0},{"$f":"SUMIF(Abril!$A$6:$R$80,A70,Abril!$O$6:$O$80)","v":0},{"$f":"SUMIF(Abril!$A$6:$R$80,A70,Abril!$R$6:$R$80)","v":0},{"$f":"SUMIF(Maio!$A$6:$R$80,A70,Maio!$O$6:$O$80)","v":0},{"$f":"SUMIF(Maio!$A$6:$R$80,A70,Maio!$R$6:$R$80)","v":0},{"$f":"SUMIF(Junho!$A$6:$R$80,A70,Junho!$O$6:$O$80)","v":0},{"$f":"SUMIF(Junho!$A$6:$R$80,A70,Junho!$R$6:$R$80)","v":0},{"$f":"SUMIF(Julho!$A$6:$R$80,A70,Julho!$O$6:$O$80)","v":0},{"$f":"SUMIF(Julho!$A$6:$R$80,A70,Julho!$R$6:$R$80)","v":0},{"$f":"SUMIF([1]Agosto!$A$6:$R$80,A70,[1]Agosto!$O$6:$O$80)","v":{"$error":"#VALUE!"}},{"$f":"SUMIF([1]Agosto!$A$6:$R$80,A70,[1]Agosto!$R$6:$R$80)","v":{"$error":"#VALUE!"}},{"$f":"SUMIF([2]Setembro!$A$6:$R$80,A70,[2]Setembro!$O$6:$O$80)","v":{"$error":"#VALUE!"}},{"$f":"SUMIF([2]Setembro!$A$6:$R$80,A70,[2]Setembro!$R$6:$R$80)","v":{"$error":"#VALUE!"}},{"$f":"SUMIF([4]Outubro!$A$6:$R$80,A70,[4]Outubro!$O$6:$O$80)","v":{"$error":"#VALUE!"}},{"$f":"SUMIF([4]Outubro!$A$6:$R$80,A70,[4]Outubro!$R$6:$R$80)","v":{"$error":"#VALUE!"}},{"$f":"SUMIF([5]Novembro!$A$6:$R$80,A70,[5]Novembro!$O$6:$O$80)","v":{"$error":"#VALUE!"}},{"$f":"SUMIF([5]Novembro!$A$6:$R$80,A70,[5]Novembro!$R$6:$R$80)","v":{"$error":"#VALUE!"}},{"$f":"SUMIF([6]Dezembro!$A$6:$R$80,C70,[6]Dezembro!$O$6:$O$80)","v":{"$error":"#VALUE!"}},{"$f":"SUMIF([6]Dezembro!$A$6:$R$80,C70,[6]Dezembro!$R$6:$R$80)","v":{"$error":"#VALUE!"}},0,0]
[250791,"Rafaela dos Anjos Pimentel Mendes",{"$f":"SUMIF(Janeiro!$B$6:$R$77,B71,Janeiro!$O$6:$O$77)","v":0},{"$f":"SUMIF(Janeiro!$B$6:$R$80,B71,Janeiro!$R$6:$R$80)","v":0},{"$f":"SUMIF(Fevereiro!$A$6:$R$77,A71,Fevereiro!$O$6:$O$77)","v":0},{"$f":"SUMIF(Fevereiro!$A$6:$R$77,A71,Fevereiro!$R$6:$R$77)","v":0},{"$f":"SUMIF(Março!$A$6:$R$80,A71,Março!$O$6:$O$80)","v":0},{"$f":"SUMIF(Março!$A$6:$R$80,A71,Março!$R$6:$R$80)","v":0},{"$f":"SUMIF(Abril!$A$6:$R$80,A71,Abril!$O$6:$O$80)","v":0},{"$f":"SUMIF(Abril!$A$6:$R$80,A71,Abril!$R$6:$R$80)","v":0},{"$f":"SUMIF(Maio!$A$6:$R$80,A71,Maio!$O$6:$O$80)","v":0},{"$f":"SUMIF(Maio!$A$6:$R$80,A71,Maio!$R$6:$R$80)","v":0},{"$f":"SUMIF(Junho!$A$6:$R$80,A71,Junho!$O$6:$O$80)","v":0},{"$f":"SUMIF(Junho!$A$6:$R$80,A71,Junho!$R$6:$R$80)","v":0},{"$f":"SUMIF(Julho!$A$6:$R$80,A71,Julho!$O$6:$O$80)","v":0},{"$f":"SUMIF(Julho!$A$6:$R$80,A71,Julho!$R$6:$R$80)","v":0},{"$f":"SUMIF([1]Agosto!$A$6:$R$80,A71,[1]Agosto!$O$6:$O$80)","v":{"$error":"#VALUE!"}},{"$f":"SUMIF([1]Agosto!$A$6:$R$80,A71,[1]Agosto!$R$6:$R$80)","v":{"$error":"#VALUE!"}},{"$f":"SUMIF([2]Setembro!$A$6:$R$80,A71,[2]Setembro!$O$6:$O$80)","v":{"$error":"#VALUE!"}},{"$f":"SUMIF([2]Setembro!$A$6:$R$80,A71,[2]Setembro!$R$6:$R$80)","v":{"$error":"#VALUE!"}},{"$f":"SUMIF([4]Outubro!$A$6:$R$80,A71,[4]Outubro!$O$6:$O$80)","v":{"$error":"#VALUE!"}},{"$f":"SUMIF([4]Outubro!$A$6:$R$80,A71,[4]Outubro!$R$6:$R$80)","v":{"$error":"#VALUE!"}},{"$f":"SUMIF([5]Novembro!$A$6:$R$80,A71,[5]Novembro!$O$6:$O$80)","v":{"$error":"#VALUE!"}},{"$f":"SUMIF([5]Novembro!$A$6:$R$80,A71,[5]Novembro!$R$6:$R$80)","v":{"$error":"#VALUE!"}},{"$f":"SUMIF([6]Dezembro!$A$6:$R$80,C71,[6]Dezembro!$O$6:$O$80)","v":{"$error":"#VALUE!"}},{"$f":"SUMIF([6]Dezembro!$A$6:$R$80,C71,[6]Dezembro!$R$6:$R$80)","v":{"$error":"#VALUE!"}},0,0]
[250813,"Alice Oliveira de Santa",{"$f":"SUMIF(Janeiro!$B$6:$R$77,B72,Janeiro!$O$6:$O$77)","v":0},{"$f":"SUMIF(Janeiro!$B$6:$R$80,B72,Janeiro!$R$6:$R$80)","v":0},{"$f":"SUMIF(Fevereiro!$A$6:$R$77,A72,Fevereiro!$O$6:$O$77)","v":0},{"$f":"SUMIF(Fevereiro!$A$6:$R$77,A72,Fevereiro!$R$6:$R$77)","v":0},{"$f":"SUMIF(Março!$A$6:$R$80,A72,Março!$O$6:$O$80)","v":0},{"$f":"SUMIF(Março!$A$6:$R$80,A72,Março!$R$6:$R$80)","v":0},{"$f":"SUMIF(Abril!$A$6:$R$80,A72,Abril!$O$6:$O$80)","v":0},{"$f":"SUMIF(Abril!$A$6:$R$80,A72,Abril!$R$6:$R$80)","v":0},{"$f":"SUMIF(Maio!$A$6:$R$80,A72,Maio!$O$6:$O$80)","v":0},{"$f":"SUMIF(Maio!$A$6:$R$80,A72,Maio!$R$6:$R$80)","v":0},{"$f":"SUMIF(Junho!$A$6:$R$80,A72,Junho!$O$6:$O$80)","v":0},{"$f":"SUMIF(Junho!$A$6:$R$80,A72,Junho!$R$6:$R$80)","v":0},{"$f":"SUMIF(Julho!$A$6:$R$80,A72,Julho!$O$6:$O$80)","v":0},{"$f":"SUMIF(Julho!$A$6:$R$80,A72,Julho!$R$6:$R$80)","v":0},{"$f":"SUMIF([1]Agosto!$A$6:$R$80,A72,[1]Agosto!$O$6:$O$80)","v":{"$error":"#VALUE!"}},{"$f":"SUMIF([1]Agosto!$A$6:$R$80,A72,[1]Agosto!$R$6:$R$80)","v":{"$error":"#VALUE!"}},{"$f":"SUMIF([2]Setembro!$A$6:$R$80,A72,[2]Setembro!$O$6:$O$80)","v":{"$error":"#VALUE!"}},{"$f":"SUMIF([2]Setembro!$A$6:$R$80,A72,[2]Setembro!$R$6:$R$80)","v":{"$error":"#VALUE!"}},{"$f":"SUMIF([4]Outubro!$A$6:$R$80,A72,[4]Outubro!$O$6:$O$80)","v":{"$error":"#VALUE!"}},{"$f":"SUMIF([4]Outubro!$A$6:$R$80,A72,[4]Outubro!$R$6:$R$80)","v":{"$error":"#VALUE!"}},{"$f":"SUMIF([5]Novembro!$A$6:$R$80,A72,[5]Novembro!$O$6:$O$80)","v":{"$error":"#VALUE!"}},{"$f":"SUMIF([5]Novembro!$A$6:$R$80,A72,[5]Novembro!$R$6:$R$80)","v":{"$error":"#VALUE!"}},{"$f":"SUMIF([6]Dezembro!$A$6:$R$80,C72,[6]Dezembro!$O$6:$O$80)","v":{"$error":"#VALUE!"}},{"$f":"SUMIF([6]Dezembro!$A$6:$R$80,C72,[6]Dezembro!$R$6:$R$80)","v":{"$error":"#VALUE!"}},0,0]
[252158,"Maria Heloisa Santana de O do Vale",{"$f":"SUMIF(Janeiro!$B$6:$R$77,B73,Janeiro!$O$6:$O$77)","v":0},{"$f":"SUMIF(Janeiro!$B$6:$R$80,B73,Janeiro!$R$6:$R$80)","v":0},{"$f":"SUMIF(Fevereiro!$A$6:$R$77,A73,Fevereiro!$O$6:$O$77)","v":0},{"$f":"SUMIF(Fevereiro!$A$6:$R$77,A73,Fevereiro!$R$6:$R$77)","v":0},{"$f":"SUMIF(Março!$A$6:$R$80,A73,Março!$O$6:$O$80)","v":0},{"$f":"SUMIF(Março!$A$6:$R$80,A73,Março!$R$6:$R$80)","v":0},{"$f":"SUMIF(Abril!$A$6:$R$80,A73,Abril!$O$6:$O$80)","v":0},{"$f":"SUMIF(Abril!$A$6:$R$80,A73,Abril!$R$6:$R$80)","v":0},{"$f":"SUMIF(Maio!$A$6:$R$80,A73,Maio!$O$6:$O$80)","v":0},{"$f":"SUMIF(Maio!$A$6:$R$80,A73,Maio!$R$6:$R$80)","v":0},{"$f":"SUMIF(Junho!$A$6:$R$80,A73,Junho!$O$6:$O$80)","v":0},{"$f":"SUMIF(Junho!$A$6:$R$80,A73,Junho!$R$6:$R$80)","v":0},{"$f":"SUMIF(Julho!$A$6:$R$80,A73,Julho!$O$6:$O$80)","v":0},{"$f":"SUMIF(Julho!$A$6:$R$80,A73,Julho!$R$6:$R$80)","v":0},{"$f":"SUMIF([1]Agosto!$A$6:$R$80,A73,[1]Agosto!$O$6:$O$80)","v":{"$error":"#VALUE!"}},{"$f":"SUMIF([1]Agosto!$A$6:$R$80,A73,[1]Agosto!$R$6:$R$80)","v":{"$error":"#VALUE!"}},{"$f":"SUMIF([2]Setembro!$A$6:$R$80,A73,[2]Setembro!$O$6:$O$80)","v":{"$error":"#VALUE!"}},{"$f":"SUMIF([2]Setembro!$A$6:$R$80,A73,[2]Setembro!$R$6:$R$80)","v":{"$error":"#VALUE!"}},{"$f":"SUMIF([4]Outubro!$A$6:$R$80,A73,[4]Outubro!$O$6:$O$80)","v":{"$error":"#VALUE!"}},{"$f":"SUMIF([4]Outubro!$A$6:$R$80,A73,[4]Outubro!$R$6:$R$80)","v":{"$error":"#VALUE!"}},{"$f":"SUMIF([5]Novembro!$A$6:$R$80,A73,[5]Novembro!$O$6:$O$80)","v":{"$error":"#VALUE!"}},{"$f":"SUMIF([5]Novembro!$A$6:$R$80,A73,[5]Novembro!$R$6:$R$80)","v":{"$error":"#VALUE!"}},{"$f":"SUMIF([6]Dezembro!$A$6:$R$80,C73,[6]Dezembro!$O$6:$O$80)","v":{"$error":"#VALUE!"}},{"$f":"SUMIF([6]Dezembro!$A$6:$R$80,C73,[6]Dezembro!$R$6:$R$80)","v":{"$error":"#VALUE!"}},0,0]
[252069,"Aleandesson Florencio Fontes",{"$f":"SUMIF(Janeiro!$B$6:$R$77,B74,Janeiro!$O$6:$O$77)","v":0},{"$f":"SUMIF(Janeiro!$B$6:$R$80,B74,Janeiro!$R$6:$R$80)","v":0},{"$f":"SUMIF(Fevereiro!$A$6:$R$77,A74,Fevereiro!$O$6:$O$77)","v":0},{"$f":"SUMIF(Fevereiro!$A$6:$R$77,A74,Fevereiro!$R$6:$R$77)","v":0},{"$f":"SUMIF(Março!$A$6:$R$80,A74,Março!$O$6:$O$80)","v":0},{"$f":"SUMIF(Março!$A$6:$R$80,A74,Março!$R$6:$R$80)","v":0},{"$f":"SUMIF(Abril!$A$6:$R$80,A74,Abril!$O$6:$O$80)","v":4},{"$f":"SUMIF(Abril!$A$6:$R$80,A74,Abril!$R$6:$R$80)","v":12.4},{"$f":"SUMIF(Maio!$A$6:$R$80,A74,Maio!$O$6:$O$80)","v":0},{"$f":"SUMIF(Maio!$A$6:$R$80,A74,Maio!$R$6:$R$80)","v":0},{"$f":"SUMIF(Junho!$A$6:$R$80,A74,Junho!$O$6:$O$80)","v":0},{"$f":"SUMIF(Junho!$A$6:$R$80,A74,Junho!$R$6:$R$80)","v":0},{"$f":"SUMIF(Julho!$A$6:$R$80,A74,Julho!$O$6:$O$80)","v":0},{"$f":"SUMIF(Julho!$A$6:$R$80,A74,Julho!$R$6:$R$80)","v":0},{"$f":"SUMIF([1]Agosto!$A$6:$R$80,A74,[1]Agosto!$O$6:$O$80)","v":{"$error":"#VALUE!"}},{"$f":"SUMIF([1]Agosto!$A$6:$R$80,A74,[1]Agosto!$R$6:$R$80)","v":{"$error":"#VALUE!"}},{"$f":"SUMIF([2]Setembro!$A$6:$R$80,A74,[2]Setembro!$O$6:$O$80)","v":{"$error":"#VALUE!"}},{"$f":"SUMIF([2]Setembro!$A$6:$R$80,A74,[2]Setembro!$R$6:$R$80)","v":{"$error":"#VALUE!"}},{"$f":"SUMIF([4]Outubro!$A$6:$R$80,A74,[4]Outubro!$O$6:$O$80)","v":{"$error":"#VALUE!"}},{"$f":"SUMIF([4]Outubro!$A$6:$R$80,A74,[4]Outubro!$R$6:$R$80)","v":{"$error":"#VALUE!"}},{"$f":"SUMIF([5]Novembro!$A$6:$R$80,A74,[5]Novembro!$O$6:$O$80)","v":{"$error":"#VALUE!"}},{"$f":"SUMIF([5]Novembro!$A$6:$R$80,A74,[5]Novembro!$R$6:$R$80)","v":{"$error":"#VALUE!"}},{"$f":"SUMIF([6]Dezembro!$A$6:$R$80,C74,[6]Dezembro!$O$6:$O$80)","v":{"$error":"#VALUE!"}},{"$f":"SUMIF([6]Dezembro!$A$6:$R$80,C74,[6]Dezembro!$R$6:$R$80)","v":{"$error":"#VALUE!"}},4,12.4]
[252077,"Dinnyster Bruno Costa Santos",{"$f":"SUMIF(Janeiro!$B$6:$R$77,B75,Janeiro!$O$6:$O$77)","v":0},{"$f":"SUMIF(Janeiro!$B$6:$R$80,B75,Janeiro!$R$6:$R$80)","v":0},{"$f":"SUMIF(Fevereiro!$A$6:$R$77,A75,Fevereiro!$O$6:$O$77)","v":0},{"$f":"SUMIF(Fevereiro!$A$6:$R$77,A75,Fevereiro!$R$6:$R$77)","v":0},{"$f":"SUMIF(Março!$A$6:$R$80,A75,Março!$O$6:$O$80)","v":0},{"$f":"SUMIF(Março!$A$6:$R$80,A75,Março!$R$6:$R$80)","v":0},{"$f":"SUMIF(Abril!$A$6:$R$80,A75,Abril!$O$6:$O$80)","v":4},{"$f":"SUMIF(Abril!$A$6:$R$80,A75,Abril!$R$6:$R$80)","v":12.4},{"$f":"SUMIF(Maio!$A$6:$R$80,A75,Maio!$O$6:$O$80)","v":0},{"$f":"SUMIF(Maio!$A$6:$R$80,A75,Maio!$R$6:$R$80)","v":0},{"$f":"SUMIF(Junho!$A$6:$R$80,A75,Junho!$O$6:$O$80)","v":0},{"$f":"SUMIF(Junho!$A$6:$R$80,A75,Junho!$R$6:$R$80)","v":0},{"$f":"SUMIF(Julho!$A$6:$R$80,A75,Julho!$O$6:$O$80)","v":0},{"$f":"SUMIF(Julho!$A$6:$R$80,A75,Julho!$R$6:$R$80)","v":0},{"$f":"SUMIF([1]Agosto!$A$6:$R$80,A75,[1]Agosto!$O$6:$O$80)","v":{"$error":"#VALUE!"}},{"$f":"SUMIF([1]Agosto!$A$6:$R$80,A75,[1]Agosto!$R$6:$R$80)","v":{"$error":"#VALUE!"}},{"$f":"SUMIF([2]Setembro!$A$6:$R$80,A75,[2]Setembro!$O$6:$O$80)","v":{"$error":"#VALUE!"}},{"$f":"SUMIF([2]Setembro!$A$6:$R$80,A75,[2]Setembro!$R$6:$R$80)","v":{"$error":"#VALUE!"}},{"$f":"SUMIF([4]Outubro!$A$6:$R$80,A75,[4]Outubro!$O$6:$O$80)","v":{"$error":"#VALUE!"}},{"$f":"SUMIF([4]Outubro!$A$6:$R$80,A75,[4]Outubro!$R$6:$R$80)","v":{"$error":"#VALUE!"}},{"$f":"SUMIF([5]Novembro!$A$6:$R$80,A75,[5]Novembro!$O$6:$O$80)","v":{"$error":"#VALUE!"}},{"$f":"SUMIF([5]Novembro!$A$6:$R$80,A75,[5]Novembro!$R$6:$R$80)","v":{"$error":"#VALUE!"}},{"$f":"SUMIF([6]Dezembro!$A$6:$R$80,C75,[6]Dezembro!$O$6:$O$80)","v":{"$error":"#VALUE!"}},{"$f":"SUMIF([6]Dezembro!$A$6:$R$80,C75,[6]Dezembro!$R$6:$R$80)","v":{"$error":"#VALUE!"}},4,12.4]
[252085,"Ianny Monic Santos Brasileiro",{"$f":"SUMIF(Janeiro!$B$6:$R$77,B76,Janeiro!$O$6:$O$77)","v":0},{"$f":"SUMIF(Janeiro!$B$6:$R$80,B76,Janeiro!$R$6:$R$80)","v":0},{"$f":"SUMIF(Fevereiro!$A$6:$R$77,A76,Fevereiro!$O$6:$O$77)","v":0},{"$f":"SUMIF(Fevereiro!$A$6:$R$77,A76,Fevereiro!$R$6:$R$77)","v":0},{"$f":"SUMIF(Março!$A$6:$R$80,A76,Março!$O$6:$O$80)","v":0},{"$f":"SUMIF(Março!$A$6:$R$80,A76,Março!$R$6:$R$80)","v":0},{"$f":"SUMIF(Abril!$A$6:$R$80,A76,Abril!$O$6:$O$80)","v":4},{"$f":"SUMIF(Abril!$A$6:$R$80,A76,Abril!$R$6:$R$80)","v":12.4},{"$f":"SUMIF(Maio!$A$6:$R$80,A76,Maio!$O$6:$O$80)","v":0},{"$f":"SUMIF(Maio!$A$6:$R$80,A76,Maio!$R$6:$R$80)","v":0},{"$f":"SUMIF(Junho!$A$6:$R$80,A76,Junho!$O$6:$O$80)","v":0},{"$f":"SUMIF(Junho!$A$6:$R$80,A76,Junho!$R$6:$R$80)","v":0},{"$f":"SUMIF(Julho!$A$6:$R$80,A76,Julho!$O$6:$O$80)","v":0},{"$f":"SUMIF(Julho!$A$6:$R$80,A76,Julho!$R$6:$R$80)","v":0},{"$f":"SUMIF([1]Agosto!$A$6:$R$80,A76,[1]Agosto!$O$6:$O$80)","v":{"$error":"#VALUE!"}},{"$f":"SUMIF([1]Agosto!$A$6:$R$80,A76,[1]Agosto!$R$6:$R$80)","v":{"$error":"#VALUE!"}},{"$f":"SUMIF([2]Setembro!$A$6:$R$80,A76,[2]Setembro!$O$6:$O$80)","v":{"$error":"#VALUE!"}},{"$f":"SUMIF([2]Setembro!$A$6:$R$80,A76,[2]Setembro!$R$6:$R$80)","v":{"$error":"#VALUE!"}},{"$f":"SUMIF([4]Outubro!$A$6:$R$80,A76,[4]Outubro!$O$6:$O$80)","v":{"$error":"#VALUE!"}},{"$f":"SUMIF([4]Outubro!$A$6:$R$80,A76,[4]Outubro!$R$6:$R$80)","v":{"$error":"#VALUE!"}},{"$f":"SUMIF([5]Novembro!$A$6:$R$80,A76,[5]Novembro!$O$6:$O$80)","v":{"$error":"#VALUE!"}},{"$f":"SUMIF([5]Novembro!$A$6:$R$80,A76,[5]Novembro!$R$6:$R$80)","v":{"$error":"#VALUE!"}},{"$f":"SUMIF([6]Dezembro!$A$6:$R$80,C76,[6]Dezembro!$O$6:$O$80)","v":{"$error":"#VALUE!"}},{"$f":"SUMIF([6]Dezembro!$A$6:$R$80,C76,[6]Dezembro!$R$6:$R$80)","v":{"$error":"#VALUE!"}},4,12.4]
[250708,"Luis Augusto Gonçalves Dias Filho",{"$f":"SUMIF(Janeiro!$B$6:$R$77,B77,Janeiro!$O$6:$O$77)","v":0},{"$f":"SUMIF(Janeiro!$B$6:$R$80,B77,Janeiro!$R$6:$R$80)","v":0},{"$f":"SUMIF(Fevereiro!$A$6:$R$77,A77,Fevereiro!$O$6:$O$77)","v":0},{"$f":"SUMIF(Fevereiro!$A$6:$R$77,A77,Fevereiro!$R$6:$R$77)","v":0},{"$f":"SUMIF(Março!$A$6:$R$80,A77,Março!$O$6:$O$80)","v":0},{"$f":"SUMIF(Março!$A$6:$R$80,A77,Março!$R$6:$R$80)","v":0},{"$f":"SUMIF(Abril!$A$6:$R$80,A77,Abril!$O$6:$O$80)","v":0},{"$f":"SUMIF(Abril!$A$6:$R$80,A77,Abril!$R$6:$R$80)","v":0},{"$f":"SUMIF(Maio!$A$6:$R$80,A77,Maio!$O$6:$O$80)","v":0},{"$f":"SUMIF(Maio!$A$6:$R$80,A77,Maio!$R$6:$R$80)","v":0},{"$f":"SUMIF(Junho!$A$6:$R$80,A77,Junho!$O$6:$O$80)","v":0},{"$f":"SUMIF(Junho!$A$6:$R$80,A77,Junho!$R$6:$R$80)","v":0},{"$f":"SUMIF(Julho!$A$6:$R$80,A77,Julho!$O$6:$O$80)","v":0},{"$f":"SUMIF(Julho!$A$6:$R$80,A77,Julho!$R$6:$R$80)","v":0},{"$f":"SUMIF([1]Agosto!$A$6:$R$80,A77,[1]Agosto!$O$6:$O$80)","v":{"$error":"#VALUE!"}},{"$f":"SUMIF([1]Agosto!$A$6:$R$80,A77,[1]Agosto!$R$6:$R$80)","v":{"$error":"#VALUE!"}},{"$f":"SUMIF([2]Setembro!$A$6:$R$80,A77,[2]Setembro!$O$6:$O$80)","v":{"$error":"#VALUE!"}},{"$f":"SUMIF([2]Setembro!$A$6:$R$80,A77,[2]Setembro!$R$6:$R$80)","v":{"$error":"#VALUE!"}},{"$f":"SUMIF([4]Outubro!$A$6:$R$80,A77,[4]Outubro!$O$6:$O$80)","v":{"$error":"#VALUE!"}},{"$f":"SUMIF([4]Outubro!$A$6:$R$80,A77,[4]Outubro!$R$6:$R$80)","v":{"$error":"#VALUE!"}},{"$f":"SUMIF([5]Novembro!$A$6:$R$80,A77,[5]Novembro!$O$6:$O$80)","v":{"$error":"#VALUE!"}},{"$f":"SUMIF([5]Novembro!$A$6:$R$80,A77,[5]Novembro!$R$6:$R$80)","v":{"$error":"#VALUE!"}},{"$f":"SUMIF([6]Dezembro!$A$6:$R$80,C77,[6]Dezembro!$O$6:$O$80)","v":{"$error":"#VALUE!"}},{"$f":"SUMIF([6]Dezembro!$A$6:$R$80,C77,[6]Dezembro!$R$6:$R$80)","v":{"$error":"#VALUE!"}},0,0]
[250740,"Diego dos Santos Bispo",{"$f":"SUMIF(Janeiro!$B$6:$R$77,B78,Janeiro!$O$6:$O$77)","v":0},{"$f":"SUMIF(Janeiro!$B$6:$R$80,B78,Janeiro!$R$6:$R$80)","v":0},{"$f":"SUMIF(Fevereiro!$A$6:$R$77,A78,Fevereiro!$O$6:$O$77)","v":0},{"$f":"SUMIF(Fevereiro!$A$6:$R$77,A78,Fevereiro!$R$6:$R$77)","v":0},{"$f":"SUMIF(Março!$A$6:$R$80,A78,Março!$O$6:$O$80)","v":0},{"$f":"SUMIF(Março!$A$6:$R$80,A78,Março!$R$6:$R$80)","v":0},{"$f":"SUMIF(Abril!$A$6:$R$80,A78,Abril!$O$6:$O$80)","v":0},{"$f":"SUMIF(Abril!$A$6:$R$80,A78,Abril!$R$6:$R$80)","v":0},{"$f":"SUMIF(Maio!$A$6:$R$80,A78,Maio!$O$6:$O$80)","v":0},{"$f":"SUMIF(Maio!$A$6:$R$80,A78,Maio!$R$6:$R$80)","v":0},{"$f":"SUMIF(Junho!$A$6:$R$80,A78,Junho!$O$6:$O$80)","v":0},{"$f":"SUMIF(Junho!$A$6:$R$80,A78,Junho!$R$6:$R$80)","v":0},{"$f":"SUMIF(Julho!$A$6:$R$80,A78,Julho!$O$6:$O$80)","v":0},{"$f":"SUMIF(Julho!$A$6:$R$80,A78,Julho!$R$6:$R$80)","v":0},{"$f":"SUMIF([1]Agosto!$A$6:$R$80,A78,[1]Agosto!$O$6:$O$80)","v":{"$error":"#VALUE!"}},{"$f":"SUMIF([1]Agosto!$A$6:$R$80,A78,[1]Agosto!$R$6:$R$80)","v":{"$error":"#VALUE!"}},{"$f":"SUMIF([2]Setembro!$A$6:$R$80,A78,[2]Setembro!$O$6:$O$80)","v":{"$error":"#VALUE!"}},{"$f":"SUMIF([2]Setembro!$A$6:$R$80,A78,[2]Setembro!$R$6:$R$80)","v":{"$error":"#VALUE!"}},{"$f":"SUMIF([4]Outubro!$A$6:$R$80,A78,[4]Outubro!$O$6:$O$80)","v":{"$error":"#VALUE!"}},{"$f":"SUMIF([4]Outubro!$A$6:$R$80,A78,[4]Outubro!$R$6:$R$80)","v":{"$error":"#VALUE!"}},{"$f":"SUMIF([5]Novembro!$A$6:$R$80,A78,[5]Novembro!$O$6:$O$80)","v":{"$error":"#VALUE!"}},{"$f":"SUMIF([5]Novembro!$A$6:$R$80,A78,[5]Novembro!$R$6:$R$80)","v":{"$error":"#VALUE!"}},{"$f":"SUMIF([6]Dezembro!$A$6:$R$80,C78,[6]Dezembro!$O$6:$O$80)","v":{"$error":"#VALUE!"}},{"$f":"SUMIF([6]Dezembro!$A$6:$R$80,C78,[6]Dezembro!$R$6:$R$80)","v":{"$error":"#VALUE!"}},0,0]
[240257,"Apoena Soares Porto",{"$f":"SUMIF(Janeiro!$B$6:$R$77,B79,Janeiro!$O$6:$O$77)","v":0},{"$f":"SUMIF(Janeiro!$B$6:$R$80,B79,Janeiro!$R$6:$R$80)","v":0},{"$f":"SUMIF(Fevereiro!$A$6:$R$77,A79,Fevereiro!$O$6:$O$77)","v":0},{"$f":"SUMIF(Fevereiro!$A$6:$R$77,A79,Fevereiro!$R$6:$R$77)","v":0},{"$f":"SUMIF(Março!$A$6:$R$80,A79,Março!$O$6:$O$80)","v":0},{"$f":"SUMIF(Março!$A$6:$R$80,A79,Março!$R$6:$R$80)","v":0},{"$f":"SUMIF(Abril!$A$6:$R$80,A79,Abril!$O$6:$O$80)","v":0},{"$f":"SUMIF(Abril!$A$6:$R$80,A79,Abril!$R$6:$R$80)","v":0},{"$f":"SUMIF(Maio!$A$6:$R$80,A79,Maio!$O$6:$O$80)","v":0},{"$f":"SUMIF(Maio!$A$6:$R$80,A79,Maio!$R$6:$R$80)","v":0},{"$f":"SUMIF(Junho!$A$6:$R$80,A79,Junho!$O$6:$O$80)","v":0},{"$f":"SUMIF(Junho!$A$6:$R$80,A79,Junho!$R$6:$R$80)","v":0},{"$f":"SUMIF(Julho!$A$6:$R$80,A79,Julho!$O$6:$O$80)","v":0},{"$f":"SUMIF(Julho!$A$6:$R$80,A79,Julho!$R$6:$R$80)","v":0},{"$f":"SUMIF([1]Agosto!$A$6:$R$80,A79,[1]Agosto!$O$6:$O$80)","v":{"$error":"#VALUE!"}},{"$f":"SUMIF([1]Agosto!$A$6:$R$80,A79,[1]Agosto!$R$6:$R$80)","v":{"$error":"#VALUE!"}},{"$f":"SUMIF([2]Setembro!$A$6:$R$80,A79,[2]Setembro!$O$6:$O$80)","v":{"$error":"#VALUE!"}},{"$f":"SUMIF([2]Setembro!$A$6:$R$80,A79,[2]Setembro!$R$6:$R$80)","v":{"$error":"#VALUE!"}},{"$f":"SUMIF([4]Outubro!$A$6:$R$80,A79,[4]Outubro!$O$6:$O$80)","v":{"$error":"#VALUE!"}},{"$f":"SUMIF([4]Outubro!$A$6:$R$80,A79,[4]Outubro!$R$6:$R$80)","v":{"$error":"#VALUE!"}},{"$f":"SUMIF([5]Novembro!$A$6:$R$80,A79,[5]Novembro!$O$6:$O$80)","v":{"$error":"#VALUE!"}},{"$f":"SUMIF([5]Novembro!$A$6:$R$80,A79,[5]Novembro!$R$6:$R$80)","v":{"$error":"#VALUE!"}},{"$f":"SUMIF([6]Dezembro!$A$6:$R$80,C79,[6]Dezembro!$O$6:$O$80)","v":{"$error":"#VALUE!"}},{"$f":"SUMIF([6]Dezembro!$A$6:$R$80,C79,[6]Dezembro!$R$6:$R$80)","v":{"$error":"#VALUE!"}},0,0]
[186970,"Magnólia Gomes",{"$f":"SUMIF(Janeiro!$B$6:$R$77,B80,Janeiro!$O$6:$O$77)","v":0},{"$f":"SUMIF(Janeiro!$B$6:$R$80,B80,Janeiro!$R$6:$R$80)","v":0},{"$f":"SUMIF(Fevereiro!$A$6:$R$77,A80,Fevereiro!$O$6:$O$77)","v":0},{"$f":"SUMIF(Fevereiro!$A$6:$R$77,A80,Fevereiro!$R$6:$R$77)","v":0},{"$f":"SUMIF(Março!$A$6:$R$80,A80,Março!$O$6:$O$80)","v":0},{"$f":"SUMIF(Março!$A$6:$R$80,A80,Março!$R$6:$R$80)","v":0},{"$f":"SUMIF(Abril!$A$6:$R$80,A80,Abril!$O$6:$O$80)","v":0},{"$f":"SUMIF(Abril!$A$6:$R$80,A80,Abril!$R$6:$R$80)","v":0},{"$f":"SUMIF(Maio!$A$6:$R$80,A80,Maio!$O$6:$O$80)","v":0},{"$f":"SUMIF(Maio!$A$6:$R$80,A80,Maio!$R$6:$R$80)","v":0},{"$f":"SUMIF(Junho!$A$6:$R$80,A80,Junho!$O$6:$O$80)","v":0},{"$f":"SUMIF(Junho!$A$6:$R$80,A80,Junho!$R$6:$R$80)","v":0},{"$f":"SUMIF(Julho!$A$6:$R$80,A80,Julho!$O$6:$O$80)","v":0},{"$f":"SUMIF(Julho!$A$6:$R$80,A80,Julho!$R$6:$R$80)","v":0},{"$f":"SUMIF([1]Agosto!$A$6:$R$80,A80,[1]Agosto!$O$6:$O$80)","v":{"$error":"#VALUE!"}},{"$f":"SUMIF([1]Agosto!$A$6:$R$80,A80,[1]Agosto!$R$6:$R$80)","v":{"$error":"#VALUE!"}},{"$f":"SUMIF([2]Setembro!$A$6:$R$80,A80,[2]Setembro!$O$6:$O$80)","v":{"$error":"#VALUE!"}},{"$f":"SUMIF([2]Setembro!$A$6:$R$80,A80,[2]Setembro!$R$6:$R$80)","v":{"$error":"#VALUE!"}},{"$f":"SUMIF([4]Outubro!$A$6:$R$80,A80,[4]Outubro!$O$6:$O$80)","v":{"$error":"#VALUE!"}},{"$f":"SUMIF([4]Outubro!$A$6:$R$80,A80,[4]Outubro!$R$6:$R$80)","v":{"$error":"#VALUE!"}},{"$f":"SUMIF([5]Novembro!$A$6:$R$80,A80,[5]Novembro!$O$6:$O$80)","v":{"$error":"#VALUE!"}},{"$f":"SUMIF([5]Novembro!$A$6:$R$80,A80,[5]Novembro!$R$6:$R$80)","v":{"$error":"#VALUE!"}},{"$f":"SUMIF([6]Dezembro!$A$6:$R$80,C80,[6]Dezembro!$O$6:$O$80)","v":{"$error":"#VALUE!"}},{"$f":"SUMIF([6]Dezembro!$A$6:$R$80,C80,[6]Dezembro!$R$6:$R$80)","v":{"$error":"#VALUE!"}},{"$f":"IF(ISERROR(C80),0,C80)+IF(ISERROR(E80),0,E80)+IF(ISERROR(G80),0,G80)+IF(ISERROR(I80),0,I80)+IF(ISERROR(K80),0,K80)+IF(ISERROR(M80),0,M80)+IF(ISERROR(O80),0,O80)+IF(ISERROR(Q80),0,Q80)+IF(ISERROR(S80),0,S80)+IF(ISERROR(U80),0,U80)+IF(ISERROR(W80),0,W80)+IF(ISERROR(Y80),0,Y80)","v":0},{"$f":"IF(ISERROR(D80),0,D80)+IF(ISERROR(F80),0,F80)+IF(ISERROR(H80),0,H80)+IF(ISERROR(J80),0,J80)+IF(ISERROR(L80),0,L80)+IF(ISERROR(N80),0,N80)+IF(ISERROR(P80),0,P80)+IF(ISERROR(R80),0,R80)+IF(ISERROR(T80),0,T80)+IF(ISERROR(V80),0,V80)+IF(ISERROR(X80),0,X80)+IF(ISERROR(Z80),0,Z80)","v":0}]
[215856,"Job Cláudio dos Santos Nascimento",{"$f":"SUMIF(Janeiro!$B$6:$R$77,B81,Janeiro!$O$6:$O$77)","v":0},{"$f":"SUMIF(Janeiro!$B$6:$R$80,B81,Janeiro!$R$6:$R$80)","v":0},{"$f":"SUMIF(Fevereiro!$A$6:$R$77,A81,Fevereiro!$O$6:$O$77)","v":0},{"$f":"SUMIF(Fevereiro!$A$6:$R$77,A81,Fevereiro!$R$6:$R$77)","v":0},{"$f":"SUMIF(Março!$A$6:$R$80,A81,Março!$O$6:$O$80)","v":0},{"$f":"SUMIF(Março!$A$6:$R$80,A81,Março!$R$6:$R$80)","v":0},{"$f":"SUMIF(Abril!$A$6:$R$80,A81,Abril!$O$6:$O$80)","v":38},{"$f":"SUMIF(Abril!$A$6:$R$80,A81,Abril!$R$6:$R$80)","v":117.8},{"$f":"SUMIF(Maio!$A$6:$R$80,A81,Maio!$O$6:$O$80)","v":0},{"$f":"SUMIF(Maio!$A$6:$R$80,A81,Maio!$R$6:$R$80)","v":0},{"$f":"SUMIF(Junho!$A$6:$R$80,A81,Junho!$O$6:$O$80)","v":0},{"$f":"SUMIF(Junho!$A$6:$R$80,A81,Junho!$R$6:$R$80)","v":0},{"$f":"SUMIF(Julho!$A$6:$R$80,A81,Julho!$O$6:$O$80)","v":0},{"$f":"SUMIF(Julho!$A$6:$R$80,A81,Julho!$R$6:$R$80)","v":0},{"$f":"SUMIF([1]Agosto!$A$6:$R$80,A81,[1]Agosto!$O$6:$O$80)","v":{"$error":"#VALUE!"}},{"$f":"SUMIF([1]Agosto!$A$6:$R$80,A81,[1]Agosto!$R$6:$R$80)","v":{"$error":"#VALUE!"}},{"$f":"SUMIF([2]Setembro!$A$6:$R$80,A81,[2]Setembro!$O$6:$O$80)","v":{"$error":"#VALUE!"}},{"$f":"SUMIF([2]Setembro!$A$6:$R$80,A81,[2]Setembro!$R$6:$R$80)","v":{"$error":"#VALUE!"}},{"$f":"SUMIF([4]Outubro!$A$6:$R$80,A81,[4]Outubro!$O$6:$O$80)","v":{"$error":"#VALUE!"}},{"$f":"SUMIF([4]Outubro!$A$6:$R$80,A81,[4]Outubro!$R$6:$R$80)","v":{"$error":"#VALUE!"}},{"$f":"SUMIF([5]Novembro!$A$6:$R$80,A81,[5]Novembro!$O$6:$O$80)","v":{"$error":"#VALUE!"}},{"$f":"SUMIF([5]Novembro!$A$6:$R$80,A81,[5]Novembro!$R$6:$R$80)","v":{"$error":"#VALUE!"}},{"$f":"SUMIF([6]Dezembro!$A$6:$R$80,C81,[6]Dezembro!$O$6:$O$80)","v":{"$error":"#VALUE!"}},{"$f":"SUMIF([6]Dezembro!$A$6:$R$80,C81,[6]Dezembro!$R$6:$R$80)","v":{"$error":"#VALUE!"}},38,117.8]
[218375,"Bruno Brito Borges",{"$f":"SUMIF(Janeiro!$B$6:$R$77,B82,Janeiro!$O$6:$O$77)","v":0},{"$f":"SUMIF(Janeiro!$B$6:$R$80,B82,Janeiro!$R$6:$R$80)","v":0},{"$f":"SUMIF(Fevereiro!$A$6:$R$77,A82,Fevereiro!$O$6:$O$77)","v":0},{"$f":"SUMIF(Fevereiro!$A$6:$R$77,A82,Fevereiro!$R$6:$R$77)","v":0},{"$f":"SUMIF(Março!$A$6:$R$80,A82,Março!$O$6:$O$80)","v":0},{"$f":"SUMIF(Março!$A$6:$R$80,A82,Março!$R$6:$R$80)","v":0},{"$f":"SUMIF(Abril!$A$6:$R$80,A82,Abril!$O$6:$O$80)","v":0},{"$f":"SUMIF(Abril!$A$6:$R$80,A82,Abril!$R$6:$R$80)","v":0},{"$f":"SUMIF(Maio!$A$6:$R$80,A82,Maio!$O$6:$O$80)","v":0},{"$f":"SUMIF(Maio!$A$6:$R$80,A82,Maio!$R$6:$R$80)","v":0},{"$f":"SUMIF(Junho!$A$6:$R$80,A82,Junho!$O$6:$O$80)","v":0},{"$f":"SUMIF(Junho!$A$6:$R$80,A82,Junho!$R$6:$R$80)","v":0},{"$f":"SUMIF(Julho!$A$6:$R$80,A82,Julho!$O$6:$O$80)","v":0},{"$f":"SUMIF(Julho!$A$6:$R$80,A82,Julho!$R$6:$R$80)","v":0},{"$f":"SUMIF([1]Agosto!$A$6:$R$80,A82,[1]Agosto!$O$6:$O$80)","v":{"$error":"#VALUE!"}},{"$f":"SUMIF([1]Agosto!$A$6:$R$80,A82,[1]Agosto!$R$6:$R$80)","v":{"$error":"#VALUE!"}},{"$f":"SUMIF([2]Setembro!$A$6:$R$80,A82,[2]Setembro!$O$6:$O$80)","v":{"$error":"#VALUE!"}},{"$f":"SUMIF([2]Setembro!$A$6:$R$80,A82,[2]Setembro!$R$6:$R$80)","v":{"$error":"#VALUE!"}},{"$f":"SUMIF([4]Outubro!$A$6:$R$80,A82,[4]Outubro!$O$6:$O$80)","v":{"$error":"#VALUE!"}},{"$f":"SUMIF([4]Outubro!$A$6:$R$80,A82,[4]Outubro!$R$6:$R$80)","v":{"$error":"#VALUE!"}},{"$f":"SUMIF([5]Novembro!$A$6:$R$80,A82,[5]Novembro!$O$6:$O$80)","v":{"$error":"#VALUE!"}},{"$f":"SUMIF([5]Novembro!$A$6:$R$80,A82,[5]Novembro!$R$6:$R$80)","v":{"$error":"#VALUE!"}},{"$f":"SUMIF([6]Dezembro!$A$6:$R$80,C82,[6]Dezembro!$O$6:$O$80)","v":{"$error":"#VALUE!"}},{"$f":"SUMIF([6]Dezembro!$A$6:$R$80,C82,[6]Dezembro!$R$6:$R$80)","v":{"$error":"#VALUE!"}},0,0]
[252638,"Wallace Kelvin Lima dos Santos",{"$f":"SUMIF(Janeiro!$B$6:$R$77,B83,Janeiro!$O$6:$O$77)","v":0},{"$f":"SUMIF(Janeiro!$B$6:$R$80,B83,Janeiro!$R$6:$R$80)","v":0},{"$f":"SUMIF(Fevereiro!$A$6:$R$77,A83,Fevereiro!$O$6:$O$77)","v":0},{"$f":"SUMIF(Fevereiro!$A$6:$R$77,A83,Fevereiro!$R$6:$R$77)","v":0},{"$f":"SUMIF(Março!$A$6:$R$80,A83,Março!$O$6:$O$80)","v":0},{"$f":"SUMIF(Março!$A$6:$R$80,A83,Março!$R$6:$R$80)","v":0},{"$f":"SUMIF(Abril!$A$6:$R$80,A83,Abril!$O$6:$O$80)","v":0},{"$f":"SUMIF(Abril!$A$6:$R$80,A83,Abril!$R$6:$R$80)","v":0},{"$f":"SUMIF(Maio!$A$6:$R$80,A83,Maio!$O$6:$O$80)","v":0},{"$f":"SUMIF(Maio!$A$6:$R$80,A83,Maio!$R$6:$R$80)","v":0},{"$f":"SUMIF(Junho!$A$6:$R$80,A83,Junho!$O$6:$O$80)","v":0},{"$f":"SUMIF(Junho!$A$6:$R$80,A83,Junho!$R$6:$R$80)","v":0},{"$f":"SUMIF(Julho!$A$6:$R$80,A83,Julho!$O$6:$O$80)","v":0},{"$f":"SUMIF(Julho!$A$6:$R$80,A83,Julho!$R$6:$R$80)","v":0},{"$f":"SUMIF([1]Agosto!$A$6:$R$80,A83,[1]Agosto!$O$6:$O$80)","v":{"$error":"#VALUE!"}},{"$f":"SUMIF([1]Agosto!$A$6:$R$80,A83,[1]Agosto!$R$6:$R$80)","v":{"$error":"#VALUE!"}},{"$f":"SUMIF([2]Setembro!$A$6:$R$80,A83,[2]Setembro!$O$6:$O$80)","v":{"$error":"#VALUE!"}},{"$f":"SUMIF([2]Setembro!$A$6:$R$80,A83,[2]Setembro!$R$6:$R$80)","v":{"$error":"#VALUE!"}},{"$f":"SUMIF([4]Outubro!$A$6:$R$80,A83,[4]Outubro!$O$6:$O$80)","v":{"$error":"#VALUE!"}},{"$f":"SUMIF([4]Outubro!$A$6:$R$80,A83,[4]Outubro!$R$6:$R$80)","v":{"$error":"#VALUE!"}},{"$f":"SUMIF([5]Novembro!$A$6:$R$80,A83,[5]Novembro!$O$6:$O$80)","v":{"$error":"#VALUE!"}},{"$f":"SUMIF([5]Novembro!$A$6:$R$80,A83,[5]Novembro!$R$6:$R$80)","v":{"$error":"#VALUE!"}},{"$f":"SUMIF([6]Dezembro!$A$6:$R$80,C83,[6]Dezembro!$O$6:$O$80)","v":{"$error":"#VALUE!"}},{"$f":"SUMIF([6]Dezembro!$A$6:$R$80,C83,[6]Dezembro!$R$6:$R$80)","v":{"$error":"#VALUE!"}},0,0]
[78239,"Carlos Alberto Dias",{"$f":"SUMIF(Janeiro!$B$6:$R$77,B84,Janeiro!$O$6:$O$77)","v":0},{"$f":"SUMIF(Janeiro!$B$6:$R$80,B84,Janeiro!$R$6:$R$80)","v":0},{"$f":"SUMIF(Fevereiro!$A$6:$R$77,A84,Fevereiro!$O$6:$O$77)","v":0},{"$f":"SUMIF(Fevereiro!$A$6:$R$77,A84,Fevereiro!$R$6:$R$77)","v":0},{"$f":"SUMIF(Março!$A$6:$R$80,A84,Março!$O$6:$O$80)","v":0},{"$f":"SUMIF(Março!$A$6:$R$80,A84,Março!$R$6:$R$80)","v":0},{"$f":"SUMIF(Abril!$A$6:$R$80,A84,Abril!$O$6:$O$80)","v":0},{"$f":"SUMIF(Abril!$A$6:$R$80,A84,Abril!$R$6:$R$80)","v":0},{"$f":"SUMIF(Maio!$A$6:$R$80,A84,Maio!$O$6:$O$80)","v":0},{"$f":"SUMIF(Maio!$A$6:$R$80,A84,Maio!$R$6:$R$80)","v":0},{"$f":"SUMIF(Junho!$A$6:$R$80,A84,Junho!$O$6:$O$80)","v":0},{"$f":"SUMIF(Junho!$A$6:$R$80,A84,Junho!$R$6:$R$80)","v":0},{"$f":"SUMIF(Julho!$A$6:$R$80,A84,Julho!$O$6:$O$80)","v":0},{"$f":"SUMIF(Julho!$A$6:$R$80,A84,Julho!$R$6:$R$80)","v":0},{"$f":"SUMIF([1]Agosto!$A$6:$R$80,A84,[1]Agosto!$O$6:$O$80)","v":{"$error":"#VALUE!"}},{"$f":"SUMIF([1]Agosto!$A$6:$R$80,A84,[1]Agosto!$R$6:$R$80)","v":{"$error":"#VALUE!"}},{"$f":"SUMIF([2]Setembro!$A$6:$R$80,A84,[2]Setembro!$O$6:$O$80)","v":{"$error":"#VALUE!"}},{"$f":"SUMIF([2]Setembro!$A$6:$R$80,A84,[2]Setembro!$R$6:$R$80)","v":{"$error":"#VALUE!"}},{"$f":"SUMIF([4]Outubro!$A$6:$R$80,A84,[4]Outubro!$O$6:$O$80)","v":{"$error":"#VALUE!"}},{"$f":"SUMIF([4]Outubro!$A$6:$R$80,A84,[4]Outubro!$R$6:$R$80)","v":{"$error":"#VALUE!"}},{"$f":"SUMIF([5]Novembro!$A$6:$R$80,A84,[5]Novembro!$O$6:$O$80)","v":{"$error":"#VALUE!"}},{"$f":"SUMIF([5]Novembro!$A$6:$R$80,A84,[5]Novembro!$R$6:$R$80)","v":{"$error":"#VALUE!"}},{"$f":"SUMIF([6]Dezembro!$A$6:$R$80,C84,[6]Dezembro!$O$6:$O$80)","v":{"$error":"#VALUE!"}},{"$f":"SUMIF([6]Dezembro!$A$6:$R$80,C84,[6]Dezembro!$R$6:$R$80)","v":{"$error":"#VALUE!"}},0,0]
[187739,"Valdivina Souza",{"$f":"SUMIF(Janeiro!$B$6:$R$77,B85,Janeiro!$O$6:$O$77)","v":0},{"$f":"SUMIF(Janeiro!$B$6:$R$80,B85,Janeiro!$R$6:$R$80)","v":0},{"$f":"SUMIF(Fevereiro!$A$6:$R$77,A85,Fevereiro!$O$6:$O$77)","v":0},{"$f":"SUMIF(Fevereiro!$A$6:$R$77,A85,Fevereiro!$R$6:$R$77)","v":0},{"$f":"SUMIF(Março!$A$6:$R$80,A85,Março!$O$6:$O$80)","v":0},{"$f":"SUMIF(Março!$A$6:$R$80,A85,Março!$R$6:$R$80)","v":0},{"$f":"SUMIF(Abril!$A$6:$R$80,A85,Abril!$O$6:$O$80)","v":0},{"$f":"SUMIF(Abril!$A$6:$R$80,A85,Abril!$R$6:$R$80)","v":0},{"$f":"SUMIF(Maio!$A$6:$R$80,A85,Maio!$O$6:$O$80)","v":0},{"$f":"SUMIF(Maio!$A$6:$R$80,A85,Maio!$R$6:$R$80)","v":0},{"$f":"SUMIF(Junho!$A$6:$R$80,A85,Junho!$O$6:$O$80)","v":0},{"$f":"SUMIF(Junho!$A$6:$R$80,A85,Junho!$R$6:$R$80)","v":0},{"$f":"SUMIF(Julho!$A$6:$R$80,A85,Julho!$O$6:$O$80)","v":0},{"$f":"SUMIF(Julho!$A$6:$R$80,A85,Julho!$R$6:$R$80)","v":0},{"$f":"SUMIF([1]Agosto!$A$6:$R$80,A85,[1]Agosto!$O$6:$O$80)","v":{"$error":"#VALUE!"}},{"$f":"SUMIF([1]Agosto!$A$6:$R$80,A85,[1]Agosto!$R$6:$R$80)","v":{"$error":"#VALUE!"}},{"$f":"SUMIF([2]Setembro!$A$6:$R$80,A85,[2]Setembro!$O$6:$O$80)","v":{"$error":"#VALUE!"}},{"$f":"SUMIF([2]Setembro!$A$6:$R$80,A85,[2]Setembro!$R$6:$R$80)","v":{"$error":"#VALUE!"}},{"$f":"SUMIF([4]Outubro!$A$6:$R$80,A85,[4]Outubro!$O$6:$O$80)","v":{"$error":"#VALUE!"}},{"$f":"SUMIF([4]Outubro!$A$6:$R$80,A85,[4]Outubro!$R$6:$R$80)","v":{"$error":"#VALUE!"}},{"$f":"SUMIF([5]Novembro!$A$6:$R$80,A85,[5]Novembro!$O$6:$O$80)","v":{"$error":"#VALUE!"}},{"$f":"SUMIF([5]Novembro!$A$6:$R$80,A85,[5]Novembro!$R$6:$R$80)","v":{"$error":"#VALUE!"}},{"$f":"SUMIF([6]Dezembro!$A$6:$R$80,C85,[6]Dezembro!$O$6:$O$80)","v":{"$error":"#VALUE!"}},{"$f":"SUMIF([6]Dezembro!$A$6:$R$80,C85,[6]Dezembro!$R$6:$R$80)","v":{"$error":"#VALUE!"}},0,0]
[250732,"Melissa Thais Menezes Teixeira",{"$f":"SUMIF(Janeiro!$B$6:$R$77,B86,Janeiro!$O$6:$O$77)","v":0},{"$f":"SUMIF(Janeiro!$B$6:$R$80,B86,Janeiro!$R$6:$R$80)","v":0},{"$f":"SUMIF(Fevereiro!$A$6:$R$77,A86,Fevereiro!$O$6:$O$77)","v":0},{"$f":"SUMIF(Fevereiro!$A$6:$R$77,A86,Fevereiro!$R$6:$R$77)","v":0},{"$f":"SUMIF(Março!$A$6:$R$80,A86,Março!$O$6:$O$80)","v":0},{"$f":"SUMIF(Março!$A$6:$R$80,A86,Março!$R$6:$R$80)","v":0},{"$f":"SUMIF(Abril!$A$6:$R$80,A86,Abril!$O$6:$O$80)","v":0},{"$f":"SUMIF(Abril!$A$6:$R$80,A86,Abril!$R$6:$R$80)","v":0},{"$f":"SUMIF(Maio!$A$6:$R$80,A86,Maio!$O$6:$O$80)","v":0},{"$f":"SUMIF(Maio!$A$6:$R$80,A86,Maio!$R$6:$R$80)","v":0},{"$f":"SUMIF(Junho!$A$6:$R$80,A86,Junho!$O$6:$O$80)","v":0},{"$f":"SUMIF(Junho!$A$6:$R$80,A86,Junho!$R$6:$R$80)","v":0},{"$f":"SUMIF(Julho!$A$6:$R$80,A86,Julho!$O$6:$O$80)","v":0},{"$f":"SUMIF(Julho!$A$6:$R$80,A86,Julho!$R$6:$R$80)","v":0},{"$f":"SUMIF([1]Agosto!$A$6:$R$80,A86,[1]Agosto!$O$6:$O$80)","v":{"$error":"#VALUE!"}},{"$f":"SUMIF([1]Agosto!$A$6:$R$80,A86,[1]Agosto!$R$6:$R$80)","v":{"$error":"#VALUE!"}},{"$f":"SUMIF([2]Setembro!$A$6:$R$80,A86,[2]Setembro!$O$6:$O$80)","v":{"$error":"#VALUE!"}},{"$f":"SUMIF([2]Setembro!$A$6:$R$80,A86,[2]Setembro!$R$6:$R$80)","v":{"$error":"#VALUE!"}},{"$f":"SUMIF([4]Outubro!$A$6:$R$80,A86,[4]Outubro!$O$6:$O$80)","v":{"$error":"#VALUE!"}},{"$f":"SUMIF([4]Outubro!$A$6:$R$80,A86,[4]Outubro!$R$6:$R$80)","v":{"$error":"#VALUE!"}},{"$f":"SUMIF([5]Novembro!$A$6:$R$80,A86,[5]Novembro!$O$6:$O$80)","v":{"$error":"#VALUE!"}},{"$f":"SUMIF([5]Novembro!$A$6:$R$80,A86,[5]Novembro!$R$6:$R$80)","v":{"$error":"#VALUE!"}},{"$f":"SUMIF([6]Dezembro!$A$6:$R$80,C86,[6]Dezembro!$O$6:$O$80)","v":{"$error":"#VALUE!"}},{"$f":"SUMIF([6]Dezembro!$A$6:$R$80,C86,[6]Dezembro!$R$6:$R$80)","v":{"$error":"#VALUE!"}},0,0]
[248509,"Gerôncio Alves de A. Júnior",{"$f":"SUMIF(Janeiro!$B$6:$R$77,B87,Janeiro!$O$6:$O$77)","v":0},{"$f":"SUMIF(Janeiro!$B$6:$R$80,B87,Janeiro!$R$6:$R$80)","v":0},{"$f":"SUMIF(Fevereiro!$A$6:$R$77,A87,Fevereiro!$O$6:$O$77)","v":0},{"$f":"SUMIF(Fevereiro!$A$6:$R$77,A87,Fevereiro!$R$6:$R$77)","v":0},{"$f":"SUMIF(Março!$A$6:$R$80,A87,Março!$O$6:$O$80)","v":0},{"$f":"SUMIF(Março!$A$6:$R$80,A87,Março!$R$6:$R$80)","v":0},{"$f":"SUMIF(Abril!$A$6:$R$80,A87,Abril!$O$6:$O$80)","v":0},{"$f":"SUMIF(Abril!$A$6:$R$80,A87,Abril!$R$6:$R$80)","v":0},{"$f":"SUMIF(Maio!$A$6:$R$80,A87,Maio!$O$6:$O$80)","v":0},{"$f":"SUMIF(Maio!$A$6:$R$80,A87,Maio!$R$6:$R$80)","v":0},{"$f":"SUMIF(Junho!$A$6:$R$80,A87,Junho!$O$6:$O$80)","v":0},{"$f":"SUMIF(Junho!$A$6:$R$80,A87,Junho!$R$6:$R$80)","v":0},{"$f":"SUMIF(Julho!$A$6:$R$80,A87,Julho!$O$6:$O$80)","v":0},{"$f":"SUMIF(Julho!$A$6:$R$80,A87,Julho!$R$6:$R$80)","v":0},{"$f":"SUMIF([1]Agosto!$A$6:$R$80,A87,[1]Agosto!$O$6:$O$80)","v":{"$error":"#VALUE!"}},{"$f":"SUMIF([1]Agosto!$A$6:$R$80,A87,[1]Agosto!$R$6:$R$80)","v":{"$error":"#VALUE!"}},{"$f":"SUMIF([2]Setembro!$A$6:$R$80,A87,[2]Setembro!$O$6:$O$80)","v":{"$error":"#VALUE!"}},{"$f":"SUMIF([2]Setembro!$A$6:$R$80,A87,[2]Setembro!$R$6:$R$80)","v":{"$error":"#VALUE!"}},{"$f":"SUMIF([4]Outubro!$A$6:$R$80,A87,[4]Outubro!$O$6:$O$80)","v":{"$error":"#VALUE!"}},{"$f":"SUMIF([4]Outubro!$A$6:$R$80,A87,[4]Outubro!$R$6:$R$80)","v":{"$error":"#VALUE!"}},{"$f":"SUMIF([5]Novembro!$A$6:$R$80,A87,[5]Novembro!$O$6:$O$80)","v":{"$error":"#VALUE!"}},{"$f":"SUMIF([5]Novembro!$A$6:$R$80,A87,[5]Novembro!$R$6:$R$80)","v":{"$error":"#VALUE!"}},{"$f":"SUMIF([6]Dezembro!$A$6:$R$80,C87,[6]Dezembro!$O$6:$O$80)","v":{"$error":"#VALUE!"}},{"$f":"SUMIF([6]Dezembro!$A$6:$R$80,C87,[6]Dezembro!$R$6:$R$80)","v":{"$error":"#VALUE!"}},0,0]
[110213,"Telma Maria Souza",{"$f":"SUMIF(Janeiro!$B$6:$R$77,B88,Janeiro!$O$6:$O$77)","v":0},{"$f":"SUMIF(Janeiro!$B$6:$R$80,B88,Janeiro!$R$6:$R$80)","v":0},{"$f":"SUMIF(Fevereiro!$A$6:$R$77,A88,Fevereiro!$O$6:$O$77)","v":0},{"$f":"SUMIF(Fevereiro!$A$6:$R$77,A88,Fevereiro!$R$6:$R$77)","v":0},{"$f":"SUMIF(Março!$A$6:$R$80,A88,Março!$O$6:$O$80)","v":0},{"$f":"SUMIF(Março!$A$6:$R$80,A88,Março!$R$6:$R$80)","v":0},{"$f":"SUMIF(Abril!$A$6:$R$80,A88,Abril!$O$6:$O$80)","v":0},{"$f":"SUMIF(Abril!$A$6:$R$80,A88,Abril!$R$6:$R$80)","v":0},{"$f":"SUMIF(Maio!$A$6:$R$80,A88,Maio!$O$6:$O$80)","v":0},{"$f":"SUMIF(Maio!$A$6:$R$80,A88,Maio!$R$6:$R$80)","v":0},{"$f":"SUMIF(Junho!$A$6:$R$80,A88,Junho!$O$6:$O$80)","v":0},{"$f":"SUMIF(Junho!$A$6:$R$80,A88,Junho!$R$6:$R$80)","v":0},{"$f":"SUMIF(Julho!$A$6:$R$80,A88,Julho!$O$6:$O$80)","v":0},{"$f":"SUMIF(Julho!$A$6:$R$80,A88,Julho!$R$6:$R$80)","v":0},{"$f":"SUMIF([1]Agosto!$A$6:$R$80,A88,[1]Agosto!$O$6:$O$80)","v":{"$error":"#VALUE!"}},{"$f":"SUMIF([1]Agosto!$A$6:$R$80,A88,[1]Agosto!$R$6:$R$80)","v":{"$error":"#VALUE!"}},{"$f":"SUMIF([2]Setembro!$A$6:$R$80,A88,[2]Setembro!$O$6:$O$80)","v":{"$error":"#VALUE!"}},{"$f":"SUMIF([2]Setembro!$A$6:$R$80,A88,[2]Setembro!$R$6:$R$80)","v":{"$error":"#VALUE!"}},{"$f":"SUMIF([4]Outubro!$A$6:$R$80,A88,[4]Outubro!$O$6:$O$80)","v":{"$error":"#VALUE!"}},{"$f":"SUMIF([4]Outubro!$A$6:$R$80,A88,[4]Outubro!$R$6:$R$80)","v":{"$error":"#VALUE!"}},{"$f":"SUMIF([5]Novembro!$A$6:$R$80,A88,[5]Novembro!$O$6:$O$80)","v":{"$error":"#VALUE!"}},{"$f":"SUMIF([5]Novembro!$A$6:$R$80,A88,[5]Novembro!$R$6:$R$80)","v":{"$error":"#VALUE!"}},{"$f":"SUMIF([6]Dezembro!$A$6:$R$80,C88,[6]Dezembro!$O$6:$O$80)","v":{"$error":"#VALUE!"}},{"$f":"SUMIF([6]Dezembro!$A$6:$R$80,C88,[6]Dezembro!$R$6:$R$80)","v":{"$error":"#VALUE!"}},0,0]
[188506,"Vera Lúcia Barbosa",{"$f":"SUMIF(Janeiro!$B$6:$R$77,B89,Janeiro!$O$6:$O$77)","v":0},{"$f":"SUMIF(Janeiro!$B$6:$R$80,B89,Janeiro!$R$6:$R$80)","v":0},{"$f":"SUMIF(Fevereiro!$A$6:$R$77,A89,Fevereiro!$O$6:$O$77)","v":0},{"$f":"SUMIF(Fevereiro!$A$6:$R$77,A89,Fevereiro!$R$6:$R$77)","v":0},{"$f":"SUMIF(Março!$A$6:$R$80,A89,Março!$O$6:$O$80)","v":0},{"$f":"SUMIF(Março!$A$6:$R$80,A89,Março!$R$6:$R$80)","v":0},{"$f":"SUMIF(Abril!$A$6:$R$80,A89,Abril!$O$6:$O$80)","v":0},{"$f":"SUMIF(Abril!$A$6:$R$80,A89,Abril!$R$6:$R$80)","v":0},{"$f":"SUMIF(Maio!$A$6:$R$80,A89,Maio!$O$6:$O$80)","v":0},{"$f":"SUMIF(Maio!$A$6:$R$80,A89,Maio!$R$6:$R$80)","v":0},{"$f":"SUMIF(Junho!$A$6:$R$80,A89,Junho!$O$6:$O$80)","v":0},{"$f":"SUMIF(Junho!$A$6:$R$80,A89,Junho!$R$6:$R$80)","v":0},{"$f":"SUMIF(Julho!$A$6:$R$80,A89,Julho!$O$6:$O$80)","v":0},{"$f":"SUMIF(Julho!$A$6:$R$80,A89,Julho!$R$6:$R$80)","v":0},{"$f":"SUMIF([1]Agosto!$A$6:$R$80,A89,[1]Agosto!$O$6:$O$80)","v":{"$error":"#VALUE!"}},{"$f":"SUMIF([1]Agosto!$A$6:$R$80,A89,[1]Agosto!$R$6:$R$80)","v":{"$error":"#VALUE!"}},{"$f":"SUMIF([2]Setembro!$A$6:$R$80,A89,[2]Setembro!$O$6:$O$80)","v":{"$error":"#VALUE!"}},{"$f":"SUMIF([2]Setembro!$A$6:$R$80,A89,[2]Setembro!$R$6:$R$80)","v":{"$error":"#VALUE!"}},{"$f":"SUMIF([4]Outubro!$A$6:$R$80,A89,[4]Outubro!$O$6:$O$80)","v":{"$error":"#VALUE!"}},{"$f":"SUMIF([4]Outubro!$A$6:$R$80,A89,[4]Outubro!$R$6:$R$80)","v":{"$error":"#VALUE!"}},{"$f":"SUMIF([5]Novembro!$A$6:$R$80,A89,[5]Novembro!$O$6:$O$80)","v":{"$error":"#VALUE!"}},{"$f":"SUMIF([5]Novembro!$A$6:$R$80,A89,[5]Novembro!$R$6:$R$80)","v":{"$error":"#VALUE!"}},{"$f":"SUMIF([6]Dezembro!$A$6:$R$80,C89,[6]Dezembro!$O$6:$O$80)","v":{"$error":"#VALUE!"}},{"$f":"SUMIF([6]Dezembro!$A$6:$R$80,C89,[6]Dezembro!$R$6:$R$80)","v":{"$error":"#VALUE!"}},0,0]
[187704,"Ivaneide Moreira",{"$f":"SUMIF(Janeiro!$B$6:$R$77,B90,Janeiro!$O$6:$O$77)","v":0},{"$f":"SUMIF(Janeiro!$B$6:$R$80,B90,Janeiro!$R$6:$R$80)","v":0},{"$f":"SUMIF(Fevereiro!$A$6:$R$77,A90,Fevereiro!$O$6:$O$77)","v":0},{"$f":"SUMIF(Fevereiro!$A$6:$R$77,A90,Fevereiro!$R$6:$R$77)","v":0},{"$f":"SUMIF(Março!$A$6:$R$80,A90,Março!$O$6:$O$80)","v":0},{"$f":"SUMIF(Março!$A$6:$R$80,A90,Março!$R$6:$R$80)","v":0},{"$f":"SUMIF(Abril!$A$6:$R$80,A90,Abril!$O$6:$O$80)","v":0},{"$f":"SUMIF(Abril!$A$6:$R$80,A90,Abril!$R$6:$R$80)","v":0},{"$f":"SUMIF(Maio!$A$6:$R$80,A90,Maio!$O$6:$O$80)","v":0},{"$f":"SUMIF(Maio!$A$6:$R$80,A90,Maio!$R$6:$R$80)","v":0},{"$f":"SUMIF(Junho!$A$6:$R$80,A90,Junho!$O$6:$O$80)","v":0},{"$f":"SUMIF(Junho!$A$6:$R$80,A90,Junho!$R$6:$R$80)","v":0},{"$f":"SUMIF(Julho!$A$6:$R$80,A90,Julho!$O$6:$O$80)","v":0},{"$f":"SUMIF(Julho!$A$6:$R$80,A90,Julho!$R$6:$R$80)","v":0},{"$f":"SUMIF([1]Agosto!$A$6:$R$80,A90,[1]Agosto!$O$6:$O$80)","v":{"$error":"#VALUE!"}},{"$f":"SUMIF([1]Agosto!$A$6:$R$80,A90,[1]Agosto!$R$6:$R$80)","v":{"$error":"#VALUE!"}},{"$f":"SUMIF([2]Setembro!$A$6:$R$80,A90,[2]Setembro!$O$6:$O$80)","v":{"$error":"#VALUE!"}},{"$f":"SUMIF([2]Setembro!$A$6:$R$80,A90,[2]Setembro!$R$6:$R$80)","v":{"$error":"#VALUE!"}},{"$f":"SUMIF([4]Outubro!$A$6:$R$80,A90,[4]Outubro!$O$6:$O$80)","v":{"$error":"#VALUE!"}},{"$f":"SUMIF([4]Outubro!$A$6:$R$80,A90,[4]Outubro!$R$6:$R$80)","v":{"$error":"#VALUE!"}},{"$f":"SUMIF([5]Novembro!$A$6:$R$80,A90,[5]Novembro!$O$6:$O$80)","v":{"$error":"#VALUE!"}},{"$f":"SUMIF([5]Novembro!$A$6:$R$80,A90,[5]Novembro!$R$6:$R$80)","v":{"$error":"#VALUE!"}},{"$f":"SUMIF([6]Dezembro!$A$6:$R$80,C90,[6]Dezembro!$O$6:$O$80)","v":{"$error":"#VALUE!"}},{"$f":"SUMIF([6]Dezembro!$A$6:$R$80,C90,[6]Dezembro!$R$6:$R$80)","v":{"$error":"#VALUE!"}},0,0]
[234621,"Cláudia Irene de O Rezende",{"$f":"SUMIF(Janeiro!$B$6:$R$77,B91,Janeiro!$O$6:$O$77)","v":0},{"$f":"SUMIF(Janeiro!$B$6:$R$80,B91,Janeiro!$R$6:$R$80)","v":0},{"$f":"SUMIF(Fevereiro!$A$6:$R$77,A91,Fevereiro!$O$6:$O$77)","v":0},{"$f":"SUMIF(Fevereiro!$A$6:$R$77,A91,Fevereiro!$R$6:$R$77)","v":0},{"$f":"SUMIF(Março!$A$6:$R$80,A91,Março!$O$6:$O$80)","v":0},{"$f":"SUMIF(Março!$A$6:$R$80,A91,Março!$R$6:$R$80)","v":0},{"$f":"SUMIF(Abril!$A$6:$R$80,A91,Abril!$O$6:$O$80)","v":0},{"$f":"SUMIF(Abril!$A$6:$R$80,A91,Abril!$R$6:$R$80)","v":0},{"$f":"SUMIF(Maio!$A$6:$R$80,A91,Maio!$O$6:$O$80)","v":0},{"$f":"SUMIF(Maio!$A$6:$R$80,A91,Maio!$R$6:$R$80)","v":0},{"$f":"SUMIF(Junho!$A$6:$R$80,A91,Junho!$O$6:$O$80)","v":0},{"$f":"SUMIF(Junho!$A$6:$R$80,A91,Junho!$R$6:$R$80)","v":0},{"$f":"SUMIF(Julho!$A$6:$R$80,A91,Julho!$O$6:$O$80)","v":0},{"$f":"SUMIF(Julho!$A$6:$R$80,A91,Julho!$R$6:$R$80)","v":0},{"$f":"SUMIF([1]Agosto!$A$6:$R$80,A91,[1]Agosto!$O$6:$O$80)","v":{"$error":"#VALUE!"}},{"$f":"SUMIF([1]Agosto!$A$6:$R$80,A91,[1]Agosto!$R$6:$R$80)","v":{"$error":"#VALUE!"}},{"$f":"SUMIF([2]Setembro!$A$6:$R$80,A91,[2]Setembro!$O$6:$O$80)","v":{"$error":"#VALUE!"}},{"$f":"SUMIF([2]Setembro!$A$6:$R$80,A91,[2]Setembro!$R$6:$R$80)","v":{"$error":"#VALUE!"}},{"$f":"SUMIF([4]Outubro!$A$6:$R$80,A91,[4]Outubro!$O$6:$O$80)","v":{"$error":"#VALUE!"}},{"$f":"SUMIF([4]Outubro!$A$6:$R$80,A91,[4]Outubro!$R$6:$R$80)","v":{"$error":"#VALUE!"}},{"$f":"SUMIF([5]Novembro!$A$6:$R$80,A91,[5]Novembro!$O$6:$O$80)","v":{"$error":"#VALUE!"}},{"$f":"SUMIF([5]Novembro!$A$6:$R$80,A91,[5]Novembro!$R$6:$R$80)","v":{"$error":"#VALUE!"}},{"$f":"SUMIF([6]Dezembro!$A$6:$R$80,C91,[6]Dezembro!$O$6:$O$80)","v":{"$error":"#VALUE!"}},{"$f":"SUMIF([6]Dezembro!$A$6:$R$80,C91,[6]Dezembro!$R$6:$R$80)","v":{"$error":"#VALUE!"}},0,0]
[250678,"William da Silva Vieira",{"$f":"SUMIF(Janeiro!$B$6:$R$77,B92,Janeiro!$O$6:$O$77)","v":0},{"$f":"SUMIF(Janeiro!$B$6:$R$80,B92,Janeiro!$R$6:$R$80)","v":0},{"$f":"SUMIF(Fevereiro!$A$6:$R$77,A92,Fevereiro!$O$6:$O$77)","v":0},{"$f":"SUMIF(Fevereiro!$A$6:$R$77,A92,Fevereiro!$R$6:$R$77)","v":0},{"$f":"SUMIF(Março!$A$6:$R$80,A92,Março!$O$6:$O$80)","v":0},{"$f":"SUMIF(Março!$A$6:$R$80,A92,Março!$R$6:$R$80)","v":0},{"$f":"SUMIF(Abril!$A$6:$R$80,A92,Abril!$O$6:$O$80)","v":0},{"$f":"SUMIF(Abril!$A$6:$R$80,A92,Abril!$R$6:$R$80)","v":0},{"$f":"SUMIF(Maio!$A$6:$R$80,A92,Maio!$O$6:$O$80)","v":0},{"$f":"SUMIF(Maio!$A$6:$R$80,A92,Maio!$R$6:$R$80)","v":0},{"$f":"SUMIF(Junho!$A$6:$R$80,A92,Junho!$O$6:$O$80)","v":0},{"$f":"SUMIF(Junho!$A$6:$R$80,A92,Junho!$R$6:$R$80)","v":0},{"$f":"SUMIF(Julho!$A$6:$R$80,A92,Julho!$O$6:$O$80)","v":0},{"$f":"SUMIF(Julho!$A$6:$R$80,A92,Julho!$R$6:$R$80)","v":0},{"$f":"SUMIF([1]Agosto!$A$6:$R$80,A92,[1]Agosto!$O$6:$O$80)","v":{"$error":"#VALUE!"}},{"$f":"SUMIF([1]Agosto!$A$6:$R$80,A92,[1]Agosto!$R$6:$R$80)","v":{"$error":"#VALUE!"}},{"$f":"SUMIF([2]Setembro!$A$6:$R$80,A92,[2]Setembro!$O$6:$O$80)","v":{"$error":"#VALUE!"}},{"$f":"SUMIF([2]Setembro!$A$6:$R$80,A92,[2]Setembro!$R$6:$R$80)","v":{"$error":"#VALUE!"}},{"$f":"SUMIF([4]Outubro!$A$6:$R$80,A92,[4]Outubro!$O$6:$O$80)","v":{"$error":"#VALUE!"}},{"$f":"SUMIF([4]Outubro!$A$6:$R$80,A92,[4]Outubro!$R$6:$R$80)","v":{"$error":"#VALUE!"}},{"$f":"SUMIF([5]Novembro!$A$6:$R$80,A92,[5]Novembro!$O$6:$O$80)","v":{"$error":"#VALUE!"}},{"$f":"SUMIF([5]Novembro!$A$6:$R$80,A92,[5]Novembro!$R$6:$R$80)","v":{"$error":"#VALUE!"}},{"$f":"SUMIF([6]Dezembro!$A$6:$R$80,C92,[6]Dezembro!$O$6:$O$80)","v":{"$error":"#VALUE!"}},{"$f":"SUMIF([6]Dezembro!$A$6:$R$80,C92,[6]Dezembro!$R$6:$R$80)","v":{"$error":"#VALUE!"}},0,0]
[250716,"Suelen Oliveira dos Santos",{"$f":"SUMIF(Janeiro!$B$6:$R$77,B93,Janeiro!$O$6:$O$77)","v":0},{"$f":"SUMIF(Janeiro!$B$6:$R$80,B93,Janeiro!$R$6:$R$80)","v":0},{"$f":"SUMIF(Fevereiro!$A$6:$R$77,A93,Fevereiro!$O$6:$O$77)","v":0},{"$f":"SUMIF(Fevereiro!$A$6:$R$77,A93,Fevereiro!$R$6:$R$77)","v":0},{"$f":"SUMIF(Março!$A$6:$R$80,A93,Março!$O$6:$O$80)","v":0},{"$f":"SUMIF(Março!$A$6:$R$80,A93,Março!$R$6:$R$80)","v":0},{"$f":"SUMIF(Abril!$A$6:$R$80,A93,Abril!$O$6:$O$80)","v":0},{"$f":"SUMIF(Abril!$A$6:$R$80,A93,Abril!$R$6:$R$80)","v":0},{"$f":"SUMIF(Maio!$A$6:$R$80,A93,Maio!$O$6:$O$80)","v":0},{"$f":"SUMIF(Maio!$A$6:$R$80,A93,Maio!$R$6:$R$80)","v":0},{"$f":"SUMIF(Junho!$A$6:$R$80,A93,Junho!$O$6:$O$80)","v":0},{"$f":"SUMIF(Junho!$A$6:$R$80,A93,Junho!$R$6:$R$80)","v":0},{"$f":"SUMIF(Julho!$A$6:$R$80,A93,Julho!$O$6:$O$80)","v":0},{"$f":"SUMIF(Julho!$A$6:$R$80,A93,Julho!$R$6:$R$80)","v":0},{"$f":"SUMIF([1]Agosto!$A$6:$R$80,A93,[1]Agosto!$O$6:$O$80)","v":{"$error":"#VALUE!"}},{"$f":"SUMIF([1]Agosto!$A$6:$R$80,A93,[1]Agosto!$R$6:$R$80)","v":{"$error":"#VALUE!"}},{"$f":"SUMIF([2]Setembro!$A$6:$R$80,A93,[2]Setembro!$O$6:$O$80)","v":{"$error":"#VALUE!"}},{"$f":"SUMIF([2]Setembro!$A$6:$R$80,A93,[2]Setembro!$R$6:$R$80)","v":{"$error":"#VALUE!"}},{"$f":"SUMIF([4]Outubro!$A$6:$R$80,A93,[4]Outubro!$O$6:$O$80)","v":{"$error":"#VALUE!"}},{"$f":"SUMIF([4]Outubro!$A$6:$R$80,A93,[4]Outubro!$R$6:$R$80)","v":{"$error":"#VALUE!"}},{"$f":"SUMIF([5]Novembro!$A$6:$R$80,A93,[5]Novembro!$O$6:$O$80)","v":{"$error":"#VALUE!"}},{"$f":"SUMIF([5]Novembro!$A$6:$R$80,A93,[5]Novembro!$R$6:$R$80)","v":{"$error":"#VALUE!"}},{"$f":"SUMIF([6]Dezembro!$A$6:$R$80,C93,[6]Dezembro!$O$6:$O$80)","v":{"$error":"#VALUE!"}},{"$f":"SUMIF([6]Dezembro!$A$6:$R$80,C93,[6]Dezembro!$R$6:$R$80)","v":{"$error":"#VALUE!"}},0,0]
[171263,"Margio Luiz Régis",{"$f":"SUMIF(Janeiro!$B$6:$R$77,B94,Janeiro!$O$6:$O$77)","v":0},{"$f":"SUMIF(Janeiro!$B$6:$R$80,B94,Janeiro!$R$6:$R$80)","v":0},{"$f":"SUMIF(Fevereiro!$A$6:$R$77,A94,Fevereiro!$O$6:$O$77)","v":0},{"$f":"SUMIF(Fevereiro!$A$6:$R$77,A94,Fevereiro!$R$6:$R$77)","v":0},{"$f":"SUMIF(Março!$A$6:$R$80,A94,Março!$O$6:$O$80)","v":0},{"$f":"SUMIF(Março!$A$6:$R$80,A94,Março!$R$6:$R$80)","v":0},{"$f":"SUMIF(Abril!$A$6:$R$80,A94,Abril!$O$6:$O$80)","v":0},{"$f":"SUMIF(Abril!$A$6:$R$80,A94,Abril!$R$6:$R$80)","v":0},{"$f":"SUMIF(Maio!$A$6:$R$80,A94,Maio!$O$6:$O$80)","v":0},{"$f":"SUMIF(Maio!$A$6:$R$80,A94,Maio!$R$6:$R$80)","v":0},{"$f":"SUMIF(Junho!$A$6:$R$80,A94,Junho!$O$6:$O$80)","v":0},{"$f":"SUMIF(Junho!$A$6:$R$80,A94,Junho!$R$6:$R$80)","v":0},{"$f":"SUMIF(Julho!$A$6:$R$80,A94,Julho!$O$6:$O$80)","v":0},{"$f":"SUMIF(Julho!$A$6:$R$80,A94,Julho!$R$6:$R$80)","v":0},{"$f":"SUMIF([1]Agosto!$A$6:$R$80,A94,[1]Agosto!$O$6:$O$80)","v":{"$error":"#VALUE!"}},{"$f":"SUMIF([1]Agosto!$A$6:$R$80,A94,[1]Agosto!$R$6:$R$80)","v":{"$error":"#VALUE!"}},{"$f":"SUMIF([2]Setembro!$A$6:$R$80,A94,[2]Setembro!$O$6:$O$80)","v":{"$error":"#VALUE!"}},{"$f":"SUMIF([2]Setembro!$A$6:$R$80,A94,[2]Setembro!$R$6:$R$80)","v":{"$error":"#VALUE!"}},{"$f":"SUMIF([4]Outubro!$A$6:$R$80,A94,[4]Outubro!$O$6:$O$80)","v":{"$error":"#VALUE!"}},{"$f":"SUMIF([4]Outubro!$A$6:$R$80,A94,[4]Outubro!$R$6:$R$80)","v":{"$error":"#VALUE!"}},{"$f":"SUMIF([5]Novembro!$A$6:$R$80,A94,[5]Novembro!$O$6:$O$80)","v":{"$error":"#VALUE!"}},{"$f":"SUMIF([5]Novembro!$A$6:$R$80,A94,[5]Novembro!$R$6:$R$80)","v":{"$error":"#VALUE!"}},{"$f":"SUMIF([6]Dezembro!$A$6:$R$80,C94,[6]Dezembro!$O$6:$O$80)","v":{"$error":"#VALUE!"}},{"$f":"SUMIF([6]Dezembro!$A$6:$R$80,C94,[6]Dezembro!$R$6:$R$80)","v":{"$error":"#VALUE!"}},0,0]
[215449,"André Luiz Nascimento de Albuquerque",{"$f":"SUMIF(Janeiro!$B$6:$R$77,B95,Janeiro!$O$6:$O$77)","v":0},{"$f":"SUMIF(Janeiro!$B$6:$R$80,B95,Janeiro!$R$6:$R$80)","v":0},{"$f":"SUMIF(Fevereiro!$A$6:$R$77,A95,Fevereiro!$O$6:$O$77)","v":0},{"$f":"SUMIF(Fevereiro!$A$6:$R$77,A95,Fevereiro!$R$6:$R$77)","v":0},{"$f":"SUMIF(Março!$A$6:$R$80,A95,Março!$O$6:$O$80)","v":0},{"$f":"SUMIF(Março!$A$6:$R$80,A95,Março!$R$6:$R$80)","v":0},{"$f":"SUMIF(Abril!$A$6:$R$80,A95,Abril!$O$6:$O$80)","v":0},{"$f":"SUMIF(Abril!$A$6:$R$80,A95,Abril!$R$6:$R$80)","v":0},{"$f":"SUMIF(Maio!$A$6:$R$80,A95,Maio!$O$6:$O$80)","v":0},{"$f":"SUMIF(Maio!$A$6:$R$80,A95,Maio!$R$6:$R$80)","v":0},{"$f":"SUMIF(Junho!$A$6:$R$80,A95,Junho!$O$6:$O$80)","v":0},{"$f":"SUMIF(Junho!$A$6:$R$80,A95,Junho!$R$6:$R$80)","v":0},{"$f":"SUMIF(Julho!$A$6:$R$80,A95,Julho!$O$6:$O$80)","v":0},{"$f":"SUMIF(Julho!$A$6:$R$80,A95,Julho!$R$6:$R$80)","v":0},{"$f":"SUMIF([1]Agosto!$A$6:$R$80,A95,[1]Agosto!$O$6:$O$80)","v":{"$error":"#VALUE!"}},{"$f":"SUMIF([1]Agosto!$A$6:$R$80,A95,[1]Agosto!$R$6:$R$80)","v":{"$error":"#VALUE!"}},{"$f":"SUMIF([2]Setembro!$A$6:$R$80,A95,[2]Setembro!$O$6:$O$80)","v":{"$error":"#VALUE!"}},{"$f":"SUMIF([2]Setembro!$A$6:$R$80,A95,[2]Setembro!$R$6:$R$80)","v":{"$error":"#VALUE!"}},{"$f":"SUMIF([4]Outubro!$A$6:$R$80,A95,[4]Outubro!$O$6:$O$80)","v":{"$error":"#VALUE!"}},{"$f":"SUMIF([4]Outubro!$A$6:$R$80,A95,[4]Outubro!$R$6:$R$80)","v":{"$error":"#VALUE!"}},{"$f":"SUMIF([5]Novembro!$A$6:$R$80,A95,[5]Novembro!$O$6:$O$80)","v":{"$error":"#VALUE!"}},{"$f":"SUMIF([5]Novembro!$A$6:$R$80,A95,[5]Novembro!$R$6:$R$80)","v":{"$error":"#VALUE!"}},{"$f":"SUMIF([6]Dezembro!$A$6:$R$80,C95,[6]Dezembro!$O$6:$O$80)","v":{"$error":"#VALUE!"}},{"$f":"SUMIF([6]Dezembro!$A$6:$R$80,C95,[6]Dezembro!$R$6:$R$80)","v":{"$error":"#VALUE!"}},0,0]
[51713,"Dermeval Moraes da Silva",{"$f":"SUMIF(Janeiro!$B$6:$R$77,B96,Janeiro!$O$6:$O$77)","v":0},{"$f":"SUMIF(Janeiro!$B$6:$R$80,B96,Janeiro!$R$6:$R$80)","v":0},{"$f":"SUMIF(Fevereiro!$A$6:$R$77,A96,Fevereiro!$O$6:$O$77)","v":0},{"$f":"SUMIF(Fevereiro!$A$6:$R$77,A96,Fevereiro!$R$6:$R$77)","v":0},{"$f":"SUMIF(Março!$A$6:$R$80,A96,Março!$O$6:$O$80)","v":0},{"$f":"SUMIF(Março!$A$6:$R$80,A96,Março!$R$6:$R$80)","v":0},{"$f":"SUMIF(Abril!$A$6:$R$80,A96,Abril!$O$6:$O$80)","v":0},{"$f":"SUMIF(Abril!$A$6:$R$80,A96,Abril!$R$6:$R$80)","v":0},{"$f":"SUMIF(Maio!$A$6:$R$80,A96,Maio!$O$6:$O$80)","v":0},{"$f":"SUMIF(Maio!$A$6:$R$80,A96,Maio!$R$6:$R$80)","v":0},{"$f":"SUMIF(Junho!$A$6:$R$80,A96,Junho!$O$6:$O$80)","v":0},{"$f":"SUMIF(Junho!$A$6:$R$80,A96,Junho!$R$6:$R$80)","v":0},{"$f":"SUMIF(Julho!$A$6:$R$80,A96,Julho!$O$6:$O$80)","v":0},{"$f":"SUMIF(Julho!$A$6:$R$80,A96,Julho!$R$6:$R$80)","v":0},{"$f":"SUMIF([1]Agosto!$A$6:$R$80,A96,[1]Agosto!$O$6:$O$80)","v":{"$error":"#VALUE!"}},{"$f":"SUMIF([1]Agosto!$A$6:$R$80,A96,[1]Agosto!$R$6:$R$80)","v":{"$error":"#VALUE!"}},{"$f":"SUMIF([2]Setembro!$A$6:$R$80,A96,[2]Setembro!$O$6:$O$80)","v":{"$error":"#VALUE!"}},{"$f":"SUMIF([2]Setembro!$A$6:$R$80,A96,[2]Setembro!$R$6:$R$80)","v":{"$error":"#VALUE!"}},{"$f":"SUMIF([4]Outubro!$A$6:$R$80,A96,[4]Outubro!$O$6:$O$80)","v":{"$error":"#VALUE!"}},{"$f":"SUMIF([4]Outubro!$A$6:$R$80,A96,[4]Outubro!$R$6:$R$80)","v":{"$error":"#VALUE!"}},{"$f":"SUMIF([5]Novembro!$A$6:$R$80,A96,[5]Novembro!$O$6:$O$80)","v":{"$error":"#VALUE!"}},{"$f":"SUMIF([5]Novembro!$A$6:$R$80,A96,[5]Novembro!$R$6:$R$80)","v":{"$error":"#VALUE!"}},{"$f":"SUMIF([6]Dezembro!$A$6:$R$80,C96,[6]Dezembro!$O$6:$O$80)","v":{"$error":"#VALUE!"}},{"$f":"SUMIF([6]Dezembro!$A$6:$R$80,C96,[6]Dezembro!$R$6:$R$80)","v":{"$error":"#VALUE!"}},0,0]
[90514,"Aládio Alves de Freitas",{"$f":"SUMIF(Janeiro!$B$6:$R$77,B97,Janeiro!$O$6:$O$77)","v":0},{"$f":"SUMIF(Janeiro!$B$6:$R$80,B97,Janeiro!$R$6:$R$80)","v":0},{"$f":"SUMIF(Fevereiro!$A$6:$R$77,A97,Fevereiro!$O$6:$O$77)","v":0},{"$f":"SUMIF(Fevereiro!$A$6:$R$77,A97,Fevereiro!$R$6:$R$77)","v":0},{"$f":"SUMIF(Março!$A$6:$R$80,A97,Março!$O$6:$O$80)","v":0},{"$f":"SUMIF(Março!$A$6:$R$80,A97,Março!$R$6:$R$80)","v":0},{"$f":"SUMIF(Abril!$A$6:$R$80,A97,Abril!$O$6:$O$80)","v":0},{"$f":"SUMIF(Abril!$A$6:$R$80,A97,Abril!$R$6:$R$80)","v":0},{"$f":"SUMIF(Maio!$A$6:$R$80,A97,Maio!$O$6:$O$80)","v":0},{"$f":"SUMIF(Maio!$A$6:$R$80,A97,Maio!$R$6:$R$80)","v":0},{"$f":"SUMIF(Junho!$A$6:$R$80,A97,Junho!$O$6:$O$80)","v":0},{"$f":"SUMIF(Junho!$A$6:$R$80,A97,Junho!$R$6:$R$80)","v":0},{"$f":"SUMIF(Julho!$A$6:$R$80,A97,Julho!$O$6:$O$80)","v":0},{"$f":"SUMIF(Julho!$A$6:$R$80,A97,Julho!$R$6:$R$80)","v":0},{"$f":"SUMIF([1]Agosto!$A$6:$R$80,A97,[1]Agosto!$O$6:$O$80)","v":{"$error":"#VALUE!"}},{"$f":"SUMIF([1]Agosto!$A$6:$R$80,A97,[1]Agosto!$R$6:$R$80)","v":{"$error":"#VALUE!"}},{"$f":"SUMIF([2]Setembro!$A$6:$R$80,A97,[2]Setembro!$O$6:$O$80)","v":{"$error":"#VALUE!"}},{"$f":"SUMIF([2]Setembro!$A$6:$R$80,A97,[2]Setembro!$R$6:$R$80)","v":{"$error":"#VALUE!"}},{"$f":"SUMIF([4]Outubro!$A$6:$R$80,A97,[4]Outubro!$O$6:$O$80)","v":{"$error":"#VALUE!"}},{"$f":"SUMIF([4]Outubro!$A$6:$R$80,A97,[4]Outubro!$R$6:$R$80)","v":{"$error":"#VALUE!"}},{"$f":"SUMIF([5]Novembro!$A$6:$R$80,A97,[5]Novembro!$O$6:$O$80)","v":{"$error":"#VALUE!"}},{"$f":"SUMIF([5]Novembro!$A$6:$R$80,A97,[5]Novembro!$R$6:$R$80)","v":{"$error":"#VALUE!"}},{"$f":"SUMIF([6]Dezembro!$A$6:$R$80,C97,[6]Dezembro!$O$6:$O$80)","v":{"$error":"#VALUE!"}},{"$f":"SUMIF([6]Dezembro!$A$6:$R$80,C97,[6]Dezembro!$R$6:$R$80)","v":{"$error":"#VALUE!"}},0,0]
[187674,"Sheiley Lacerda",{"$f":"SUMIF(Janeiro!$B$6:$R$77,B98,Janeiro!$O$6:$O$77)","v":0},{"$f":"SUMIF(Janeiro!$B$6:$R$80,B98,Janeiro!$R$6:$R$80)","v":0},{"$f":"SUMIF(Fevereiro!$A$6:$R$77,A98,Fevereiro!$O$6:$O$77)","v":0},{"$f":"SUMIF(Fevereiro!$A$6:$R$77,A98,Fevereiro!$R$6:$R$77)","v":0},{"$f":"SUMIF(Março!$A$6:$R$80,A98,Março!$O$6:$O$80)","v":0},{"$f":"SUMIF(Março!$A$6:$R$80,A98,Março!$R$6:$R$80)","v":0},{"$f":"SUMIF(Abril!$A$6:$R$80,A98,Abril!$O$6:$O$80)","v":0},{"$f":"SUMIF(Abril!$A$6:$R$80,A98,Abril!$R$6:$R$80)","v":0},{"$f":"SUMIF(Maio!$A$6:$R$80,A98,Maio!$O$6:$O$80)","v":0},{"$f":"SUMIF(Maio!$A$6:$R$80,A98,Maio!$R$6:$R$80)","v":0},{"$f":"SUMIF(Junho!$A$6:$R$80,A98,Junho!$O$6:$O$80)","v":0},{"$f":"SUMIF(Junho!$A$6:$R$80,A98,Junho!$R$6:$R$80)","v":0},{"$f":"SUMIF(Julho!$A$6:$R$80,A98,Julho!$O$6:$O$80)","v":0},{"$f":"SUMIF(Julho!$A$6:$R$80,A98,Julho!$R$6:$R$80)","v":0},{"$f":"SUMIF([1]Agosto!$A$6:$R$80,A98,[1]Agosto!$O$6:$O$80)","v":{"$error":"#VALUE!"}},{"$f":"SUMIF([1]Agosto!$A$6:$R$80,A98,[1]Agosto!$R$6:$R$80)","v":{"$error":"#VALUE!"}},{"$f":"SUMIF([2]Setembro!$A$6:$R$80,A98,[2]Setembro!$O$6:$O$80)","v":{"$error":"#VALUE!"}},{"$f":"SUMIF([2]Setembro!$A$6:$R$80,A98,[2]Setembro!$R$6:$R$80)","v":{"$error":"#VALUE!"}},{"$f":"SUMIF([4]Outubro!$A$6:$R$80,A98,[4]Outubro!$O$6:$O$80)","v":{"$error":"#VALUE!"}},{"$f":"SUMIF([4]Outubro!$A$6:$R$80,A98,[4]Outubro!$R$6:$R$80)","v":{"$error":"#VALUE!"}},{"$f":"SUMIF([5]Novembro!$A$6:$R$80,A98,[5]Novembro!$O$6:$O$80)","v":{"$error":"#VALUE!"}},{"$f":"SUMIF([5]Novembro!$A$6:$R$80,A98,[5]Novembro!$R$6:$R$80)","v":{"$error":"#VALUE!"}},{"$f":"SUMIF([6]Dezembro!$A$6:$R$80,C98,[6]Dezembro!$O$6:$O$80)","v":{"$error":"#VALUE!"}},{"$f":"SUMIF([6]Dezembro!$A$6:$R$80,C98,[6]Dezembro!$R$6:$R$80)","v":{"$error":"#VALUE!"}},0,0]
[190870,"Edvaldo Bispo França",{"$f":"SUMIF(Janeiro!$B$6:$R$77,B99,Janeiro!$O$6:$O$77)","v":0},{"$f":"SUMIF(Janeiro!$B$6:$R$80,B99,Janeiro!$R$6:$R$80)","v":0},{"$f":"SUMIF(Fevereiro!$A$6:$R$77,A99,Fevereiro!$O$6:$O$77)","v":0},{"$f":"SUMIF(Fevereiro!$A$6:$R$77,A99,Fevereiro!$R$6:$R$77)","v":0},{"$f":"SUMIF(Março!$A$6:$R$80,A99,Março!$O$6:$O$80)","v":0},{"$f":"SUMIF(Março!$A$6:$R$80,A99,Março!$R$6:$R$80)","v":0},{"$f":"SUMIF(Abril!$A$6:$R$80,A99,Abril!$O$6:$O$80)","v":0},{"$f":"SUMIF(Abril!$A$6:$R$80,A99,Abril!$R$6:$R$80)","v":0},{"$f":"SUMIF(Maio!$A$6:$R$80,A99,Maio!$O$6:$O$80)","v":0},{"$f":"SUMIF(Maio!$A$6:$R$80,A99,Maio!$R$6:$R$80)","v":0},{"$f":"SUMIF(Junho!$A$6:$R$80,A99,Junho!$O$6:$O$80)","v":0},{"$f":"SUMIF(Junho!$A$6:$R$80,A99,Junho!$R$6:$R$80)","v":0},{"$f":"SUMIF(Julho!$A$6:$R$80,A99,Julho!$O$6:$O$80)","v":0},{"$f":"SUMIF(Julho!$A$6:$R$80,A99,Julho!$R$6:$R$80)","v":0},{"$f":"SUMIF([1]Agosto!$A$6:$R$80,A99,[1]Agosto!$O$6:$O$80)","v":{"$error":"#VALUE!"}},{"$f":"SUMIF([1]Agosto!$A$6:$R$80,A99,[1]Agosto!$R$6:$R$80)","v":{"$error":"#VALUE!"}},{"$f":"SUMIF([2]Setembro!$A$6:$R$80,A99,[2]Setembro!$O$6:$O$80)","v":{"$error":"#VALUE!"}},{"$f":"SUMIF([2]Setembro!$A$6:$R$80,A99,[2]Setembro!$R$6:$R$80)","v":{"$error":"#VALUE!"}},{"$f":"SUMIF([4]Outubro!$A$6:$R$80,A99,[4]Outubro!$O$6:$O$80)","v":{"$error":"#VALUE!"}},{"$f":"SUMIF([4]Outubro!$A$6:$R$80,A99,[4]Outubro!$R$6:$R$80)","v":{"$error":"#VALUE!"}},{"$f":"SUMIF([5]Novembro!$A$6:$R$80,A99,[5]Novembro!$O$6:$O$80)","v":{"$error":"#VALUE!"}},{"$f":"SUMIF([5]Novembro!$A$6:$R$80,A99,[5]Novembro!$R$6:$R$80)","v":{"$error":"#VALUE!"}},{"$f":"SUMIF([6]Dezembro!$A$6:$R$80,C99,[6]Dezembro!$O$6:$O$80)","v":{"$error":"#VALUE!"}},{"$f":"SUMIF([6]Dezembro!$A$6:$R$80,C99,[6]Dezembro!$R$6:$R$80)","v":{"$error":"#VALUE!"}},0,0]
[237418,"Iúri Fernandes de Lima",{"$f":"SUMIF(Janeiro!$B$6:$R$77,B100,Janeiro!$O$6:$O$77)","v":0},{"$f":"SUMIF(Janeiro!$B$6:$R$80,B100,Janeiro!$R$6:$R$80)","v":0},{"$f":"SUMIF(Fevereiro!$A$6:$R$77,A100,Fevereiro!$O$6:$O$77)","v":0},{"$f":"SUMIF(Fevereiro!$A$6:$R$77,A100,Fevereiro!$R$6:$R$77)","v":0},{"$f":"SUMIF(Março!$A$6:$R$80,A100,Março!$O$6:$O$80)","v":0},{"$f":"SUMIF(Março!$A$6:$R$80,A100,Março!$R$6:$R$80)","v":0},{"$f":"SUMIF(Abril!$A$6:$R$80,A100,Abril!$O$6:$O$80)","v":0},{"$f":"SUMIF(Abril!$A$6:$R$80,A100,Abril!$R$6:$R$80)","v":0},{"$f":"SUMIF(Maio!$A$6:$R$80,A100,Maio!$O$6:$O$80)","v":0},{"$f":"SUMIF(Maio!$A$6:$R$80,A100,Maio!$R$6:$R$80)","v":0},{"$f":"SUMIF(Junho!$A$6:$R$80,A100,Junho!$O$6:$O$80)","v":0},{"$f":"SUMIF(Junho!$A$6:$R$80,A100,Junho!$R$6:$R$80)","v":0},{"$f":"SUMIF(Julho!$A$6:$R$80,A100,Julho!$O$6:$O$80)","v":0},{"$f":"SUMIF(Julho!$A$6:$R$80,A100,Julho!$R$6:$R$80)","v":0},{"$f":"SUMIF([1]Agosto!$A$6:$R$80,A100,[1]Agosto!$O$6:$O$80)","v":{"$error":"#VALUE!"}},{"$f":"SUMIF([1]Agosto!$A$6:$R$80,A100,[1]Agosto!$R$6:$R$80)","v":{"$error":"#VALUE!"}},{"$f":"SUMIF([2]Setembro!$A$6:$R$80,A100,[2]Setembro!$O$6:$O$80)","v":{"$error":"#VALUE!"}},{"$f":"SUMIF([2]Setembro!$A$6:$R$80,A100,[2]Setembro!$R$6:$R$80)","v":{"$error":"#VALUE!"}},{"$f":"SUMIF([4]Outubro!$A$6:$R$80,A100,[4]Outubro!$O$6:$O$80)","v":{"$error":"#VALUE!"}},{"$f":"SUMIF([4]Outubro!$A$6:$R$80,A100,[4]Outubro!$R$6:$R$80)","v":{"$error":"#VALUE!"}},{"$f":"SUMIF([5]Novembro!$A$6:$R$80,A100,[5]Novembro!$O$6:$O$80)","v":{"$error":"#VALUE!"}},{"$f":"SUMIF([5]Novembro!$A$6:$R$80,A100,[5]Novembro!$R$6:$R$80)","v":{"$error":"#VALUE!"}},{"$f":"SUMIF([6]Dezembro!$A$6:$R$80,C100,[6]Dezembro!$O$6:$O$80)","v":{"$error":"#VALUE!"}},{"$f":"SUMIF([6]Dezembro!$A$6:$R$80,C100,[6]Dezembro!$R$6:$R$80)","v":{"$error":"#VALUE!"}},0,0]
[247910,"João Pedro Esquivel A.Góes",{"$f":"SUMIF(Janeiro!$B$6:$R$77,B101,Janeiro!$O$6:$O$77)","v":0},{"$f":"SUMIF(Janeiro!$B$6:$R$80,B101,Janeiro!$R$6:$R$80)","v":0},{"$f":"SUMIF(Fevereiro!$A$6:$R$77,A101,Fevereiro!$O$6:$O$77)","v":0},{"$f":"SUMIF(Fevereiro!$A$6:$R$77,A101,Fevereiro!$R$6:$R$77)","v":0},{"$f":"SUMIF(Março!$A$6:$R$80,A101,Março!$O$6:$O$80)","v":0},{"$f":"SUMIF(Março!$A$6:$R$80,A101,Março!$R$6:$R$80)","v":0},{"$f":"SUMIF(Abril!$A$6:$R$80,A101,Abril!$O$6:$O$80)","v":0},{"$f":"SUMIF(Abril!$A$6:$R$80,A101,Abril!$R$6:$R$80)","v":0},{"$f":"SUMIF(Maio!$A$6:$R$80,A101,Maio!$O$6:$O$80)","v":0},{"$f":"SUMIF(Maio!$A$6:$R$80,A101,Maio!$R$6:$R$80)","v":0},{"$f":"SUMIF(Junho!$A$6:$R$80,A101,Junho!$O$6:$O$80)","v":0},{"$f":"SUMIF(Junho!$A$6:$R$80,A101,Junho!$R$6:$R$80)","v":0},{"$f":"SUMIF(Julho!$A$6:$R$80,A101,Julho!$O$6:$O$80)","v":0},{"$f":"SUMIF(Julho!$A$6:$R$80,A101,Julho!$R$6:$R$80)","v":0},{"$f":"SUMIF([1]Agosto!$A$6:$R$80,A101,[1]Agosto!$O$6:$O$80)","v":{"$error":"#VALUE!"}},{"$f":"SUMIF([1]Agosto!$A$6:$R$80,A101,[1]Agosto!$R$6:$R$80)","v":{"$error":"#VALUE!"}},{"$f":"SUMIF([2]Setembro!$A$6:$R$80,A101,[2]Setembro!$O$6:$O$80)","v":{"$error":"#VALUE!"}},{"$f":"SUMIF([2]Setembro!$A$6:$R$80,A101,[2]Setembro!$R$6:$R$80)","v":{"$error":"#VALUE!"}},{"$f":"SUMIF([4]Outubro!$A$6:$R$80,A101,[4]Outubro!$O$6:$O$80)","v":{"$error":"#VALUE!"}},{"$f":"SUMIF([4]Outubro!$A$6:$R$80,A101,[4]Outubro!$R$6:$R$80)","v":{"$error":"#VALUE!"}},{"$f":"SUMIF([5]Novembro!$A$6:$R$80,A101,[5]Novembro!$O$6:$O$80)","v":{"$error":"#VALUE!"}},{"$f":"SUMIF([5]Novembro!$A$6:$R$80,A101,[5]Novembro!$R$6:$R$80)","v":{"$error":"#VALUE!"}},{"$f":"SUMIF([6]Dezembro!$A$6:$R$80,C101,[6]Dezembro!$O$6:$O$80)","v":{"$error":"#VALUE!"}},{"$f":"SUMIF([6]Dezembro!$A$6:$R$80,C101,[6]Dezembro!$R$6:$R$80)","v":{"$error":"#VALUE!"}},0,0]
[222674,"Jailton São José de Morais",{"$f":"SUMIF(Janeiro!$B$6:$R$77,B102,Janeiro!$O$6:$O$77)","v":0},{"$f":"SUMIF(Janeiro!$B$6:$R$80,B102,Janeiro!$R$6:$R$80)","v":0},{"$f":"SUMIF(Fevereiro!$A$6:$R$77,A102,Fevereiro!$O$6:$O$77)","v":0},{"$f":"SUMIF(Fevereiro!$A$6:$R$77,A102,Fevereiro!$R$6:$R$77)","v":0},{"$f":"SUMIF(Março!$A$6:$R$80,A102,Março!$O$6:$O$80)","v":0},{"$f":"SUMIF(Março!$A$6:$R$80,A102,Março!$R$6:$R$80)","v":0},{"$f":"SUMIF(Abril!$A$6:$R$80,A102,Abril!$O$6:$O$80)","v":0},{"$f":"SUMIF(Abril!$A$6:$R$80,A102,Abril!$R$6:$R$80)","v":0},{"$f":"SUMIF(Maio!$A$6:$R$80,A102,Maio!$O$6:$O$80)","v":0},{"$f":"SUMIF(Maio!$A$6:$R$80,A102,Maio!$R$6:$R$80)","v":0},{"$f":"SUMIF(Junho!$A$6:$R$80,A102,Junho!$O$6:$O$80)","v":0},{"$f":"SUMIF(Junho!$A$6:$R$80,A102,Junho!$R$6:$R$80)","v":0},{"$f":"SUMIF(Julho!$A$6:$R$80,A102,Julho!$O$6:$O$80)","v":0},{"$f":"SUMIF(Julho!$A$6:$R$80,A102,Julho!$R$6:$R$80)","v":0},{"$f":"SUMIF([1]Agosto!$A$6:$R$80,A102,[1]Agosto!$O$6:$O$80)","v":{"$error":"#VALUE!"}},{"$f":"SUMIF([1]Agosto!$A$6:$R$80,A102,[1]Agosto!$R$6:$R$80)","v":{"$error":"#VALUE!"}},{"$f":"SUMIF([2]Setembro!$A$6:$R$80,A102,[2]Setembro!$O$6:$O$80)","v":{"$error":"#VALUE!"}},{"$f":"SUMIF([2]Setembro!$A$6:$R$80,A102,[2]Setembro!$R$6:$R$80)","v":{"$error":"#VALUE!"}},{"$f":"SUMIF([4]Outubro!$A$6:$R$80,A102,[4]Outubro!$O$6:$O$80)","v":{"$error":"#VALUE!"}},{"$f":"SUMIF([4]Outubro!$A$6:$R$80,A102,[4]Outubro!$R$6:$R$80)","v":{"$error":"#VALUE!"}},{"$f":"SUMIF([5]Novembro!$A$6:$R$80,A102,[5]Novembro!$O$6:$O$80)","v":{"$error":"#VALUE!"}},{"$f":"SUMIF([5]Novembro!$A$6:$R$80,A102,[5]Novembro!$R$6:$R$80)","v":{"$error":"#VALUE!"}},{"$f":"SUMIF([6]Dezembro!$A$6:$R$80,C102,[6]Dezembro!$O$6:$O$80)","v":{"$error":"#VALUE!"}},{"$f":"SUMIF([6]Dezembro!$A$6:$R$80,C102,[6]Dezembro!$R$6:$R$80)","v":{"$error":"#VALUE!"}},0,0]
[115150,"Antonio dos Santos ",{"$f":"SUMIF(Janeiro!$B$6:$R$77,B103,Janeiro!$O$6:$O$77)","v":0},{"$f":"SUMIF(Janeiro!$B$6:$R$80,B103,Janeiro!$R$6:$R$80)","v":0},{"$f":"SUMIF(Fevereiro!$A$6:$R$77,A103,Fevereiro!$O$6:$O$77)","v":0},{"$f":"SUMIF(Fevereiro!$A$6:$R$77,A103,Fevereiro!$R$6:$R$77)","v":0},{"$f":"SUMIF(Março!$A$6:$R$80,A103,Março!$O$6:$O$80)","v":0},{"$f":"SUMIF(Março!$A$6:$R$80,A103,Março!$R$6:$R$80)","v":0},{"$f":"SUMIF(Abril!$A$6:$R$80,A103,Abril!$O$6:$O$80)","v":0},{"$f":"SUMIF(Abril!$A$6:$R$80,A103,Abril!$R$6:$R$80)","v":0},{"$f":"SUMIF(Maio!$A$6:$R$80,A103,Maio!$O$6:$O$80)","v":0},{"$f":"SUMIF(Maio!$A$6:$R$80,A103,Maio!$R$6:$R$80)","v":0},{"$f":"SUMIF(Junho!$A$6:$R$80,A103,Junho!$O$6:$O$80)","v":0},{"$f":"SUMIF(Junho!$A$6:$R$80,A103,Junho!$R$6:$R$80)","v":0},{"$f":"SUMIF(Julho!$A$6:$R$80,A103,Julho!$O$6:$O$80)","v":0},{"$f":"SUMIF(Julho!$A$6:$R$80,A103,Julho!$R$6:$R$80)","v":0},{"$f":"SUMIF([1]Agosto!$A$6:$R$80,A103,[1]Agosto!$O$6:$O$80)","v":{"$error":"#VALUE!"}},{"$f":"SUMIF([1]Agosto!$A$6:$R$80,A103,[1]Agosto!$R$6:$R$80)","v":{"$error":"#VALUE!"}},{"$f":"SUMIF([2]Setembro!$A$6:$R$80,A103,[2]Setembro!$O$6:$O$80)","v":{"$error":"#VALUE!"}},{"$f":"SUMIF([2]Setembro!$A$6:$R$80,A103,[2]Setembro!$R$6:$R$80)","v":{"$error":"#VALUE!"}},{"$f":"SUMIF([4]Outubro!$A$6:$R$80,A103,[4]Outubro!$O$6:$O$80)","v":{"$error":"#VALUE!"}},{"$f":"SUMIF([4]Outubro!$A$6:$R$80,A103,[4]Outubro!$R$6:$R$80)","v":{"$error":"#VALUE!"}},{"$f":"SUMIF([5]Novembro!$A$6:$R$80,A103,[5]Novembro!$O$6:$O$80)","v":{"$error":"#VALUE!"}},{"$f":"SUMIF([5]Novembro!$A$6:$R$80,A103,[5]Novembro!$R$6:$R$80)","v":{"$error":"#VALUE!"}},{"$f":"SUMIF([6]Dezembro!$A$6:$R$80,C103,[6]Dezembro!$O$6:$O$80)","v":{"$error":"#VALUE!"}},{"$f":"SUMIF([6]Dezembro!$A$6:$R$80,C103,[6]Dezembro!$R$6:$R$80)","v":{"$error":"#VALUE!"}},0,0]
[234028,"Marly Saturnino dos S Lopes",{"$f":"SUMIF(Janeiro!$B$6:$R$77,B104,Janeiro!$O$6:$O$77)","v":0},{"$f":"SUMIF(Janeiro!$B$6:$R$80,B104,Janeiro!$R$6:$R$80)","v":0},{"$f":"SUMIF(Fevereiro!$A$6:$R$77,A104,Fevereiro!$O$6:$O$77)","v":0},{"$f":"SUMIF(Fevereiro!$A$6:$R$77,A104,Fevereiro!$R$6:$R$77)","v":0},{"$f":"SUMIF(Março!$A$6:$R$80,A104,Março!$O$6:$O$80)","v":0},{"$f":"SUMIF(Março!$A$6:$R$80,A104,Março!$R$6:$R$80)","v":0},{"$f":"SUMIF(Abril!$A$6:$R$80,A104,Abril!$O$6:$O$80)","v":0},{"$f":"SUMIF(Abril!$A$6:$R$80,A104,Abril!$R$6:$R$80)","v":0},{"$f":"SUMIF(Maio!$A$6:$R$80,A104,Maio!$O$6:$O$80)","v":0},{"$f":"SUMIF(Maio!$A$6:$R$80,A104,Maio!$R$6:$R$80)","v":0},{"$f":"SUMIF(Junho!$A$6:$R$80,A104,Junho!$O$6:$O$80)","v":0},{"$f":"SUMIF(Junho!$A$6:$R$80,A104,Junho!$R$6:$R$80)","v":0},{"$f":"SUMIF(Julho!$A$6:$R$80,A104,Julho!$O$6:$O$80)","v":0},{"$f":"SUMIF(Julho!$A$6:$R$80,A104,Julho!$R$6:$R$80)","v":0},{"$f":"SUMIF([1]Agosto!$A$6:$R$80,A104,[1]Agosto!$O$6:$O$80)","v":{"$error":"#VALUE!"}},{"$f":"SUMIF([1]Agosto!$A$6:$R$80,A104,[1]Agosto!$R$6:$R$80)","v":{"$error":"#VALUE!"}},{"$f":"SUMIF([2]Setembro!$A$6:$R$80,A104,[2]Setembro!$O$6:$O$80)","v":{"$error":"#VALUE!"}},{"$f":"SUMIF([2]Setembro!$A$6:$R$80,A104,[2]Setembro!$R$6:$R$80)","v":{"$error":"#VALUE!"}},{"$f":"SUMIF([4]Outubro!$A$6:$R$80,A104,[4]Outubro!$O$6:$O$80)","v":{"$error":"#VALUE!"}},{"$f":"SUMIF([4]Outubro!$A$6:$R$80,A104,[4]Outubro!$R$6:$R$80)","v":{"$error":"#VALUE!"}},{"$f":"SUMIF([5]Novembro!$A$6:$R$80,A104,[5]Novembro!$O$6:$O$80)","v":{"$error":"#VALUE!"}},{"$f":"SUMIF([5]Novembro!$A$6:$R$80,A104,[5]Novembro!$R$6:$R$80)","v":{"$error":"#VALUE!"}},{"$f":"SUMIF([6]Dezembro!$A$6:$R$80,C104,[6]Dezembro!$O$6:$O$80)","v":{"$error":"#VALUE!"}},{"$f":"SUMIF([6]Dezembro!$A$6:$R$80,C104,[6]Dezembro!$R$6:$R$80)","v":{"$error":"#VALUE!"}},0,0]
[250694,"Victor Oliveira Alves Figueredo",{"$f":"SUMIF(Janeiro!$B$6:$R$77,B105,Janeiro!$O$6:$O$77)","v":0},{"$f":"SUMIF(Janeiro!$B$6:$R$80,B105,Janeiro!$R$6:$R$80)","v":0},{"$f":"SUMIF(Fevereiro!$A$6:$R$77,A105,Fevereiro!$O$6:$O$77)","v":0},{"$f":"SUMIF(Fevereiro!$A$6:$R$77,A105,Fevereiro!$R$6:$R$77)","v":0},{"$f":"SUMIF(Março!$A$6:$R$80,A105,Março!$O$6:$O$80)","v":0},{"$f":"SUMIF(Março!$A$6:$R$80,A105,Março!$R$6:$R$80)","v":0},{"$f":"SUMIF(Abril!$A$6:$R$80,A105,Abril!$O$6:$O$80)","v":0},{"$f":"SUMIF(Abril!$A$6:$R$80,A105,Abril!$R$6:$R$80)","v":0},{"$f":"SUMIF(Maio!$A$6:$R$80,A105,Maio!$O$6:$O$80)","v":0},{"$f":"SUMIF(Maio!$A$6:$R$80,A105,Maio!$R$6:$R$80)","v":0},{"$f":"SUMIF(Junho!$A$6:$R$80,A105,Junho!$O$6:$O$80)","v":0},{"$f":"SUMIF(Junho!$A$6:$R$80,A105,Junho!$R$6:$R$80)","v":0},{"$f":"SUMIF(Julho!$A$6:$R$80,A105,Julho!$O$6:$O$80)","v":0},{"$f":"SUMIF(Julho!$A$6:$R$80,A105,Julho!$R$6:$R$80)","v":0},{"$f":"SUMIF([1]Agosto!$A$6:$R$80,A105,[1]Agosto!$O$6:$O$80)","v":{"$error":"#VALUE!"}},{"$f":"SUMIF([1]Agosto!$A$6:$R$80,A105,[1]Agosto!$R$6:$R$80)","v":{"$error":"#VALUE!"}},{"$f":"SUMIF([2]Setembro!$A$6:$R$80,A105,[2]Setembro!$O$6:$O$80)","v":{"$error":"#VALUE!"}},{"$f":"SUMIF([2]Setembro!$A$6:$R$80,A105,[2]Setembro!$R$6:$R$80)","v":{"$error":"#VALUE!"}},{"$f":"SUMIF([4]Outubro!$A$6:$R$80,A105,[4]Outubro!$O$6:$O$80)","v":{"$error":"#VALUE!"}},{"$f":"SUMIF([4]Outubro!$A$6:$R$80,A105,[4]Outubro!$R$6:$R$80)","v":{"$error":"#VALUE!"}},{"$f":"SUMIF([5]Novembro!$A$6:$R$80,A105,[5]Novembro!$O$6:$O$80)","v":{"$error":"#VALUE!"}},{"$f":"SUMIF([5]Novembro!$A$6:$R$80,A105,[5]Novembro!$R$6:$R$80)","v":{"$error":"#VALUE!"}},{"$f":"SUMIF([6]Dezembro!$A$6:$R$80,C105,[6]Dezembro!$O$6:$O$80)","v":{"$error":"#VALUE!"}},{"$f":"SUMIF([6]Dezembro!$A$6:$R$80,C105,[6]Dezembro!$R$6:$R$80)","v":{"$error":"#VALUE!"}},0,0]
[252093,"Mariélen Santos de Jesus",{"$f":"SUMIF(Janeiro!$B$6:$R$77,B106,Janeiro!$O$6:$O$77)","v":0},{"$f":"SUMIF(Janeiro!$B$6:$R$80,B106,Janeiro!$R$6:$R$80)","v":0},{"$f":"SUMIF(Fevereiro!$A$6:$R$77,A106,Fevereiro!$O$6:$O$77)","v":0},{"$f":"SUMIF(Fevereiro!$A$6:$R$77,A106,Fevereiro!$R$6:$R$77)","v":0},{"$f":"SUMIF(Março!$A$6:$R$80,A106,Março!$O$6:$O$80)","v":0},{"$f":"SUMIF(Março!$A$6:$R$80,A106,Março!$R$6:$R$80)","v":0},{"$f":"SUMIF(Abril!$A$6:$R$80,A106,Abril!$O$6:$O$80)","v":0},{"$f":"SUMIF(Abril!$A$6:$R$80,A106,Abril!$R$6:$R$80)","v":0},{"$f":"SUMIF(Maio!$A$6:$R$80,A106,Maio!$O$6:$O$80)","v":0},{"$f":"SUMIF(Maio!$A$6:$R$80,A106,Maio!$R$6:$R$80)","v":0},{"$f":"SUMIF(Junho!$A$6:$R$80,A106,Junho!$O$6:$O$80)","v":0},{"$f":"SUMIF(Junho!$A$6:$R$80,A106,Junho!$R$6:$R$80)","v":0},{"$f":"SUMIF(Julho!$A$6:$R$80,A106,Julho!$O$6:$O$80)","v":0},{"$f":"SUMIF(Julho!$A$6:$R$80,A106,Julho!$R$6:$R$80)","v":0},{"$f":"SUMIF([1]Agosto!$A$6:$R$80,A106,[1]Agosto!$O$6:$O$80)","v":{"$error":"#VALUE!"}},{"$f":"SUMIF([1]Agosto!$A$6:$R$80,A106,[1]Agosto!$R$6:$R$80)","v":{"$error":"#VALUE!"}},{"$f":"SUMIF([2]Setembro!$A$6:$R$80,A106,[2]Setembro!$O$6:$O$80)","v":{"$error":"#VALUE!"}},{"$f":"SUMIF([2]Setembro!$A$6:$R$80,A106,[2]Setembro!$R$6:$R$80)","v":{"$error":"#VALUE!"}},{"$f":"SUMIF([4]Outubro!$A$6:$R$80,A106,[4]Outubro!$O$6:$O$80)","v":{"$error":"#VALUE!"}},{"$f":"SUMIF([4]Outubro!$A$6:$R$80,A106,[4]Outubro!$R$6:$R$80)","v":{"$error":"#VALUE!"}},{"$f":"SUMIF([5]Novembro!$A$6:$R$80,A106,[5]Novembro!$O$6:$O$80)","v":{"$error":"#VALUE!"}},{"$f":"SUMIF([5]Novembro!$A$6:$R$80,A106,[5]Novembro!$R$6:$R$80)","v":{"$error":"#VALUE!"}},{"$f":"SUMIF([6]Dezembro!$A$6:$R$80,C106,[6]Dezembro!$O$6:$O$80)","v":{"$error":"#VALUE!"}},{"$f":"SUMIF([6]Dezembro!$A$6:$R$80,C106,[6]Dezembro!$R$6:$R$80)","v":{"$error":"#VALUE!"}},0,0]
[187402,"Perivaldo Ramos Azevedo",{"$f":"SUMIF(Janeiro!$B$6:$R$77,B107,Janeiro!$O$6:$O$77)","v":0},{"$f":"SUMIF(Janeiro!$B$6:$R$80,B107,Janeiro!$R$6:$R$80)","v":0},{"$f":"SUMIF(Fevereiro!$A$6:$R$77,A107,Fevereiro!$O$6:$O$77)","v":0},{"$f":"SUMIF(Fevereiro!$A$6:$R$77,A107,Fevereiro!$R$6:$R$77)","v":0},{"$f":"SUMIF(Março!$A$6:$R$80,A107,Março!$O$6:$O$80)","v":0},{"$f":"SUMIF(Março!$A$6:$R$80,A107,Março!$R$6:$R$80)","v":0},{"$f":"SUMIF(Abril!$A$6:$R$80,A107,Abril!$O$6:$O$80)","v":0},{"$f":"SUMIF(Abril!$A$6:$R$80,A107,Abril!$R$6:$R$80)","v":0},{"$f":"SUMIF(Maio!$A$6:$R$80,A107,Maio!$O$6:$O$80)","v":0},{"$f":"SUMIF(Maio!$A$6:$R$80,A107,Maio!$R$6:$R$80)","v":0},{"$f":"SUMIF(Junho!$A$6:$R$80,A107,Junho!$O$6:$O$80)","v":0},{"$f":"SUMIF(Junho!$A$6:$R$80,A107,Junho!$R$6:$R$80)","v":0},{"$f":"SUMIF(Julho!$A$6:$R$80,A107,Julho!$O$6:$O$80)","v":0},{"$f":"SUMIF(Julho!$A$6:$R$80,A107,Julho!$R$6:$R$80)","v":0},{"$f":"SUMIF([1]Agosto!$A$6:$R$80,A107,[1]Agosto!$O$6:$O$80)","v":{"$error":"#VALUE!"}},{"$f":"SUMIF([1]Agosto!$A$6:$R$80,A107,[1]Agosto!$R$6:$R$80)","v":{"$error":"#VALUE!"}},{"$f":"SUMIF([2]Setembro!$A$6:$R$80,A107,[2]Setembro!$O$6:$O$80)","v":{"$error":"#VALUE!"}},{"$f":"SUMIF([2]Setembro!$A$6:$R$80,A107,[2]Setembro!$R$6:$R$80)","v":{"$error":"#VALUE!"}},{"$f":"SUMIF([4]Outubro!$A$6:$R$80,A107,[4]Outubro!$O$6:$O$80)","v":{"$error":"#VALUE!"}},{"$f":"SUMIF([4]Outubro!$A$6:$R$80,A107,[4]Outubro!$R$6:$R$80)","v":{"$error":"#VALUE!"}},{"$f":"SUMIF([5]Novembro!$A$6:$R$80,A107,[5]Novembro!$O$6:$O$80)","v":{"$error":"#VALUE!"}},{"$f":"SUMIF([5]Novembro!$A$6:$R$80,A107,[5]Novembro!$R$6:$R$80)","v":{"$error":"#VALUE!"}},{"$f":"SUMIF([6]Dezembro!$A$6:$R$80,C107,[6]Dezembro!$O$6:$O$80)","v":{"$error":"#VALUE!"}},{"$f":"SUMIF([6]Dezembro!$A$6:$R$80,C107,[6]Dezembro!$R$6:$R$80)","v":{"$error":"#VALUE!"}},0,0]
[250805,"Elieide menezes Santos",{"$f":"SUMIF(Janeiro!$B$6:$R$77,B108,Janeiro!$O$6:$O$77)","v":0},{"$f":"SUMIF(Janeiro!$B$6:$R$80,B108,Janeiro!$R$6:$R$80)","v":0},{"$f":"SUMIF(Fevereiro!$A$6:$R$77,A108,Fevereiro!$O$6:$O$77)","v":0},{"$f":"SUMIF(Fevereiro!$A$6:$R$77,A108,Fevereiro!$R$6:$R$77)","v":0},{"$f":"SUMIF(Março!$A$6:$R$80,A108,Março!$O$6:$O$80)","v":0},{"$f":"SUMIF(Março!$A$6:$R$80,A108,Março!$R$6:$R$80)","v":0},{"$f":"SUMIF(Abril!$A$6:$R$80,A108,Abril!$O$6:$O$80)","v":0},{"$f":"SUMIF(Abril!$A$6:$R$80,A108,Abril!$R$6:$R$80)","v":0},{"$f":"SUMIF(Maio!$A$6:$R$80,A108,Maio!$O$6:$O$80)","v":0},{"$f":"SUMIF(Maio!$A$6:$R$80,A108,Maio!$R$6:$R$80)","v":0},{"$f":"SUMIF(Junho!$A$6:$R$80,A108,Junho!$O$6:$O$80)","v":0},{"$f":"SUMIF(Junho!$A$6:$R$80,A108,Junho!$R$6:$R$80)","v":0},{"$f":"SUMIF(Julho!$A$6:$R$80,A108,Julho!$O$6:$O$80)","v":0},{"$f":"SUMIF(Julho!$A$6:$R$80,A108,Julho!$R$6:$R$80)","v":0},{"$f":"SUMIF([1]Agosto!$A$6:$R$80,A108,[1]Agosto!$O$6:$O$80)","v":{"$error":"#VALUE!"}},{"$f":"SUMIF([1]Agosto!$A$6:$R$80,A108,[1]Agosto!$R$6:$R$80)","v":{"$error":"#VALUE!"}},{"$f":"SUMIF([2]Setembro!$A$6:$R$80,A108,[2]Setembro!$O$6:$O$80)","v":{"$error":"#VALUE!"}},{"$f":"SUMIF([2]Setembro!$A$6:$R$80,A108,[2]Setembro!$R$6:$R$80)","v":{"$error":"#VALUE!"}},{"$f":"SUMIF([4]Outubro!$A$6:$R$80,A108,[4]Outubro!$O$6:$O$80)","v":{"$error":"#VALUE!"}},{"$f":"SUMIF([4]Outubro!$A$6:$R$80,A108,[4]Outubro!$R$6:$R$80)","v":{"$error":"#VALUE!"}},{"$f":"SUMIF([5]Novembro!$A$6:$R$80,A108,[5]Novembro!$O$6:$O$80)","v":{"$error":"#VALUE!"}},{"$f":"SUMIF([5]Novembro!$A$6:$R$80,A108,[5]Novembro!$R$6:$R$80)","v":{"$error":"#VALUE!"}},{"$f":"SUMIF([6]Dezembro!$A$6:$R$80,C108,[6]Dezembro!$O$6:$O$80)","v":{"$error":"#VALUE!"}},{"$f":"SUMIF([6]Dezembro!$A$6:$R$80,C108,[6]Dezembro!$R$6:$R$80)","v":{"$error":"#VALUE!"}},0,0]
[250767,"Josenete do Rosário Silva",{"$f":"SUMIF(Janeiro!$B$6:$R$77,B109,Janeiro!$O$6:$O$77)","v":0},{"$f":"SUMIF(Janeiro!$B$6:$R$80,B109,Janeiro!$R$6:$R$80)","v":0},{"$f":"SUMIF(Fevereiro!$A$6:$R$77,A109,Fevereiro!$O$6:$O$77)","v":0},{"$f":"SUMIF(Fevereiro!$A$6:$R$77,A109,Fevereiro!$R$6:$R$77)","v":0},{"$f":"SUMIF(Março!$A$6:$R$80,A109,Março!$O$6:$O$80)","v":0},{"$f":"SUMIF(Março!$A$6:$R$80,A109,Março!$R$6:$R$80)","v":0},{"$f":"SUMIF(Abril!$A$6:$R$80,A109,Abril!$O$6:$O$80)","v":0},{"$f":"SUMIF(Abril!$A$6:$R$80,A109,Abril!$R$6:$R$80)","v":0},{"$f":"SUMIF(Maio!$A$6:$R$80,A109,Maio!$O$6:$O$80)","v":0},{"$f":"SUMIF(Maio!$A$6:$R$80,A109,Maio!$R$6:$R$80)","v":0},{"$f":"SUMIF(Junho!$A$6:$R$80,A109,Junho!$O$6:$O$80)","v":0},{"$f":"SUMIF(Junho!$A$6:$R$80,A109,Junho!$R$6:$R$80)","v":0},{"$f":"SUMIF(Julho!$A$6:$R$80,A109,Julho!$O$6:$O$80)","v":0},{"$f":"SUMIF(Julho!$A$6:$R$80,A109,Julho!$R$6:$R$80)","v":0},{"$f":"SUMIF([1]Agosto!$A$6:$R$80,A109,[1]Agosto!$O$6:$O$80)","v":{"$error":"#VALUE!"}},{"$f":"SUMIF([1]Agosto!$A$6:$R$80,A109,[1]Agosto!$R$6:$R$80)","v":{"$error":"#VALUE!"}},{"$f":"SUMIF([2]Setembro!$A$6:$R$80,A109,[2]Setembro!$O$6:$O$80)","v":{"$error":"#VALUE!"}},{"$f":"SUMIF([2]Setembro!$A$6:$R$80,A109,[2]Setembro!$R$6:$R$80)","v":{"$error":"#VALUE!"}},{"$f":"SUMIF([4]Outubro!$A$6:$R$80,A109,[4]Outubro!$O$6:$O$80)","v":{"$error":"#VALUE!"}},{"$f":"SUMIF([4]Outubro!$A$6:$R$80,A109,[4]Outubro!$R$6:$R$80)","v":{"$error":"#VALUE!"}},{"$f":"SUMIF([5]Novembro!$A$6:$R$80,A109,[5]Novembro!$O$6:$O$80)","v":{"$error":"#VALUE!"}},{"$f":"SUMIF([5]Novembro!$A$6:$R$80,A109,[5]Novembro!$R$6:$R$80)","v":{"$error":"#VALUE!"}},{"$f":"SUMIF([6]Dezembro!$A$6:$R$80,C109,[6]Dezembro!$O$6:$O$80)","v":{"$error":"#VALUE!"}},{"$f":"SUMIF([6]Dezembro!$A$6:$R$80,C109,[6]Dezembro!$R$6:$R$80)","v":{"$error":"#VALUE!"}},0,0]
[222933,"Raquel Vasconcelos Ribeiro",{"$f":"SUMIF(Janeiro!$B$6:$R$77,B110,Janeiro!$O$6:$O$77)","v":0},{"$f":"SUMIF(Janeiro!$B$6:$R$80,B110,Janeiro!$R$6:$R$80)","v":0},{"$f":"SUMIF(Fevereiro!$A$6:$R$77,A110,Fevereiro!$O$6:$O$77)","v":0},{"$f":"SUMIF(Fevereiro!$A$6:$R$77,A110,Fevereiro!$R$6:$R$77)","v":0},{"$f":"SUMIF(Março!$A$6:$R$80,A110,Março!$O$6:$O$80)","v":0},{"$f":"SUMIF(Março!$A$6:$R$80,A110,Março!$R$6:$R$80)","v":0},{"$f":"SUMIF(Abril!$A$6:$R$80,A110,Abril!$O$6:$O$80)","v":0},{"$f":"SUMIF(Abril!$A$6:$R$80,A110,Abril!$R$6:$R$80)","v":0},{"$f":"SUMIF(Maio!$A$6:$R$80,A110,Maio!$O$6:$O$80)","v":0},{"$f":"SUMIF(Maio!$A$6:$R$80,A110,Maio!$R$6:$R$80)","v":0},{"$f":"SUMIF(Junho!$A$6:$R$80,A110,Junho!$O$6:$O$80)","v":0},{"$f":"SUMIF(Junho!$A$6:$R$80,A110,Junho!$R$6:$R$80)","v":0},{"$f":"SUMIF(Julho!$A$6:$R$80,A110,Julho!$O$6:$O$80)","v":0},{"$f":"SUMIF(Julho!$A$6:$R$80,A110,Julho!$R$6:$R$80)","v":0},{"$f":"SUMIF([1]Agosto!$A$6:$R$80,A110,[1]Agosto!$O$6:$O$80)","v":{"$error":"#VALUE!"}},{"$f":"SUMIF([1]Agosto!$A$6:$R$80,A110,[1]Agosto!$R$6:$R$80)","v":{"$error":"#VALUE!"}},{"$f":"SUMIF([2]Setembro!$A$6:$R$80,A110,[2]Setembro!$O$6:$O$80)","v":{"$error":"#VALUE!"}},{"$f":"SUMIF([2]Setembro!$A$6:$R$80,A110,[2]Setembro!$R$6:$R$80)","v":{"$error":"#VALUE!"}},{"$f":"SUMIF([4]Outubro!$A$6:$R$80,A110,[4]Outubro!$O$6:$O$80)","v":{"$error":"#VALUE!"}},{"$f":"SUMIF([4]Outubro!$A$6:$R$80,A110,[4]Outubro!$R$6:$R$80)","v":{"$error":"#VALUE!"}},{"$f":"SUMIF([5]Novembro!$A$6:$R$80,A110,[5]Novembro!$O$6:$O$80)","v":{"$error":"#VALUE!"}},{"$f":"SUMIF([5]Novembro!$A$6:$R$80,A110,[5]Novembro!$R$6:$R$80)","v":{"$error":"#VALUE!"}},{"$f":"SUMIF([6]Dezembro!$A$6:$R$80,C110,[6]Dezembro!$O$6:$O$80)","v":{"$error":"#VALUE!"}},{"$f":"SUMIF([6]Dezembro!$A$6:$R$80,C110,[6]Dezembro!$R$6:$R$80)","v":{"$error":"#VALUE!"}},0,0]
[250775,"Natalia Almeida Souza",{"$f":"SUMIF(Janeiro!$B$6:$R$77,B111,Janeiro!$O$6:$O$77)","v":0},{"$f":"SUMIF(Janeiro!$B$6:$R$80,B111,Janeiro!$R$6:$R$80)","v":0},{"$f":"SUMIF(Fevereiro!$A$6:$R$77,A111,Fevereiro!$O$6:$O$77)","v":0},{"$f":"SUMIF(Fevereiro!$A$6:$R$77,A111,Fevereiro!$R$6:$R$77)","v":0},{"$f":"SUMIF(Março!$A$6:$R$80,A111,Março!$O$6:$O$80)","v":0},{"$f":"SUMIF(Março!$A$6:$R$80,A111,Março!$R$6:$R$80)","v":0},{"$f":"SUMIF(Abril!$A$6:$R$80,A111,Abril!$O$6:$O$80)","v":0},{"$f":"SUMIF(Abril!$A$6:$R$80,A111,Abril!$R$6:$R$80)","v":0},{"$f":"SUMIF(Maio!$A$6:$R$80,A111,Maio!$O$6:$O$80)","v":0},{"$f":"SUMIF(Maio!$A$6:$R$80,A111,Maio!$R$6:$R$80)","v":0},{"$f":"SUMIF(Junho!$A$6:$R$80,A111,Junho!$O$6:$O$80)","v":0},{"$f":"SUMIF(Junho!$A$6:$R$80,A111,Junho!$R$6:$R$80)","v":0},{"$f":"SUMIF(Julho!$A$6:$R$80,A111,Julho!$O$6:$O$80)","v":0},{"$f":"SUMIF(Julho!$A$6:$R$80,A111,Julho!$R$6:$R$80)","v":0},{"$f":"SUMIF([1]Agosto!$A$6:$R$80,A111,[1]Agosto!$O$6:$O$80)","v":{"$error":"#VALUE!"}},{"$f":"SUMIF([1]Agosto!$A$6:$R$80,A111,[1]Agosto!$R$6:$R$80)","v":{"$error":"#VALUE!"}},{"$f":"SUMIF([2]Setembro!$A$6:$R$80,A111,[2]Setembro!$O$6:$O$80)","v":{"$error":"#VALUE!"}},{"$f":"SUMIF([2]Setembro!$A$6:$R$80,A111,[2]Setembro!$R$6:$R$80)","v":{"$error":"#VALUE!"}},{"$f":"SUMIF([4]Outubro!$A$6:$R$80,A111,[4]Outubro!$O$6:$O$80)","v":{"$error":"#VALUE!"}},{"$f":"SUMIF([4]Outubro!$A$6:$R$80,A111,[4]Outubro!$R$6:$R$80)","v":{"$error":"#VALUE!"}},{"$f":"SUMIF([5]Novembro!$A$6:$R$80,A111,[5]Novembro!$O$6:$O$80)","v":{"$error":"#VALUE!"}},{"$f":"SUMIF([5]Novembro!$A$6:$R$80,A111,[5]Novembro!$R$6:$R$80)","v":{"$error":"#VALUE!"}},{"$f":"SUMIF([6]Dezembro!$A$6:$R$80,C111,[6]Dezembro!$O$6:$O$80)","v":{"$error":"#VALUE!"}},{"$f":"SUMIF([6]Dezembro!$A$6:$R$80,C111,[6]Dezembro!$R$6:$R$80)","v":{"$error":"#VALUE!"}},0,0]
[219533,"Manuel Sacramento da Cruz",{"$f":"SUMIF(Janeiro!$B$6:$R$77,B112,Janeiro!$O$6:$O$77)","v":0},{"$f":"SUMIF(Janeiro!$B$6:$R$80,B112,Janeiro!$R$6:$R$80)","v":0},{"$f":"SUMIF(Fevereiro!$A$6:$R$77,A112,Fevereiro!$O$6:$O$77)","v":0},{"$f":"SUMIF(Fevereiro!$A$6:$R$77,A112,Fevereiro!$R$6:$R$77)","v":0},{"$f":"SUMIF(Março!$A$6:$R$80,A112,Março!$O$6:$O$80)","v":0},{"$f":"SUMIF(Março!$A$6:$R$80,A112,Março!$R$6:$R$80)","v":0},{"$f":"SUMIF(Abril!$A$6:$R$80,A112,Abril!$O$6:$O$80)","v":0},{"$f":"SUMIF(Abril!$A$6:$R$80,A112,Abril!$R$6:$R$80)","v":0},{"$f":"SUMIF(Maio!$A$6:$R$80,A112,Maio!$O$6:$O$80)","v":0},{"$f":"SUMIF(Maio!$A$6:$R$80,A112,Maio!$R$6:$R$80)","v":0},{"$f":"SUMIF(Junho!$A$6:$R$80,A112,Junho!$O$6:$O$80)","v":0},{"$f":"SUMIF(Junho!$A$6:$R$80,A112,Junho!$R$6:$R$80)","v":0},{"$f":"SUMIF(Julho!$A$6:$R$80,A112,Julho!$O$6:$O$80)","v":0},{"$f":"SUMIF(Julho!$A$6:$R$80,A112,Julho!$R$6:$R$80)","v":0},{"$f":"SUMIF([1]Agosto!$A$6:$R$80,A112,[1]Agosto!$O$6:$O$80)","v":{"$error":"#VALUE!"}},{"$f":"SUMIF([1]Agosto!$A$6:$R$80,A112,[1]Agosto!$R$6:$R$80)","v":{"$error":"#VALUE!"}},{"$f":"SUMIF([2]Setembro!$A$6:$R$80,A112,[2]Setembro!$O$6:$O$80)","v":{"$error":"#VALUE!"}},{"$f":"SUMIF([2]Setembro!$A$6:$R$80,A112,[2]Setembro!$R$6:$R$80)","v":{"$error":"#VALUE!"}},{"$f":"SUMIF([4]Outubro!$A$6:$R$80,A112,[4]Outubro!$O$6:$O$80)","v":{"$error":"#VALUE!"}},{"$f":"SUMIF([4]Outubro!$A$6:$R$80,A112,[4]Outubro!$R$6:$R$80)","v":{"$error":"#VALUE!"}},{"$f":"SUMIF([5]Novembro!$A$6:$R$80,A112,[5]Novembro!$O$6:$O$80)","v":{"$error":"#VALUE!"}},{"$f":"SUMIF([5]Novembro!$A$6:$R$80,A112,[5]Novembro!$R$6:$R$80)","v":{"$error":"#VALUE!"}},{"$f":"SUMIF([6]Dezembro!$A$6:$R$80,C112,[6]Dezembro!$O$6:$O$80)","v":{"$error":"#VALUE!"}},{"$f":"SUMIF([6]Dezembro!$A$6:$R$80,C112,[6]Dezembro!$R$6:$R$80)","v":{"$error":"#VALUE!"}},{"$f":"IF(ISERROR(C112),0,C112)+IF(ISERROR(E112),0,E112)+IF(ISERROR(G112),0,G112)+IF(ISERROR(I112),0,I112)+IF(ISERROR(K112),0,K112)+IF(ISERROR(M112),0,M112)+IF(ISERROR(O112),0,O112)+IF(ISERROR(Q112),0,Q112)+IF(ISERROR(S112),0,S112)+IF(ISERROR(U112),0,U112)+IF(ISERROR(W112),0,W112)+IF(ISERROR(Y112),0,Y112)","v":0},{"$f":"IF(ISERROR(D112),0,D112)+IF(ISERROR(F112),0,F112)+IF(ISERROR(H112),0,H112)+IF(ISERROR(J112),0,J112)+IF(ISERROR(L112),0,L112)+IF(ISERROR(N112),0,N112)+IF(ISERROR(P112),0,P112)+IF(ISERROR(R112),0,R112)+IF(ISERROR(T112),0,T112)+IF(ISERROR(V112),0,V112)+IF(ISERROR(X112),0,X112)+IF(ISERROR(Z112),0,Z112)","v":0}]
[241725,"Severiano Dias Bulhosa",{"$f":"SUMIF(Janeiro!$B$6:$R$77,B113,Janeiro!$O$6:$O$77)","v":0},{"$f":"SUMIF(Janeiro!$B$6:$R$80,B113,Janeiro!$R$6:$R$80)","v":0},{"$f":"SUMIF(Fevereiro!$A$6:$R$77,A113,Fevereiro!$O$6:$O$77)","v":0},{"$f":"SUMIF(Fevereiro!$A$6:$R$77,A113,Fevereiro!$R$6:$R$77)","v":0},{"$f":"SUMIF(Março!$A$6:$R$80,A113,Março!$O$6:$O$80)","v":0},{"$f":"SUMIF(Março!$A$6:$R$80,A113,Março!$R$6:$R$80)","v":0},{"$f":"SUMIF(Abril!$A$6:$R$80,A113,Abril!$O$6:$O$80)","v":0},{"$f":"SUMIF(Abril!$A$6:$R$80,A113,Abril!$R$6:$R$80)","v":0},{"$f":"SUMIF(Maio!$A$6:$R$80,A113,Maio!$O$6:$O$80)","v":0},{"$f":"SUMIF(Maio!$A$6:$R$80,A113,Maio!$R$6:$R$80)","v":0},{"$f":"SUMIF(Junho!$A$6:$R$80,A113,Junho!$O$6:$O$80)","v":0},{"$f":"SUMIF(Junho!$A$6:$R$80,A113,Junho!$R$6:$R$80)","v":0},{"$f":"SUMIF(Julho!$A$6:$R$80,A113,Julho!$O$6:$O$80)","v":0},{"$f":"SUMIF(Julho!$A$6:$R$80,A113,Julho!$R$6:$R$80)","v":0},{"$f":"SUMIF([1]Agosto!$A$6:$R$80,A113,[1]Agosto!$O$6:$O$80)","v":{"$error":"#VALUE!"}},{"$f":"SUMIF([1]Agosto!$A$6:$R$80,A113,[1]Agosto!$R$6:$R$80)","v":{"$error":"#VALUE!"}},{"$f":"SUMIF([2]Setembro!$A$6:$R$80,A113,[2]Setembro!$O$6:$O$80)","v":{"$error":"#VALUE!"}},{"$f":"SUMIF([2]Setembro!$A$6:$R$80,A113,[2]Setembro!$R$6:$R$80)","v":{"$error":"#VALUE!"}},{"$f":"SUMIF([4]Outubro!$A$6:$R$80,A113,[4]Outubro!$O$6:$O$80)","v":{"$error":"#VALUE!"}},{"$f":"SUMIF([4]Outubro!$A$6:$R$80,A113,[4]Outubro!$R$6:$R$80)","v":{"$error":"#VALUE!"}},{"$f":"SUMIF([5]Novembro!$A$6:$R$80,A113,[5]Novembro!$O$6:$O$80)","v":{"$error":"#VALUE!"}},{"$f":"SUMIF([5]Novembro!$A$6:$R$80,A113,[5]Novembro!$R$6:$R$80)","v":{"$error":"#VALUE!"}},{"$f":"SUMIF([6]Dezembro!$A$6:$R$80,C113,[6]Dezembro!$O$6:$O$80)","v":{"$error":"#VALUE!"}},{"$f":"SUMIF([6]Dezembro!$A$6:$R$80,C113,[6]Dezembro!$R$6:$R$80)","v":{"$error":"#VALUE!"}},0,0]
[162094,"Joanice Márcia de Jesus",{"$f":"SUMIF(Janeiro!$B$6:$R$77,B114,Janeiro!$O$6:$O$77)","v":0},{"$f":"SUMIF(Janeiro!$B$6:$R$80,B114,Janeiro!$R$6:$R$80)","v":0},{"$f":"SUMIF(Fevereiro!$A$6:$R$77,A114,Fevereiro!$O$6:$O$77)","v":0},{"$f":"SUMIF(Fevereiro!$A$6:$R$77,A114,Fevereiro!$R$6:$R$77)","v":0},{"$f":"SUMIF(Março!$A$6:$R$80,A114,Março!$O$6:$O$80)","v":0},{"$f":"SUMIF(Março!$A$6:$R$80,A114,Março!$R$6:$R$80)","v":0},{"$f":"SUMIF(Abril!$A$6:$R$80,A114,Abril!$O$6:$O$80)","v":0},{"$f":"SUMIF(Abril!$A$6:$R$80,A114,Abril!$R$6:$R$80)","v":0},{"$f":"SUMIF(Maio!$A$6:$R$80,A114,Maio!$O$6:$O$80)","v":0},{"$f":"SUMIF(Maio!$A$6:$R$80,A114,Maio!$R$6:$R$80)","v":0},{"$f":"SUMIF(Junho!$A$6:$R$80,A114,Junho!$O$6:$O$80)","v":0},{"$f":"SUMIF(Junho!$A$6:$R$80,A114,Junho!$R$6:$R$80)","v":0},{"$f":"SUMIF(Julho!$A$6:$R$80,A114,Julho!$O$6:$O$80)","v":0},{"$f":"SUMIF(Julho!$A$6:$R$80,A114,Julho!$R$6:$R$80)","v":0},{"$f":"SUMIF([1]Agosto!$A$6:$R$80,A114,[1]Agosto!$O$6:$O$80)","v":{"$error":"#VALUE!"}},{"$f":"SUMIF([1]Agosto!$A$6:$R$80,A114,[1]Agosto!$R$6:$R$80)","v":{"$error":"#VALUE!"}},{"$f":"SUMIF([2]Setembro!$A$6:$R$80,A114,[2]Setembro!$O$6:$O$80)","v":{"$error":"#VALUE!"}},{"$f":"SUMIF([2]Setembro!$A$6:$R$80,A114,[2]Setembro!$R$6:$R$80)","v":{"$error":"#VALUE!"}},{"$f":"SUMIF([4]Outubro!$A$6:$R$80,A114,[4]Outubro!$O$6:$O$80)","v":{"$error":"#VALUE!"}},{"$f":"SUMIF([4]Outubro!$A$6:$R$80,A114,[4]Outubro!$R$6:$R$80)","v":{"$error":"#VALUE!"}},{"$f":"SUMIF([5]Novembro!$A$6:$R$80,A114,[5]Novembro!$O$6:$O$80)","v":{"$error":"#VALUE!"}},{"$f":"SUMIF([5]Novembro!$A$6:$R$80,A114,[5]Novembro!$R$6:$R$80)","v":{"$error":"#VALUE!"}},{"$f":"SUMIF([6]Dezembro!$A$6:$R$80,C114,[6]Dezembro!$O$6:$O$80)","v":{"$error":"#VALUE!"}},{"$f":"SUMIF([6]Dezembro!$A$6:$R$80,C114,[6]Dezembro!$R$6:$R$80)","v":{"$error":"#VALUE!"}},0,0]
[215570,"Elias do Lago",{"$f":"SUMIF(Janeiro!$B$6:$R$77,B115,Janeiro!$O$6:$O$77)","v":0},{"$f":"SUMIF(Janeiro!$B$6:$R$80,B115,Janeiro!$R$6:$R$80)","v":0},{"$f":"SUMIF(Fevereiro!$A$6:$R$77,A115,Fevereiro!$O$6:$O$77)","v":0},{"$f":"SUMIF(Fevereiro!$A$6:$R$77,A115,Fevereiro!$R$6:$R$77)","v":0},{"$f":"SUMIF(Março!$A$6:$R$80,A115,Março!$O$6:$O$80)","v":0},{"$f":"SUMIF(Março!$A$6:$R$80,A115,Março!$R$6:$R$80)","v":0},{"$f":"SUMIF(Abril!$A$6:$R$80,A115,Abril!$O$6:$O$80)","v":0},{"$f":"SUMIF(Abril!$A$6:$R$80,A115,Abril!$R$6:$R$80)","v":0},{"$f":"SUMIF(Maio!$A$6:$R$80,A115,Maio!$O$6:$O$80)","v":0},{"$f":"SUMIF(Maio!$A$6:$R$80,A115,Maio!$R$6:$R$80)","v":0},{"$f":"SUMIF(Junho!$A$6:$R$80,A115,Junho!$O$6:$O$80)","v":0},{"$f":"SUMIF(Junho!$A$6:$R$80,A115,Junho!$R$6:$R$80)","v":0},{"$f":"SUMIF(Julho!$A$6:$R$80,A115,Julho!$O$6:$O$80)","v":0},{"$f":"SUMIF(Julho!$A$6:$R$80,A115,Julho!$R$6:$R$80)","v":0},{"$f":"SUMIF([1]Agosto!$A$6:$R$80,A115,[1]Agosto!$O$6:$O$80)","v":{"$error":"#VALUE!"}},{"$f":"SUMIF([1]Agosto!$A$6:$R$80,A115,[1]Agosto!$R$6:$R$80)","v":{"$error":"#VALUE!"}},{"$f":"SUMIF([2]Setembro!$A$6:$R$80,A115,[2]Setembro!$O$6:$O$80)","v":{"$error":"#VALUE!"}},{"$f":"SUMIF([2]Setembro!$A$6:$R$80,A115,[2]Setembro!$R$6:$R$80)","v":{"$error":"#VALUE!"}},{"$f":"SUMIF([4]Outubro!$A$6:$R$80,A115,[4]Outubro!$O$6:$O$80)","v":{"$error":"#VALUE!"}},{"$f":"SUMIF([4]Outubro!$A$6:$R$80,A115,[4]Outubro!$R$6:$R$80)","v":{"$error":"#VALUE!"}},{"$f":"SUMIF([5]Novembro!$A$6:$R$80,A115,[5]Novembro!$O$6:$O$80)","v":{"$error":"#VALUE!"}},{"$f":"SUMIF([5]Novembro!$A$6:$R$80,A115,[5]Novembro!$R$6:$R$80)","v":{"$error":"#VALUE!"}},{"$f":"SUMIF([6]Dezembro!$A$6:$R$80,C115,[6]Dezembro!$O$6:$O$80)","v":{"$error":"#VALUE!"}},{"$f":"SUMIF([6]Dezembro!$A$6:$R$80,C115,[6]Dezembro!$R$6:$R$80)","v":{"$error":"#VALUE!"}},0,0]
[218030,"Alexsandro Vida de Almeida",{"$f":"SUMIF(Janeiro!$B$6:$R$77,B116,Janeiro!$O$6:$O$77)","v":0},{"$f":"SUMIF(Janeiro!$B$6:$R$80,B116,Janeiro!$R$6:$R$80)","v":0},{"$f":"SUMIF(Fevereiro!$A$6:$R$77,A116,Fevereiro!$O$6:$O$77)","v":0},{"$f":"SUMIF(Fevereiro!$A$6:$R$77,A116,Fevereiro!$R$6:$R$77)","v":0},{"$f":"SUMIF(Março!$A$6:$R$80,A116,Março!$O$6:$O$80)","v":0},{"$f":"SUMIF(Março!$A$6:$R$80,A116,Março!$R$6:$R$80)","v":0},{"$f":"SUMIF(Abril!$A$6:$R$80,A116,Abril!$O$6:$O$80)","v":0},{"$f":"SUMIF(Abril!$A$6:$R$80,A116,Abril!$R$6:$R$80)","v":0},{"$f":"SUMIF(Maio!$A$6:$R$80,A116,Maio!$O$6:$O$80)","v":0},{"$f":"SUMIF(Maio!$A$6:$R$80,A116,Maio!$R$6:$R$80)","v":0},{"$f":"SUMIF(Junho!$A$6:$R$80,A116,Junho!$O$6:$O$80)","v":0},{"$f":"SUMIF(Junho!$A$6:$R$80,A116,Junho!$R$6:$R$80)","v":0},{"$f":"SUMIF(Julho!$A$6:$R$80,A116,Julho!$O$6:$O$80)","v":0},{"$f":"SUMIF(Julho!$A$6:$R$80,A116,Julho!$R$6:$R$80)","v":0},{"$f":"SUMIF([1]Agosto!$A$6:$R$80,A116,[1]Agosto!$O$6:$O$80)","v":{"$error":"#VALUE!"}},{"$f":"SUMIF([1]Agosto!$A$6:$R$80,A116,[1]Agosto!$R$6:$R$80)","v":{"$error":"#VALUE!"}},{"$f":"SUMIF([2]Setembro!$A$6:$R$80,A116,[2]Setembro!$O$6:$O$80)","v":{"$error":"#VALUE!"}},{"$f":"SUMIF([2]Setembro!$A$6:$R$80,A116,[2]Setembro!$R$6:$R$80)","v":{"$error":"#VALUE!"}},{"$f":"SUMIF([4]Outubro!$A$6:$R$80,A116,[4]Outubro!$O$6:$O$80)","v":{"$error":"#VALUE!"}},{"$f":"SUMIF([4]Outubro!$A$6:$R$80,A116,[4]Outubro!$R$6:$R$80)","v":{"$error":"#VALUE!"}},{"$f":"SUMIF([5]Novembro!$A$6:$R$80,A116,[5]Novembro!$O$6:$O$80)","v":{"$error":"#VALUE!"}},{"$f":"SUMIF([5]Novembro!$A$6:$R$80,A116,[5]Novembro!$R$6:$R$80)","v":{"$error":"#VALUE!"}},{"$f":"SUMIF([6]Dezembro!$A$6:$R$80,C116,[6]Dezembro!$O$6:$O$80)","v":{"$error":"#VALUE!"}},{"$f":"SUMIF([6]Dezembro!$A$6:$R$80,C116,[6]Dezembro!$R$6:$R$80)","v":{"$error":"#VALUE!"}},0,0]
[221724,"Milena Santos Santana",{"$f":"SUMIF(Janeiro!$B$6:$R$77,B117,Janeiro!$O$6:$O$77)","v":0},{"$f":"SUMIF(Janeiro!$B$6:$R$80,B117,Janeiro!$R$6:$R$80)","v":0},{"$f":"SUMIF(Fevereiro!$A$6:$R$77,A117,Fevereiro!$O$6:$O$77)","v":0},{"$f":"SUMIF(Fevereiro!$A$6:$R$77,A117,Fevereiro!$R$6:$R$77)","v":0},{"$f":"SUMIF(Março!$A$6:$R$80,A117,Março!$O$6:$O$80)","v":0},{"$f":"SUMIF(Março!$A$6:$R$80,A117,Março!$R$6:$R$80)","v":0},{"$f":"SUMIF(Abril!$A$6:$R$80,A117,Abril!$O$6:$O$80)","v":0},{"$f":"SUMIF(Abril!$A$6:$R$80,A117,Abril!$R$6:$R$80)","v":0},{"$f":"SUMIF(Maio!$A$6:$R$80,A117,Maio!$O$6:$O$80)","v":0},{"$f":"SUMIF(Maio!$A$6:$R$80,A117,Maio!$R$6:$R$80)","v":0},{"$f":"SUMIF(Junho!$A$6:$R$80,A117,Junho!$O$6:$O$80)","v":0},{"$f":"SUMIF(Junho!$A$6:$R$80,A117,Junho!$R$6:$R$80)","v":0},{"$f":"SUMIF(Julho!$A$6:$R$80,A117,Julho!$O$6:$O$80)","v":0},{"$f":"SUMIF(Julho!$A$6:$R$80,A117,Julho!$R$6:$R$80)","v":0},{"$f":"SUMIF([1]Agosto!$A$6:$R$80,A117,[1]Agosto!$O$6:$O$80)","v":{"$error":"#VALUE!"}},{"$f":"SUMIF([1]Agosto!$A$6:$R$80,A117,[1]Agosto!$R$6:$R$80)","v":{"$error":"#VALUE!"}},{"$f":"SUMIF([2]Setembro!$A$6:$R$80,A117,[2]Setembro!$O$6:$O$80)","v":{"$error":"#VALUE!"}},{"$f":"SUMIF([2]Setembro!$A$6:$R$80,A117,[2]Setembro!$R$6:$R$80)","v":{"$error":"#VALUE!"}},{"$f":"SUMIF([4]Outubro!$A$6:$R$80,A117,[4]Outubro!$O$6:$O$80)","v":{"$error":"#VALUE!"}},{"$f":"SUMIF([4]Outubro!$A$6:$R$80,A117,[4]Outubro!$R$6:$R$80)","v":{"$error":"#VALUE!"}},{"$f":"SUMIF([5]Novembro!$A$6:$R$80,A117,[5]Novembro!$O$6:$O$80)","v":{"$error":"#VALUE!"}},{"$f":"SUMIF([5]Novembro!$A$6:$R$80,A117,[5]Novembro!$R$6:$R$80)","v":{"$error":"#VALUE!"}},{"$f":"SUMIF([6]Dezembro!$A$6:$R$80,C117,[6]Dezembro!$O$6:$O$80)","v":{"$error":"#VALUE!"}},{"$f":"SUMIF([6]Dezembro!$A$6:$R$80,C117,[6]Dezembro!$R$6:$R$80)","v":{"$error":"#VALUE!"}},0,0]
[114243,"Fernando Cardoso Soares",{"$f":"SUMIF(Janeiro!$B$6:$R$77,B118,Janeiro!$O$6:$O$77)","v":0},{"$f":"SUMIF(Janeiro!$B$6:$R$80,B118,Janeiro!$R$6:$R$80)","v":0},{"$f":"SUMIF(Fevereiro!$A$6:$R$77,A118,Fevereiro!$O$6:$O$77)","v":0},{"$f":"SUMIF(Fevereiro!$A$6:$R$77,A118,Fevereiro!$R$6:$R$77)","v":0},{"$f":"SUMIF(Março!$A$6:$R$80,A118,Março!$O$6:$O$80)","v":0},{"$f":"SUMIF(Março!$A$6:$R$80,A118,Março!$R$6:$R$80)","v":0},{"$f":"SUMIF(Abril!$A$6:$R$80,A118,Abril!$O$6:$O$80)","v":38},{"$f":"SUMIF(Abril!$A$6:$R$80,A118,Abril!$R$6:$R$80)","v":195.7},{"$f":"SUMIF(Maio!$A$6:$R$80,A118,Maio!$O$6:$O$80)","v":0},{"$f":"SUMIF(Maio!$A$6:$R$80,A118,Maio!$R$6:$R$80)","v":0},{"$f":"SUMIF(Junho!$A$6:$R$80,A118,Junho!$O$6:$O$80)","v":0},{"$f":"SUMIF(Junho!$A$6:$R$80,A118,Junho!$R$6:$R$80)","v":0},{"$f":"SUMIF(Julho!$A$6:$R$80,A118,Julho!$O$6:$O$80)","v":0},{"$f":"SUMIF(Julho!$A$6:$R$80,A118,Julho!$R$6:$R$80)","v":0},{"$f":"SUMIF([1]Agosto!$A$6:$R$80,A118,[1]Agosto!$O$6:$O$80)","v":{"$error":"#VALUE!"}},{"$f":"SUMIF([1]Agosto!$A$6:$R$80,A118,[1]Agosto!$R$6:$R$80)","v":{"$error":"#VALUE!"}},{"$f":"SUMIF([2]Setembro!$A$6:$R$80,A118,[2]Setembro!$O$6:$O$80)","v":{"$error":"#VALUE!"}},{"$f":"SUMIF([2]Setembro!$A$6:$R$80,A118,[2]Setembro!$R$6:$R$80)","v":{"$error":"#VALUE!"}},{"$f":"SUMIF([4]Outubro!$A$6:$R$80,A118,[4]Outubro!$O$6:$O$80)","v":{"$error":"#VALUE!"}},{"$f":"SUMIF([4]Outubro!$A$6:$R$80,A118,[4]Outubro!$R$6:$R$80)","v":{"$error":"#VALUE!"}},{"$f":"SUMIF([5]Novembro!$A$6:$R$80,A118,[5]Novembro!$O$6:$O$80)","v":{"$error":"#VALUE!"}},{"$f":"SUMIF([5]Novembro!$A$6:$R$80,A118,[5]Novembro!$R$6:$R$80)","v":{"$error":"#VALUE!"}},{"$f":"SUMIF([6]Dezembro!$A$6:$R$80,C118,[6]Dezembro!$O$6:$O$80)","v":{"$error":"#VALUE!"}},{"$f":"SUMIF([6]Dezembro!$A$6:$R$80,C118,[6]Dezembro!$R$6:$R$80)","v":{"$error":"#VALUE!"}},38,195.7]
[243337,"Fabio da Silva Alves",{"$f":"SUMIF(Janeiro!$B$6:$R$77,B119,Janeiro!$O$6:$O$77)","v":0},{"$f":"SUMIF(Janeiro!$B$6:$R$80,B119,Janeiro!$R$6:$R$80)","v":0},{"$f":"SUMIF(Fevereiro!$A$6:$R$77,A119,Fevereiro!$O$6:$O$77)","v":0},{"$f":"SUMIF(Fevereiro!$A$6:$R$77,A119,Fevereiro!$R$6:$R$77)","v":0},{"$f":"SUMIF(Março!$A$6:$R$80,A119,Março!$O$6:$O$80)","v":0},{"$f":"SUMIF(Março!$A$6:$R$80,A119,Março!$R$6:$R$80)","v":0},{"$f":"SUMIF(Abril!$A$6:$R$80,A119,Abril!$O$6:$O$80)","v":0},{"$f":"SUMIF(Abril!$A$6:$R$80,A119,Abril!$R$6:$R$80)","v":0},{"$f":"SUMIF(Maio!$A$6:$R$80,A119,Maio!$O$6:$O$80)","v":0},{"$f":"SUMIF(Maio!$A$6:$R$80,A119,Maio!$R$6:$R$80)","v":0},{"$f":"SUMIF(Junho!$A$6:$R$80,A119,Junho!$O$6:$O$80)","v":0},{"$f":"SUMIF(Junho!$A$6:$R$80,A119,Junho!$R$6:$R$80)","v":0},{"$f":"SUMIF(Julho!$A$6:$R$80,A119,Julho!$O$6:$O$80)","v":0},{"$f":"SUMIF(Julho!$A$6:$R$80,A119,Julho!$R$6:$R$80)","v":0},{"$f":"SUMIF([1]Agosto!$A$6:$R$80,A119,[1]Agosto!$O$6:$O$80)","v":{"$error":"#VALUE!"}},{"$f":"SUMIF([1]Agosto!$A$6:$R$80,A119,[1]Agosto!$R$6:$R$80)","v":{"$error":"#VALUE!"}},{"$f":"SUMIF([2]Setembro!$A$6:$R$80,A119,[2]Setembro!$O$6:$O$80)","v":{"$error":"#VALUE!"}},{"$f":"SUMIF([2]Setembro!$A$6:$R$80,A119,[2]Setembro!$R$6:$R$80)","v":{"$error":"#VALUE!"}},{"$f":"SUMIF([4]Outubro!$A$6:$R$80,A119,[4]Outubro!$O$6:$O$80)","v":{"$error":"#VALUE!"}},{"$f":"SUMIF([4]Outubro!$A$6:$R$80,A119,[4]Outubro!$R$6:$R$80)","v":{"$error":"#VALUE!"}},{"$f":"SUMIF([5]Novembro!$A$6:$R$80,A119,[5]Novembro!$O$6:$O$80)","v":{"$error":"#VALUE!"}},{"$f":"SUMIF([5]Novembro!$A$6:$R$80,A119,[5]Novembro!$R$6:$R$80)","v":{"$error":"#VALUE!"}},{"$f":"SUMIF([6]Dezembro!$A$6:$R$80,C119,[6]Dezembro!$O$6:$O$80)","v":{"$error":"#VALUE!"}},{"$f":"SUMIF([6]Dezembro!$A$6:$R$80,C119,[6]Dezembro!$R$6:$R$80)","v":{"$error":"#VALUE!"}},0,0]
[]
[null,"Janeiro","Fevereiro","Março","Abril","Maio","Junho","Julho","Agosto","Setembro","Outubro","Novembro","Dezembro",{"$f":"Rel_Gestao!$AA$4","v":"TOTAL"},"1º TRIM","2º TRIM","3º TRIM","4ºTRIM","1º SEM","2º SEM","ANUAL"]
["Descontos",{"$f":"IF(ISERROR(SUM(Janeiro!$J$1:$J$3)),\"\",SUM(Janeiro!$J$1:$J$3))","v":0},{"$f":"IF(ISERROR(SUM(Fevereiro!$J$1:$J$3)),\"\",SUM(Fevereiro!$J$1:$J$3))","v":0},{"$f":"IF(ISERROR(SUM(Março!$J$1:$J$3)),\"\",SUM(Março!$J$1:$J$3))","v":0},{"$f":"IF(ISERROR(SUM(Abril!$J$1:$J$3)),\"\",SUM(Abril!$J$1:$J$3))","v":0},{"$f":"IF(ISERROR(SUM(Maio!$J$1:$J$3)),\"\",SUM(Maio!$J$1:$J$3))","v":0},{"$f":"IF(ISERROR(SUM(Junho!$J$1:$J$3)),\"\",SUM(Junho!$J$1:$J$3))","v":250.8},{"$f":"IF(ISERROR(SUM(Julho!$J$1:$J$3)),\"\",SUM(Julho!$J$1:$J$3))","v":132},{"$f":"IF(ISERROR(SUM([7]AGO!$J$1:$J$3)),\"\",SUM([7]AGO!$J$1:$J$3))","v":""},{"$f":"IF(ISERROR(SUM([3]SET!$J$1:$J$3)),\"\",SUM([3]SET!$J$1:$J$3))","v":""},{"$f":"IF(ISERROR(SUM([8]OUT!$J$1:$J$3)),\"\",SUM([8]OUT!$J$1:$J$3))","v":""},{"$f":"IF(ISERROR(SUM([9]NOV!$J$1:$J$3)),\"\",SUM([9]NOV!$J$1:$J$3))","v":""},{"$f":"IF(ISERROR(SUM([10]DEZ!$J$1:$J$3)),\"\",SUM([10]DEZ!$J$1:$J$3))","v":""},{"$f":"IF(ISERROR(SUM(B122:M122)),\"\",(SUM(B122:M122)))","v":382.8},{"$f":"AVERAGE(B122,C122,D122)","v":0},{"$f":"AVERAGE(E122,F122,G122)","v":83.600000000000009},{"$f":"AVERAGE(H122,I122,J122)","v":132},{"$f":"AVERAGE(K122,L122,M122)","v":{"$error":"#DIV/0!"}},{"$f":"AVERAGE(B122,C122,D122,E122,F122,G122)","v":41.800000000000004},{"$f":"AVERAGE(H122,I122,J122,K122,L122,M122)","v":132},{"$f":"AVERAGE(B122:M122)","v":54.68571428571429}]

{"sheet":"Rotas","index":11,"n_rows":21,"n_cols":7,"rows_kept":21,"cut":false,"hidden":false,"merged":[[0,0,1,6]]}
["Cadastro de Rotas"]
[]
["Rota","Grupo","Origem","Destino","Tipo","Empresa","Valor"]
[23185,"000000","Itabuna","Ubaitaba","Intermunicipal","Águia Branca",13.47]
["xxxxx-Y",null,"Dias D'Ávila","Camaçari","Intermunicipal","Cidade das Águas",2.8]
[23184,"000000","Jequié","Ipiaú","Intermunicipal","Cidade Sol",10.65]
[23196,"000000","Alagoinhas","Salvador","Intermunicipal","Cidade Sol",28.35]
[23183,"000000","Feira de Santana","Feira de Santana","Urbano","Via Feira",3.1]
["23125-M","000000","Conceição de Feira","Salvador","Intermunicipal","Viação Jauá",23.03]
["23190-V","000000","Lauro de Freitas","Salvador","Intermunicipal","Metropasse",3.3]
["xxxxx-Y (Pool)","000000","Feira de Santana","Camaçari","Intermunicipal","Lis Transportes",650]
["xxxxx-Y (Pool 1)","000001","Feira de Santana","Camaçari","Intermunicipal","Lis Transportes",17.623699999999999]
[23182,"000000","Amélia Rodrigues","Governador Mangabeira","Intermunicipal","RD Transportes",9.06]
["23101-A (09096)","09096","Salvador","Salvador","Urbano","Salvador Card",3.3]
["23101-A (19356)","19356","Salvador","Salvador","Urbano","Salvador Card",3.3]
["23140-T","000000","Feira de Santana","Salvador","Intermunicipal","Santana e São Paulo",23.06]
[23181,"000000","Feira de Santana","Governador Mangabeira","Intermunicipal","Santana e São Paulo",11.06]
["23170-I","000000","Aracaju","Aracaju","Urbano","Aracaju Card",3.1]
["xxxxx-c","000000","Camaçari","Camaçari","Urbano","Camaçari Card",2.2999999999999998]
["xxxxx-B","000000","Amélia Rodrigues","Governador Mangabeira","Intermunicipal","Camurujipe",10.81]
[23195,"000000","Salvador","Vera Cruz (Mar Grande)","Intermunicipal","Vera Cruz Transportes",5.95]

{"sheet":"Usuários","index":12,"n_rows":28,"n_cols":16,"rows_kept":28,"cut":false,"hidden":false,"merged":[[0,0,1,4]]}
["Cadastro de Usuários"]
[]
["Matrícula","Empregado","Vínculo","Unid. Organiz.","Setor",null,null,null,null,null,null,"Vínculo",null,"Setor",null,"Instalação"]
["000.001","João","Anistiado","Salvador","ADMINISTRATIVO",null,null,null,null,null,null,"Anistiado",null,"ADMINISTRATIVO",null,"Salvador"]
["000.002","Maria","Anistiado","Salvador","ADMINISTRATIVO",null,null,null,null,null,null,"Cedido",null,"PESSOAL",null,"Aracaju"]
["000.003","Francisco","Anistiado","Salvador","ADMINISTRATIVO",null,null,null,null,null,null,"Empregado",null,"FINANCEIRO",null,"Feira de Santana"]
["000.004","Ricardo","Empregado","Salvador","ADMINISTRATIVO",null,null,null,null,null,null,"Aprendiz",null,"COMERCIAL"]
["000.005","Mauro","Empregado","Salvador","ADMINISTRATIVO",null,null,null,null,null,null,"Estagiário",null,"LOGISTICA"]
["000.006","Marcio","Empregado","Salvador","ADMINISTRATIVO"]
["000.007","Carla","Empregado","Salvador","ADMINISTRATIVO",null,null,null,null,null,null,"Situação"]
["000.008","Caroline","Empregado","Salvador","COMERCIAL",null,null,null,null,null,null,"Regular"]
["000.009","Pedro","Empregado","Salvador","COMERCIAL",null,null,null,null,null,null,"Irregular"]
["000.010","Paulo","Empregado","Salvador","COMERCIAL"]
["000.011","Rafael","Empregado","Salvador","COMERCIAL"]
["000.012","Ricardo","Empregado","Salvador","COMERCIAL"]
["000.013","Jose","Empregado","Salvador","COMERCIAL"]
["000.014","Felipe","Empregado","Salvador","COMERCIAL"]
["000.015","Julio","Empregado","Salvador","COMERCIAL"]
["000.016","Lucia","Empregado","Salvador","PESSOAL"]
["000.017","Luciano","Empregado","Salvador","PESSOAL"]
["000.018","Bruno","Empregado","Salvador","PESSOAL"]
["000.019","Vinicius","Anistiado","Salvador","PESSOAL"]
["000.020","José Carlos","Empregado","Salvador","LOGISTICA"]
["000.021","Carlos","Empregado","Salvador","LOGISTICA"]
["000.022","Miguel","Empregado","Salvador","LOGISTICA"]
["000.023","Gustavo","Empregado","Salvador","FINANCEIRO"]
["000.024","Guilherme","Empregado","Salvador","FINANCEIRO"]
["000.025","Bruno Brito","Empregado","Salvador","FINANCEIRO"]

{"sheet":"Empresas","index":13,"n_rows":18,"n_cols":10,"rows_kept":18,"cut":false,"hidden":false,"merged":[[0,0,1,3]]}
["Cadastro de Empresas"]
[]
["Razão Social","Fantasia","Endereço","Cidade","UF","CNPJ","Titular","Banco","Agência","Conta Corrente"]
["Viação Águia Branca S/A","Águia Branca","Av. ACM, 4362, Terminal Rodoviário de Salvador, Pituba","Salvador","Bahia","27.486.182/0079-79","Viação Águia Branca S/A","Caixa Econ. Federal",590,"00000000110-6"]
["Aracaju Card","Aracaju Card"]
["Metropasse","Metropasse"]
["Viação Cidade das Águas Ltda","Cidade das Águas","Rua Washington Luís, 131, Parque Petrópolis ","Dias D'Ávila","Bahia","04.674.044/0001-58","Viação Cidade das Águas","Bradesco","2864-9","2432-5"]
["Viação Jequié Cidade Sol Ltda","Cidade Sol","Av. Otávio Mangabeira, SN, Mandacarú","Jequié","Bahia","14.602.189/0001-05","Viação Jequié Cidade Sol Ltda","Bradesco","3522-0","26944-1"]
["Assoc.Empresas Transp.Coletivo de Feira","Via Feira","Rua Olímpio Vital, Estação Trasbordo Central, SN, Centro","Feira de Santana","Bahia","72.189.988/0001-90","Via Feira","Santander","0784-6","13000743-3"]
["Viação Jauá Ltda","Viação Jauá","Av. Heitor Dias, 1555-A , Retiro","Salvador","Bahia","01.767.998/0001-17","Viação Jauá Ltda","Banco do Brasil","2967-x","27.678-2"]
["Lis Transportes e Turismo Ltda","Lis Transportes","Av. Rio Bandeira, nº 44-A - Alto do Triângulo","Camaçari","Bahia","01.851.607/0001-48","Lis Transportes","Bradesco","3563-7","30202-3"]
["RD Transportes Ltda","RD Transportes","Av. ACM, 4362 – Terminal Rodoviário de Salvador, Pituba","Salvador","Bahia","00.500.618/0001-10","RD Transportes","Bradesco","2864-9","16102-0"]
["Transportes Santana e São Paulo Ltda","Santana e São Paulo","Rua Senador Quintino, 574","Feira de Santana","Bahia","14.078.166/0001-35","Empr Tran Santana S Paulo","Banco do Brasil","3429-0","24509-7"]
["Auto Onibus São João Ltda","São João","Rua Olímpio Vital, SN, Centro","Feira de Santana","Bahia","71.445.555/0006-08","Auto Onibus São João","Santander","3327-8","13000253-7"]
["Auto Viação Camurujipe Ltda","Camurujipe","Av. ACM, 4362 – Terminal Rodoviário de Salvador - Pituba ","Salvador","Bahia","15.890.809/0001-03","Auto Viação Camurujipe Ltda.","Bradesco","2864-9","684-0"]
["Aracaju Card","Salvador Card"]
["Vera Cruz Transportes e Serviços Marítimos Ltda","Vera Cruz Transportes","Rua José Eloi, 14, Jaburu","Vera Cruz","Bahia","00.613.277/0001-90","Vera Cruz Transportes e Serviços Marítimos Ltda","Banco do Brasil","3921-7","5738-X"]
[null,null,{"$f":"SUBTOTAL(103,Empresas[Endereço])","v":11},null,null,null,null,null,null,{"$f":"SUBTOTAL(103,Empresas[Conta Corrente])","v":11}]