{"text_format":"1","workbook":"xlsx","n_sheets":14,"sheets":["BMVT","Recibo","Julho","Junho","Maio","Abril","Março","Fevereiro","Janeiro","Relatório","Rel_Gestao","Rotas","Usuários","Empresas"],"not_rendered":{"charts":12,"images":0,"macros":1,"external_links":10,"defined_names":27,"comments":8,"pivot_tables":0},"unopened":[],"bounds":{"document_bytes":16777216,"sheet_cells":100000,"rows_first":2000,"rows_last":500,"rows_between":2000,"halvings":0,"cell_chars":16384,"cell_head_chars":4096},"cells_cut":0,"cells_raw":0,"read":"whole","date_system":"1900"}

{"sheet":"BMVT","index":0,"n_rows":81,"n_cols":32,"rows_kept":81,"cut":false,"hidden":false,"merged":[[4,23,4,24],[4,27,4,29],[4,25,4,26],[76,0,76,2],[0,0,2,2],[1,3,2,3],[1,14,1,15],[2,14,2,15],[0,14,0,15]]}
["Boletim Mensal de Vales Transporte",null,null,"Competência:",null,"Dias Úteis (Mês):",{"$f":"VLOOKUP(INDEX($W$6:$AF$16,$W$5,1),$W$6:$AF$16,9,FALSE)","v":21},null,"SC (Empregado):",0,{"$f":"(SUMIFS(BMVT[Vlr. Total],BMVT[Vínculo],\"<>Aprendiz\",BMVT[Empresa], \"Salvador Card\"))-J1","v":1300.2},null,null,"Qtd Usuários",{"$f":"SUMPRODUCT(SUBTOTAL(3,OFFSET(BMVT[Matrícula],ROW(BMVT[Matrícula])-ROW(A6),0,1)),--(BMVT[Situação]=\"Regular\"))","v":24}]
[null,null,null,{"$f":"VLOOKUP(INDEX($W$6:$AF$16,$W$5,1),$W$6:$AF$16,1,FALSE)","v":"Julho"},null,"Compesações:",{"$f":"VLOOKUP(INDEX($W$6:$AF$16,$W$5,1),$W$6:$AF$16,10,FALSE)","v":0},null,"SC (Aprendiz):",0,{"$f":"(SUMIFS(BMVT[Vlr. Total],BMVT[Vínculo],\"Aprendiz\",BMVT[Empresa],\"Salvador Card\"))-J2","v":0},null,null,"Qtd VT :",{"$f":"SUMPRODUCT(SUBTOTAL(9,OFFSET(BMVT[Qtd. Solic.],ROW(BMVT[Qtd. Solic.])-ROW(O6),0,1)),--(BMVT[Situação]=\"Regular\"))","v":835}]
[null,null,null,null,null,"Desconto :",0,null,"Metropasse:",250.8,{"$f":"(SUMIF(BMVT[Empresa],\"Metropasse\",BMVT[Vlr. Total]))-J3","v":164.99999999999994},null,null,"Valor Total:",{"$f":"SUMPRODUCT(SUBTOTAL(9,OFFSET(BMVT[Vlr. Total],ROW(BMVT[Vlr. Total])-ROW(R6),0,1)),--(BMVT[Situação]=\"Regular\"))","v":5932.1600000000017}]
[null,null,null,null,null,null,null,null,null,null,null,null,null,null,null,null,null,null,null,null,null,null,{"$f":"D2","v":"Julho"}]
["Matrícula","Empregado","Vínculo","Lotação","Setor","Rota","Situação","Origem","Destino","Tipo","Empresa","Vales/Trecho","Chipagem","Quant. Apur.","Qtd. Solic.","Dias Lanc Sist.","Vlr. Unit.","Vlr. Total",null,null,"Trechos",null,7,"Período",null,"Feriados",null,"Compensações",null,null,"DU"]
["000.001",{"$f":"IF(ISERROR(VLOOKUP(BMVT[[#This Row],[Matrícula]],Usuarios[#All],2,FALSE)),\"\",VLOOKUP(BMVT[[#This Row],[Matrícula]],Usuarios[#All],2,FALSE))","v":"João"},{"$f":"IF(ISERROR(VLOOKUP(BMVT[[#This Row],[Matrícula]],Usuarios[#All],3,FALSE)),\"\",VLOOKUP(BMVT[[#This Row],[Matrícula]],Usuarios[#All],3,FALSE))","v":"Anistiado"},{"$f":"IF(ISERROR(VLOOKUP(BMVT[[#This Row],[Matrícula]],Usuarios[#All],4,FALSE)),\"\",VLOOKUP(BMVT[[#This Row],[Matrícula]],Usuarios[#All],4,FALSE))","v":"Salvador"},{"$f":"IF(ISERROR(VLOOKUP(BMVT[[#This Row],[Matrícula]],Usuarios[#All],5,FALSE)),\"\",VLOOKUP(BMVT[[#This Row],[Matrícula]],Usuarios[#All],5,FALSE))","v":"ADMINISTRATIVO"},"xxxxx-Y","Regular",{"$f":"IF(ISERROR(VLOOKUP(BMVT[[#This Row],[Rota]],Rotas[#All],3,FALSE)),\"\",VLOOKUP(BMVT[[#This Row],[Rota]],Rotas[#All],3,FALSE))","v":"Dias D'Ávila"},{"$f":"IF(ISERROR(VLOOKUP(BMVT[[#This Row],[Rota]],Rotas[#All],4,FALSE)),\"\",VLOOKUP(BMVT[[#This Row],[Rota]],Rotas[#All],4,FALSE))","v":"Camaçari"},{"$f":"IF(ISERROR(VLOOKUP(BMVT[[#This Row],[Rota]],Rotas[#All],5,FALSE)),\"\",VLOOKUP(BMVT[[#This Row],[Rota]],Rotas[#All],5,FALSE))","v":"Intermunicipal"},{"$f":"IF(ISERROR(VLOOKUP(BMVT[[#This Row],[Rota]],Rotas[#All],6,FALSE)),\"\",VLOOKUP(BMVT[[#This Row],[Rota]],Rotas[#All],6,FALSE))","v":"Cidade das Águas"},2,{"$f":"L6","v":2},{"$f":"L6*$G$1","v":42},{"$f":"BMVT[[#This Row],[Quant. Apur.]]","v":42},{"$f":"IF(ISERROR(O6/M6),0,O6/M6)","v":21},{"$f":"IF(ISERROR(VLOOKUP(BMVT[[#This Row],[Rota]],Rotas[#All],7,FALSE)),0,VLOOKUP(BMVT[[#This Row],[Rota]],Rotas[#All],7,FALSE))","v":2.8},{"$f":"O6*Q6","v":117.6},null,null,{"$f":"IF(ISERROR(BMVT[[#This Row],[Origem]]&\" - \"&BMVT[[#This Row],[Destino]]),\"\",BMVT[[#This Row],[Origem]]&\" - \"&BMVT[[#This Row],[Destino]])","v":"Dias D'Ávila - Camaçari"},null,"Janeiro","2016-01-01","2016-01-31","2016-01-01",null,null,null,null,{"$f":"NETWORKDAYS(X6,Y6,Z6:AD6)","v":20},{"$f":"COUNTA(AB6:AD6)","v":0}]
{"$rows_left_out":76}
{"sheet":"Recibo","index":1,"n_rows":99,"n_cols":17,"rows_kept":99,"cut":false,"hidden":false,"merged":[[42,1,42,2],[15,1,18,11],[10,1,10,11],[42,4,42,11],[52,1,52,2]]}
[]
[null,null,null,null,null,14]
[{"$f":"LOOKUP(9.99999999999999E+307,$A$5:A97)","v":0}]
[null,"Empresa",{"$f":"VLOOKUP(INDEX(Empresas!$A$4:$J$17,Recibo!$F$2,1),Empresas!$A$4:$J$17,2,FALSE)","v":"Vera Cruz Transportes"}]
[0,"CNPJ",{"$f":"VLOOKUP(INDEX(Empresas!$A$4:$J$17,Recibo!$F$2,1),Empresas!$A$4:$J$17,6,FALSE)","v":"00.613.277/0001-90"},null,null,null,null,null,null,null,null,null,null,null,null,null,"Trechos"]
[{"$f":"IF(ISNUMBER(MATCH(BMVT[[#This Row],[Empresa]],$C$4,0)),LOOKUP(9.99999999999999E+307,$A$5:A5)+1,\"\")","v":""},"Endereço",{"$f":"VLOOKUP(INDEX(Empresas!$A$4:$J$17,Recibo!$F$2,1),Empresas!$A$4:$J$17,3,FALSE)","v":"Rua José Eloi, 14, Jaburu"},null,null,null,null,null,null,null,null,null,null,null,null,null,{"$f":"IF(COUNTA($A$6:A6)>$A$3,\"\",LOOKUP(COUNTA($A$6:A6),A6:$A$80,BMVT!U6:$U$78))","v":""}]
{"$rows_left_out":94}
{"sheet":"Julho","index":2,"n_rows":82,"n_cols":32,"rows_kept":82,"cut":false,"hidden":false,"merged":[[4,25,4,26],[4,27,4,29],[77,0,77,2],[0,0,2,2],[0,14,0,15],[1,3,2,3],[1,14,1,15],[2,14,2,15],[4,23,4,24]]}
["Boletim Mensal de Vales Transporte",null,null,"Competência:",null,"Dias Úteis (Mês):",{"$f":"VLOOKUP(INDEX($W$6:$AF$16,$W$5,1),$W$6:$AF$16,9,FALSE)","v":21},null,"SC (Empregado):",0,{"$f":"(SUMIFS(BMVT9[Vlr. Total],BMVT9[Vínculo],\"<>Aprendiz\",BMVT9[Empresa], \"Salvador Card\"))-J1","v":1300.2},null,null,"Qtd Usuários",{"$f":"SUMPRODUCT(SUBTOTAL(3,OFFSET(BMVT9[Matrícula],ROW(BMVT9[Matrícula])-ROW(A6),0,1)),--(BMVT9[Situação]=\"Regular\"))","v":24}]
[null,null,null,{"$f":"VLOOKUP(INDEX($W$6:$AF$16,$W$5,1),$W$6:$AF$16,1,FALSE)","v":"Julho"},null,"Compesações:",{"$f":"VLOOKUP(INDEX($W$6:$AF$16,$W$5,1),$W$6:$AF$16,10,FALSE)","v":0},null,"SC (Aprendiz):",0,{"$f":"(SUMIFS(BMVT9[Vlr. Total],BMVT9[Vínculo],\"Aprendiz\",BMVT9[Empresa],\"Salvador Card\"))-J2","v":0},null,null,"Qtd VT :",{"$f":"SUMPRODUCT(SUBTOTAL(9,OFFSET(BMVT9[Qtd. Solic.],ROW(BMVT9[Qtd. Solic.])-ROW(O6),0,1)),--(BMVT9[Situação]=\"Regular\"))","v":835}]
[null,null,null,null,null,"Desconto :",0,null,"Metropasse:",132,{"$f":"(SUMIF(BMVT9[Empresa],\"Metropasse\",BMVT9[Vlr. Total]))-J3","v":283.79999999999995},null,null,"Valor Total:",{"$f":"SUMPRODUCT(SUBTOTAL(9,OFFSET(BMVT9[Vlr. Total],ROW(BMVT9[Vlr. Total])-ROW(R6),0,1)),--(BMVT9[Situação]=\"Regular\"))","v":5932.1600000000017}]
[]
["Matrícula","Empregado","Vínculo","Lotação","Setor","Rota","Situação","Origem","Destino","Tipo","Empresa","Vales/Trecho","Chipagem","Quant. Apur.","Qtd. Solic.","Dias Lanc Sist.","Vlr. Unit.","Vlr. Total",null,null,"Trechos",null,7,"Período",null,"Feriados",null,"Compensações",null,null,"DU"]
["000.001","João","Anistiado","Salvador","ADMINISTRATIVO","xxxxx-Y","Regular","Dias D'Ávila","Camaçari","Intermunicipal","Cidade das Águas",2,2,42,42,21,2.8,117.6,null,null,{"$f":"IF(ISERROR(BMVT9[[#This Row],[Origem]]&\" - \"&BMVT9[[#This Row],[Destino]]),\"\",BMVT9[[#This Row],[Origem]]&\" - \"&BMVT9[[#This Row],[Destino]])","v":"Dias D'Ávila - Camaçari"},null,"Janeiro","2016-01-01","2016-01-31","2016-01-01",null,null,null,null,{"$f":"NETWORKDAYS(X6,Y6,Z6:AD6)","v":20},{"$f":"COUNTA(AB6:AD6)","v":0}]
{"$rows_left_out":77}
{"sheet":"Junho","index":3,"n_rows":81,"n_cols":32,"rows_kept":81,"cut":false,"hidden":false,"merged":[[4,25,4,26],[4,27,4,29],[76,0,76,2],[0,0,2,2],[0,14,0,15],[1,3,2,3],[1,14,1,15],[2,14,2,15],[4,23,4,24]]}
["Boletim Mensal de Vales Transporte",null,null,"Competência:",null,"Dias Úteis (Mês):",{"$f":"VLOOKUP(INDEX($W$6:$AF$16,$W$5,1),$W$6:$AF$16,9,FALSE)","v":21},null,"SC (Empregado):",0,{"$f":"(SUMIFS(BMVT11[Vlr. Total],BMVT11[Vínculo],\"<>Aprendiz\",BMVT11[Empresa], \"Salvador Card\"))-J1","v":1300.2},null,null,"Qtd Usuários",{"$f":"SUMPRODUCT(SUBTOTAL(3,OFFSET(BMVT11[Matrícula],ROW(BMVT11[Matrícula])-ROW(A6),0,1)),--(BMVT11[Situação]=\"Regular\"))","v":24}]
[null,null,null,{"$f":"VLOOKUP(INDEX($W$6:$AF$16,$W$5,1),$W$6:$AF$16,1,FALSE)","v":"Junho"},null,"Compesações:",{"$f":"VLOOKUP(INDEX($W$6:$AF$16,$W$5,1),$W$6:$AF$16,10,FALSE)","v":1},null,"SC (Aprendiz):",0,{"$f":"(SUMIFS(BMVT11[Vlr. Total],BMVT11[Vínculo],\"Aprendiz\",BMVT11[Empresa],\"Salvador Card\"))-J2","v":0},null,null,"Qtd VT :",{"$f":"SUMPRODUCT(SUBTOTAL(9,OFFSET(BMVT11[Qtd. Solic.],ROW(BMVT11[Qtd. Solic.])-ROW(O6),0,1)),--(BMVT11[Situação]=\"Regular\"))","v":835}]
[null,null,null,null,null,"Desconto :",0,null,"Metropasse:",250.8,{"$f":"(SUMIF(BMVT11[Empresa],\"Metropasse\",BMVT11[Vlr. Total]))-J3","v":164.99999999999994},null,null,"Valor Total:",{"$f":"SUMPRODUCT(SUBTOTAL(9,OFFSET(BMVT11[Vlr. Total],ROW(BMVT11[Vlr. Total])-ROW(R6),0,1)),--(BMVT11[Situação]=\"Regular\"))","v":5932.1600000000017}]
[]
["Matrícula","Empregado","Vínculo","Lotação","Setor","Rota","Situação","Origem","Destino","Tipo","Empresa","Vales/Trecho","Chipagem","Quant. Apur.","Qtd. Solic.","Dias Lanc Sist.","Vlr. Unit.","Vlr. Total",null,null,"Trechos",null,6,"Período",null,"Feriados",null,"Compensações",null,null,"DU"]
["000.001","João","Anistiado","Salvador","ADMINISTRATIVO","xxxxx-Y","Regular","Dias D'Ávila","Camaçari","Intermunicipal","Cidade das Águas",2,2,42,42,21,2.8,117.6,null,null,{"$f":"IF(ISERROR(BMVT11[[#This Row],[Origem]]&\" - \"&BMVT11[[#This Row],[Destino]]),\"\",BMVT11[[#This Row],[Origem]]&\" - \"&BMVT11[[#This Row],[Destino]])","v":"Dias D'Ávila - Camaçari"},null,"Janeiro","2016-01-01","2016-01-31","2016-01-01",null,null,null,null,{"$f":"NETWORKDAYS(X6,Y6,Z6:AD6)","v":20},{"$f":"COUNTA(AB6:AD6)","v":0}]
{"$rows_left_out":76}
{"sheet":"Maio","index":4,"n_rows":89,"n_cols":32,"rows_kept":89,"cut":false,"hidden":false,"merged":[[4,25,4,26],[4,27,4,29],[84,0,84,2],[0,0,2,2],[0,14,0,15],[1,3,2,3],[1,14,1,15],[2,14,2,15],[4,23,4,24]]}
["Boletim Mensal de Vales Transporte",null,null,"Competência:",null,"Dias Úteis (Mês):",{"$f":"VLOOKUP(INDEX($W$6:$AF$17,$W$5,1),$W$6:$AF$17,9,FALSE)","v":20},null,"SC (Empregado):",0,{"$f":"(SUMIFS(BMVT16[Vlr. Total],BMVT16[Vínculo],\"<>Aprendiz\",BMVT16[Empresa], \"Salvador Card\"))-J1","v":1240.8},null,null,"Qtd Usuários",{"$f":"SUMPRODUCT(SUBTOTAL(3,OFFSET(BMVT16[Matrícula],ROW(BMVT16[Matrícula])-ROW(A6),0,1)),--(BMVT16[Situação]=\"Regular\"))","v":24}]
[null,null,null,{"$f":"VLOOKUP(INDEX($W$6:$AF$17,$W$5,1),$W$6:$AF$17,1,FALSE)","v":"Maio"},null,"Compesações:",{"$f":"VLOOKUP(INDEX($W$6:$AF$17,$W$5,1),$W$6:$AF$17,10,FALSE)","v":1},null,"SC (Aprendiz):",0,{"$f":"(SUMIFS(BMVT16[Vlr. Total],BMVT16[Vínculo],\"Aprendiz\",BMVT16[Empresa],\"Salvador Card\"))-J2","v":0},null,null,"Qtd VT :",{"$f":"SUMPRODUCT(SUBTOTAL(9,OFFSET(BMVT16[Qtd. Solic.],ROW(BMVT16[Qtd. Solic.])-ROW(A6),0,1)),--(BMVT16[Situação]=\"Regular\"))","v":801}]
[null,null,null,null,null,"Desconto :",0,null,"Metropasse:",null,{"$f":"(SUMIF(BMVT16[Empresa],\"Metropasse\",BMVT16[Vlr. Total]))-J3","v":396},null,null,"Valor Total:",{"$f":"SUMPRODUCT(SUBTOTAL(9,OFFSET(BMVT16[Vlr. Total],ROW(BMVT16[Vlr. Total])-ROW(A6),0,1)),--(BMVT16[Situação]=\"Regular\"))","v":5732.2}]
[]
["Matrícula","Empregado","Vínculo","Lotação","Setor","Rota","Situação","Origem","Destino","Tipo","Empresa","Vales/Trecho","Chipagem","Quant. Apur.","Qtd. Solic.","Dias Lanc Sist.","Vlr. Unit.","Vlr. Total",null,null,null,null,5,"Período",null,"Feriados",null,"Compensações",null,null,"DU"]
["000.001","João","Anistiado","Salvador","ADMINISTRATIVO","xxxxx-Y","Regular","Dias D'Ávila","Camaçari","Intermunicipal","Cidade das Águas",2,2,40,40,20,2.8,112,null,null,null,null,"Janeiro","2016-01-01","2016-01-31","2016-01-01",null,null,null,null,{"$f":"NETWORKDAYS(X6,Y6,Z6:AD6)","v":20},{"$f":"COUNTA(AB6:AD6)","v":0}]
{"$rows_left_out":84}
{"sheet":"Abril","index":5,"n_rows":89,"n_cols":32,"rows_kept":89,"cut":false,"hidden":false,"merged":[[4,25,4,26],[4,27,4,29],[84,0,84,2],[0,0,2,2],[0,14,0,15],[1,3,2,3],[1,14,1,15],[2,14,2,15],[4,23,4,24]]}
["Boletim Mensal de Vales Transporte",null,null,"Competência:",null,"Dias Úteis (Mês):",{"$f":"VLOOKUP(INDEX($W$6:$AF$17,$W$5,1),$W$6:$AF$17,9,FALSE)","v":20},null,"SC (Empregado):",0,{"$f":"(SUMIFS(BMVT13[Vlr. Total],BMVT13[Vínculo],\"<>Aprendiz\",BMVT13[Empresa], \"Salvador Card\"))-J1","v":1240.8},null,null,"Qtd Usuários",{"$f":"SUMPRODUCT(SUBTOTAL(3,OFFSET(BMVT13[Matrícula],ROW(BMVT13[Matrícula])-ROW(A6),0,1)),--(BMVT13[Situação]=\"Regular\"))","v":31}]
[null,null,null,{"$f":"VLOOKUP(INDEX($W$6:$AF$17,$W$5,1),$W$6:$AF$17,1,FALSE)","v":"Abril"},null,"Compesações:",{"$f":"VLOOKUP(INDEX($W$6:$AF$17,$W$5,1),$W$6:$AF$17,10,FALSE)","v":1},null,"SC (Aprendiz):",0,{"$f":"(SUMIFS(BMVT13[Vlr. Total],BMVT13[Vínculo],\"Aprendiz\",BMVT13[Empresa],\"Salvador Card\"))-J2","v":0},null,null,"Qtd VT :",{"$f":"SUMPRODUCT(SUBTOTAL(9,OFFSET(BMVT13[Qtd. Solic.],ROW(BMVT13[Qtd. Solic.])-ROW(A6),0,1)),--(BMVT13[Situação]=\"Regular\"))","v":927}]
[null,null,null,null,null,"Desconto :",0,null,"Metropasse:",null,{"$f":"(SUMIF(BMVT13[Empresa],\"Metropasse\",BMVT13[Vlr. Total]))-J3","v":396},null,null,"Valor Total:",{"$f":"SUMPRODUCT(SUBTOTAL(9,OFFSET(BMVT13[Vlr. Total],ROW(BMVT13[Vlr. Total])-ROW(A6),0,1)),--(BMVT13[Situação]=\"Regular\"))","v":6200.6999999999989}]
[]
["Matrícula","Empregado","Vínculo","Lotação","Setor","Rota","Situação","Origem","Destino","Tipo","Empresa","Vales/Trecho","Chipagem","Quant. Apur.","Qtd. Solic.","Dias Lanc Sist.","Vlr. Unit.","Vlr. Total",null,null,null,null,4,"Período",null,"Feriados",null,"Compensações",null,null,"DU"]
["000.001","João","Anistiado","Salvador","ADMINISTRATIVO","xxxxx-Y","Regular","Dias D'Ávila","Camaçari","Intermunicipal","Cidade das Águas",2,2,40,40,20,2.8,112,null,null,null,null,"Janeiro","2016-01-01","2016-01-31","2016-01-01",null,null,null,null,{"$f":"NETWORKDAYS(X6,Y6,Z6:AD6)","v":20},{"$f":"COUNTA(AB6:AD6)","v":0}]
{"$rows_left_out":84}
{"sheet":"Março","index":6,"n_rows":86,"n_cols":32,"rows_kept":86,"cut":false,"hidden":false,"merged":[[4,25,4,26],[4,27,4,29],[81,0,81,2],[0,0,2,2],[0,14,0,15],[1,3,2,3],[1,14,1,15],[2,14,2,15],[4,23,4,24]]}
["Boletim Mensal de Vales Transporte",null,null,"Competência:",null,"Dias Úteis (Mês):",{"$f":"VLOOKUP(INDEX($W$6:$AF$17,$W$5,1),$W$6:$AF$17,9,FALSE)","v":21},null,"SC (Empregado):",0,{"$f":"(SUMIFS(BMVT12[Vlr. Total],BMVT12[Vínculo],\"<>Aprendiz\",BMVT12[Empresa], \"Salvador Card\"))-J1","v":1300.2},null,null,"Qtd Usuários",{"$f":"SUMPRODUCT(SUBTOTAL(3,OFFSET(BMVT12[Matrícula],ROW(BMVT12[Matrícula])-ROW(A6),0,1)),--(BMVT12[Situação]=\"Regular\"))","v":24}]
[null,null,null,{"$f":"VLOOKUP(INDEX($W$6:$AF$17,$W$5,1),$W$6:$AF$17,1,FALSE)","v":"Março"},null,"Compesações:",{"$f":"VLOOKUP(INDEX($W$6:$AF$17,$W$5,1),$W$6:$AF$17,10,FALSE)","v":1},null,"SC (Aprendiz):",0,{"$f":"(SUMIFS(BMVT12[Vlr. Total],BMVT12[Vínculo],\"Aprendiz\",BMVT12[Empresa],\"Salvador Card\"))-J2","v":0},null,null,"Qtd VT :",{"$f":"SUMPRODUCT(SUBTOTAL(9,OFFSET(BMVT12[Qtd. Solic.],ROW(BMVT12[Qtd. Solic.])-ROW(A6),0,1)),--(BMVT12[Situação]=\"Regular\"))","v":835}]
[null,null,null,null,null,"Desconto :",0,null,"Metropasse:",null,{"$f":"(SUMIF(BMVT12[Empresa],\"Metropasse\",BMVT12[Vlr. Total]))-J3","v":415.79999999999995},null,null,"Valor Total:",{"$f":"SUMPRODUCT(SUBTOTAL(9,OFFSET(BMVT12[Vlr. Total],ROW(BMVT12[Vlr. Total])-ROW(A6),0,1)),--(BMVT12[Situação]=\"Regular\"))","v":5932.1600000000017}]
[]
["Matrícula","Empregado","Vínculo","Lotação","Setor","Rota","Situação","Origem","Destino","Tipo","Empresa","Vales/Trecho","Chipagem","Quant. Apur.","Qtd. Solic.","Dias Lanc Sist.","Vlr. Unit.","Vlr. Total",null,null,null,null,3,"Período",null,"Feriados",null,"Compensações",null,null,"DU"]
["000.001","João","Anistiado","Salvador","ADMINISTRATIVO","xxxxx-Y","Regular","Dias D'Ávila","Camaçari","Intermunicipal","Cidade das Águas",2,2,42,42,21,2.8,117.6,null,null,null,null,"Janeiro","2016-01-01","2016-01-31","2016-01-01",null,null,null,null,{"$f":"NETWORKDAYS(X6,Y6,Z6:AD6)","v":20},{"$f":"COUNTA(AB6:AD6)","v":0}]
{"$rows_left_out":81}
{"sheet":"Fevereiro","index":7,"n_rows":86,"n_cols":32,"rows_kept":86,"cut":false,"hidden":false,"merged":[[4,25,4,26],[4,27,4,29],[81,0,81,2],[0,0,2,2],[0,14,0,15],[1,3,2,3],[1,14,1,15],[2,14,2,15],[4,23,4,24]]}
["Boletim Mensal de Vales Transporte",null,null,"Competência:",null,"Dias Úteis (Mês):",{"$f":"VLOOKUP(INDEX($W$7:$AF$18,$W$5,1),$W$7:$AF$18,9,FALSE)","v":18},null,"SC (Empregado):",0,{"$f":"(SUMIFS(BMVT15[Vlr. Total],BMVT15[Vínculo],\"<>Aprendiz\",BMVT15[Empresa], \"Salvador Card\"))-J1","v":1122},null,null,"Qtd Usuários",{"$f":"SUMPRODUCT(SUBTOTAL(3,OFFSET(BMVT15[Matrícula],ROW(BMVT15[Matrícula])-ROW(A6),0,1)),--(BMVT15[Situação]=\"Regular\"))","v":24}]
[null,null,null,{"$f":"VLOOKUP(INDEX($W$7:$AF$18,$W$5,1),$W$7:$AF$18,1,FALSE)","v":"Fevereiro"},null,"Compesações:",{"$f":"VLOOKUP(INDEX($W$7:$AF$18,$W$5,1),$W$7:$AF$18,10,FALSE)","v":2},null,"SC (Aprendiz):",0,{"$f":"(SUMIFS(BMVT15[Vlr. Total],BMVT15[Vínculo],\"Aprendiz\",BMVT15[Empresa],\"Salvador Card\"))-J2","v":0},null,null,"Qtd VT :",{"$f":"SUMPRODUCT(SUBTOTAL(9,OFFSET(BMVT15[Qtd. Solic.],ROW(BMVT15[Qtd. Solic.])-ROW(A6),0,1)),--(BMVT15[Situação]=\"Regular\"))","v":733}]
[null,null,null,null,null,"Desconto :",0,null,"Metropasse:",null,{"$f":"(SUMIF(BMVT15[Empresa],\"Metropasse\",BMVT15[Vlr. Total]))-J3","v":356.4},null,null,"Valor Total:",{"$f":"SUMPRODUCT(SUBTOTAL(9,OFFSET(BMVT15[Vlr. Total],ROW(BMVT15[Vlr. Total])-ROW(A6),0,1)),--(BMVT15[Situação]=\"Regular\"))","v":5332.2800000000016}]
[]
["Matrícula","Empregado","Vínculo","Lotação","Setor","Rota","Situação","Origem","Destino","Tipo","Empresa","Vales/Trecho","Chipagem","Quant. Apur.","Qtd. Solic.","Dias Lanc Sist.","Vlr. Unit.","Vlr. Total",null,null,null,null,2,"Período",null,"Feriados",null,"Compensações",null,null,"DU"]
["000.001","João","Anistiado","Salvador","ADMINISTRATIVO","xxxxx-Y","Regular","Dias D'Ávila","Camaçari","Intermunicipal","Cidade das Águas",2,2,36,36,18,2.8,100.8]
{"$rows_left_out":81}
{"sheet":"Janeiro","index":8,"n_rows":86,"n_cols":32,"rows_kept":86,"cut":false,"hidden":false,"merged":[[4,25,4,26],[4,27,4,29],[81,0,81,2],[0,0,2,2],[0,14,0,15],[1,3,2,3],[1,14,1,15],[2,14,2,15],[4,23,4,24]]}
["Boletim Mensal de Vales Transporte",null,null,"Competência:",null,"Dias Úteis (Mês):",{"$f":"VLOOKUP(INDEX($W$6:$AF$17,$W$5,1),$W$6:$AF$17,9,FALSE)","v":20},null,"SC (Empregado):",0,{"$f":"(SUMIFS(BMVT14[Vlr. Total],BMVT14[Vínculo],\"<>Aprendiz\",BMVT14[Empresa], \"Salvador Card\"))-J1","v":1240.8},null,null,"Qtd Usuários",{"$f":"SUMPRODUCT(SUBTOTAL(3,OFFSET(BMVT14[Matrícula],ROW(BMVT14[Matrícula])-ROW(A6),0,1)),--(BMVT14[Situação]=\"Regular\"))","v":24}]
[null,null,null,{"$f":"VLOOKUP(INDEX($W$6:$AF$17,$W$5,1),$W$6:$AF$17,1,FALSE)","v":"Janeiro"},null,"Compesações:",{"$f":"VLOOKUP(INDEX($W$6:$AF$17,$W$5,1),$W$6:$AF$17,10,FALSE)","v":0},null,"SC (Aprendiz):",0,{"$f":"(SUMIFS(BMVT14[Vlr. Total],BMVT14[Vínculo],\"Aprendiz\",BMVT14[Empresa],\"Salvador Card\"))-J2","v":0},null,null,"Qtd VT :",{"$f":"SUMPRODUCT(SUBTOTAL(9,OFFSET(BMVT14[Qtd. Solic.],ROW(BMVT14[Qtd. Solic.])-ROW(A6),0,1)),--(BMVT14[Situação]=\"Regular\"))","v":801}]
[null,null,null,null,null,"Desconto :",0,null,"Metropasse:",0,{"$f":"(SUMIF(BMVT14[Empresa],\"Metropasse\",BMVT14[Vlr. Total]))-J3","v":396},null,null,"Valor Total:",{"$f":"SUMPRODUCT(SUBTOTAL(9,OFFSET(BMVT14[Vlr. Total],ROW(BMVT14[Vlr. Total])-ROW(A6),0,1)),--(BMVT14[Situação]=\"Regular\"))","v":5732.2}]
[]
["Matrícula","Empregado","Vínculo","Lotação","Setor","Rota","Situação","Origem","Destino","Tipo","Empresa","Vales/Trecho","Chipagem","Quant. Apur.","Qtd. Solic.","Dias Lanc Sist.","Vlr. Unit.","Vlr. Total",null,null,null,null,1,"Período",null,"Feriados",null,"Compensações",null,null,"DU"]
["000.001","João","Anistiado","Salvador","ADMINISTRATIVO","xxxxx-Y","Regular","Dias D'Ávila","Camaçari","Intermunicipal","Cidade das Águas",2,2,40,40,20,2.8,112,null,null,null,null,"Janeiro","2016-01-01","2016-01-31","2016-01-01",null,null,null,null,{"$f":"NETWORKDAYS(X6,Y6,Z6:AD6)","v":20},{"$f":"COUNTA(AB6:AD6)","v":0}]
{"$rows_left_out":81}
{"sheet":"Relatório","index":9,"n_rows":154,"n_cols":21,"rows_kept":154,"cut":false,"hidden":false,"merged":[[1,0,5,15]]}
[]
["Relatório Gráfico Comparativo"]
[]
[]
[]
[]
{"$rows_left_out":149}
{"sheet":"Rel_Gestao","index":10,"n_rows":122,"n_cols":28,"rows_kept":122,"cut":false,"hidden":false,"merged":[[10,0,10,1],[28,0,28,1],[31,0,31,1],[3,26,3,27],[4,0,4,1],[3,6,3,7],[3,8,3,9],[3,10,3,11],[3,12,3,13],[3,4,3,5],[1,0,2,25],[3,2,3,3],[3,14,3,15],[3,16,3,17],[3,18,3,19],[3,20,3,21],[3,22,3,23],[3,24,3,25]]}
[]
["Tabulação de Dados de Vales-Transporte"]
[]
[null,null,"JANEIRO",null,"FEVEREIRO",null,"MARÇO",null,"ABRIL",null,"MAIO",null,"JUNHO",null,"JULHO",null,"AGOSTO",null,"SETEMBRO",null,"OUTUBRO",null,"NOVEMBRO",null,"DEZEMBRO",null,"TOTAL"]
["Vínculo",null,"Quant. Total","Vlr. Total","Quant. Total","Vlr. Total","Quant. Total","Vlr. Total","Quant. Total","Vlr. Total","Quant. Total","Vlr. Total","Quant. Total","Vlr. Total","Quant. Total","Vlr. Total","Quant. Total","Vlr. Total","Quant. Total","Vlr. Total","Quant. Total","Vlr. Total","Quant. Total","Vlr. Total","Quant. Total","Vlr. Total","Quant. Total","Vlr. Total"]
["Anistiado",null,{"$f":"SUMIF(Janeiro!C6:R77,A6,Janeiro!O6:O77)","v":168},{"$f":"SUMIF(Janeiro!$C$6:$R$77,A6,Janeiro!$R$6:$R$77)","v":1889.2},{"$f":"SUMIF(Fevereiro!$C$6:$R$77,A6,Fevereiro!$O$6:$O$77)","v":156},{"$f":"SUMIF(Fevereiro!$C$6:$R$77,A6,Fevereiro!$R$6:$R$77)","v":1751.4},{"$f":"SUMIF(Março!$C$6:$R$80,A6,Março!$O$6:$O$80)","v":174},{"$f":"SUMIF(Março!$C$6:$R$80,A6,Março!$R$6:$R$80)","v":1958.1},{"$f":"SUMIF(Abril!$C$6:$R$80,A6,Abril!$O$6:$O$80)","v":168},{"$f":"SUMIF(Abril!$C$6:$R$80,A6,Abril!$R$6:$R$80)","v":1889.2},{"$f":"SUMIF(Maio!$C$6:$R$80,A6,Maio!$O$6:$O$80)","v":168},{"$f":"SUMIF(Maio!$C$6:$R$80,A6,Maio!$R$6:$R$80)","v":1889.2},{"$f":"SUMIF(Junho!$C$6:$R$80,A6,Junho!$O$6:$O$80)","v":174},{"$f":"SUMIF(Junho!$C$6:$R$80,A6,Junho!$R$6:$R$80)","v":1958.1},{"$f":"SUMIF(Julho!$C$6:$R$80,A6,Julho!$O$6:$O$80)","v":174},{"$f":"SUMIF(Julho!$C$6:$R$80,A6,Julho!$R$6:$R$80)","v":1958.1},{"$f":"SUMIF([1]Agosto!$C$6:$R$80,A6,[1]Agosto!$O$6:$O$80)","v":{"$error":"#VALUE!"}},{"$f":"SUMIF([1]Agosto!$C$6:$R$80,A6,[1]Agosto!$R$6:$R$80)","v":{"$error":"#VALUE!"}},{"$f":"SUMIF([2]Setembro!$C$6:$R$80,A6,[2]Setembro!$O$6:$O$80)","v":{"$error":"#VALUE!"}},{"$f":"SUMIF([3]SET!$C$6:$R$80,A6,[3]SET!$R$6:$R$80)","v":{"$error":"#VALUE!"}},{"$f":"SUMIF([4]Outubro!$C$6:$R$80,A6,[4]Outubro!$O$6:$O$80)","v":{"$error":"#VALUE!"}},{"$f":"SUMIF([4]Outubro!$C$6:$R$80,A6,[4]Outubro!$R$6:$R$80)","v":{"$error":"#VALUE!"}},{"$f":"SUMIF([5]Novembro!$C$6:$R$80,A6,[5]Novembro!$O$6:$O$80)","v":{"$error":"#VALUE!"}},{"$f":"SUMIF([5]Novembro!$C$6:$R$80,A6,[5]Novembro!$R$6:$R$80)","v":{"$error":"#VALUE!"}},{"$f":"SUMIF([6]Dezembro!$C$6:$R$80,D6,[6]Dezembro!$O$6:$O$80)","v":{"$error":"#VALUE!"}},{"$f":"SUMIF([6]Dezembro!$C$6:$R$80,D6,[6]Dezembro!$R$6:$R$80)","v":{"$error":"#VALUE!"}},{"$f":"IF(ISERROR(C6),0,C6)+IF(ISERROR(E6),0,E6)+IF(ISERROR(G6),0,G6)+IF(ISERROR(I6),0,I6)+IF(ISERROR(K6),0,K6)+IF(ISERROR(M6),0,M6)+IF(ISERROR(O6),0,O6)+IF(ISERROR(Q6),0,Q6)+IF(ISERROR(S6),0,S6)+IF(ISERROR(U6),0,U6)+IF(ISERROR(W6),0,W6)+IF(ISERROR(Y6),0,Y6)","v":1182},{"$f":"IF(ISERROR(D6),0,D6)+IF(ISERROR(F6),0,F6)+IF(ISERROR(H6),0,H6)+IF(ISERROR(J6),0,J6)+IF(ISERROR(L6),0,L6)+IF(ISERROR(N6),0,N6)+IF(ISERROR(P6),0,P6)+IF(ISERROR(R6),0,R6)+IF(ISERROR(T6),0,T6)+IF(ISERROR(V6),0,V6)+IF(ISERROR(X6),0,X6)+IF(ISERROR(Z6),0,Z6)","v":13293.300000000001}]
{"$rows_left_out":117}
{"sheet":"Rotas","index":11,"n_rows":21,"n_cols":7,"rows_kept":21,"cut":false,"hidden":false,"merged":[[0,0,1,6]]}
["Cadastro de Rotas"]
[]
["Rota","Grupo","Origem","Destino","Tipo","Empresa","Valor"]
[23185,"000000","Itabuna","Ubaitaba","Intermunicipal","Águia Branca",13.47]
["xxxxx-Y",null,"Dias D'Ávila","Camaçari","Intermunicipal","Cidade das Águas",2.8]
[23184,"000000","Jequié","Ipiaú","Intermunicipal","Cidade Sol",10.65]
{"$rows_left_out":16}
{"sheet":"Usuários","index":12,"n_rows":28,"n_cols":16,"rows_kept":28,"cut":false,"hidden":false,"merged":[[0,0,1,4]]}
["Cadastro de Usuários"]
[]
["Matrícula","Empregado","Vínculo","Unid. Organiz.","Setor",null,null,null,null,null,null,"Vínculo",null,"Setor",null,"Instalação"]
["000.001","João","Anistiado","Salvador","ADMINISTRATIVO",null,null,null,null,null,null,"Anistiado",null,"ADMINISTRATIVO",null,"Salvador"]
["000.002","Maria","Anistiado","Salvador","ADMINISTRATIVO",null,null,null,null,null,null,"Cedido",null,"PESSOAL",null,"Aracaju"]
["000.003","Francisco","Anistiado","Salvador","ADMINISTRATIVO",null,null,null,null,null,null,"Empregado",null,"FINANCEIRO",null,"Feira de Santana"]
{"$rows_left_out":23}
{"sheet":"Empresas","index":13,"n_rows":18,"n_cols":10,"rows_kept":18,"cut":false,"hidden":false,"merged":[[0,0,1,3]]}
["Cadastro de Empresas"]
[]
["Razão Social","Fantasia","Endereço","Cidade","UF","CNPJ","Titular","Banco","Agência","Conta Corrente"]
["Viação Águia Branca S/A","Águia Branca","Av. ACM, 4362, Terminal Rodoviário de Salvador, Pituba","Salvador","Bahia","27.486.182/0079-79","Viação Águia Branca S/A","Caixa Econ. Federal",590,"00000000110-6"]
["Aracaju Card","Aracaju Card"]
["Metropasse","Metropasse"]
{"$rows_left_out":12}