{"text_format":"1","workbook":"xlsx","n_sheets":3,"sheets":["Exame","PREENCHER","banco de dados"],"not_rendered":{"charts":0,"images":1,"macros":1,"external_links":0,"defined_names":1,"comments":0,"pivot_tables":0},"unopened":[],"bounds":{"document_bytes":16777216,"sheet_cells":100000,"rows_first":2000,"rows_last":500,"rows_between":2000,"halvings":0,"cell_chars":16384,"cell_head_chars":4096},"cells_cut":0,"cells_raw":0,"read":"whole","date_system":"1900"}

{"sheet":"Exame","index":0,"n_rows":41,"n_cols":16,"rows_kept":41,"cut":false,"hidden":false,"merged":[[6,0,6,15],[8,10,8,13],[9,12,9,15],[10,9,10,13],[3,0,3,15],[4,0,4,15],[5,0,5,15],[9,3,9,6],[10,1,10,6],[8,4,8,7],[9,8,9,11],[8,8,8,9],[41,0,41,15],[32,0,32,15],[11,2,11,6],[12,1,12,6],[33,0,35,15],[11,11,11,13],[13,0,15,15],[24,0,26,15],[11,8,11,10],[27,12,27,15],[36,12,36,15],[16,12,16,15]]}
[]
[]
[]
["Clínica Veterinária Animed 24h"]
["Av. Cavalhada, 1957 – Cavalhada – Porto Alegre – RS"]
["Fone: (51) 3249-9592"]
["E-mail: exames.animed@gmail.com"]
[]
["Paciente:",null,null,null,{"$f":"PREENCHER!E5","v":0},null,null,null,"Porprietário:",null,{"$f":"PREENCHER!K7","v":0}]
["Espécie:",null,null,{"$f":"PREENCHER!E7","v":0},null,null,null,null,"Veterinário Requisitante:",null,null,null,{"$f":"PREENCHER!K9","v":0}]
["Raça:",{"$f":"PREENCHER!E9","v":0},null,null,null,null,null,null,"Data:",{"$f":"PREENCHER!K11","v":"2016-05-10"}]
["Idade:",null,{"$f":"PREENCHER!E11","v":0},null,null,null,null,null,"Amostra Analisada:",null,null,"Sangue"]
["Sexo:",{"$f":"PREENCHER!E13","v":0}]
["ERITROGRAMA"]
[]
[]
[null,null,null,null,null,null,null,null,null,null,null,null,"Valores de Referência"]
["Eritrócitos",null,null,null,null,null,null,{"$f":"PREENCHER!F17","v":0},"milhões/mm³",null,null,null,null,{"$f":"INDEX('banco de dados'!C2:C74,MATCH(C12&D10,'banco de dados'!A2:A74&'banco de dados'!B2:B74,0))","v":{"$error":"#N/A"}},"milhões/mm3"]
["Hemoglobina",null,null,null,null,null,null,{"$f":"PREENCHER!F19","v":0},"g/100ml",null,null,null,null,{"$f":"INDEX('banco de dados'!D2:D74,MATCH(C12&D10,'banco de dados'!A2:A74&'banco de dados'!B2:B74,0))","v":{"$error":"#N/A"}},"g%"]
["Hematócrito",null,null,null,null,null,null,{"$f":"PREENCHER!F21","v":0},"%",null,null,null,null,{"$f":"INDEX('banco de dados'!E2:E74,MATCH(C12&D10,'banco de dados'!A2:A74&'banco de dados'!B2:B74,0))","v":{"$error":"#N/A"}},"%"]
["V.C.M",null,null,null,null,null,null,{"$f":"(H20/H18)*10","v":{"$error":"#DIV/0!"}},"u³",null,null,null,null,{"$f":"INDEX('banco de dados'!F2:F74,MATCH(C12&D10,'banco de dados'!A2:A74&'banco de dados'!B2:B74,0))","v":{"$error":"#N/A"}},"u³"]
["H.C.M",null,null,null,null,null,null,{"$f":"(H19/H18)*10","v":{"$error":"#DIV/0!"}},"uug",null,null,null,null,{"$f":"INDEX('banco de dados'!G2:G74,MATCH(C12&D10,'banco de dados'!A2:A74&'banco de dados'!B2:B74,0))","v":{"$error":"#N/A"}},"uug"]
["C.H.C.M",null,null,null,null,null,null,{"$f":"(H19/H20)*100","v":{"$error":"#DIV/0!"}},"%",null,null,null,null,{"$f":"INDEX('banco de dados'!H2:H74,MATCH(C12&D10,'banco de dados'!A2:A74&'banco de dados'!B2:B74,0))","v":{"$error":"#N/A"}},"g%"]
["Plaquetas",null,null,null,null,null,null,{"$f":"PREENCHER!F23","v":0},"mil/mm³",null,null,null,null,{"$f":"INDEX('banco de dados'!P2:P74,MATCH(C12&D10,'banco de dados'!A2:A74&'banco de dados'!B2:B74,0))","v":{"$error":"#N/A"}},"mil/mm³"]
["LEUCOGRAMA"]
[]
[]
[null,null,null,null,null,null,null,null,null,null,null,null,"Valores de Referência"]
["Leucócitos Totais",null,null,null,null,null,null,null,{"$f":"PREENCHER!L17","v":0},"mil/mm³",null,null,null,null,{"$f":"INDEX('banco de dados'!I2:I74,MATCH(C12&D10,'banco de dados'!A2:A74&'banco de dados'!B2:B74,0))","v":{"$error":"#N/A"}},"mil/mm³"]
["Eosinófilos",null,null,null,null,null,{"$f":"(I30/I29)*100","v":{"$error":"#DIV/0!"}},"%",{"$f":"PREENCHER!L19","v":0},"mil/mm³",null,null,{"$f":"INDEX('banco de dados'!L2:L74,MATCH(C12&D10,'banco de dados'!A2:A74&'banco de dados'!B2:B74,0))","v":{"$error":"#N/A"}},"%",{"$f":"INDEX('banco de dados'!M2:M74,MATCH(C12&D10,'banco de dados'!A2:A74&'banco de dados'!B2:B74,0))","v":{"$error":"#N/A"}},"mil/mm³"]
["Linfócitos",null,null,null,null,null,{"$f":"(I31/I29)*100","v":{"$error":"#DIV/0!"}},"%",{"$f":"PREENCHER!L21","v":0},"mil/mm³",null,null,{"$f":"INDEX('banco de dados'!J2:J74,MATCH(C12&D10,'banco de dados'!A2:A74&'banco de dados'!B2:B74,0))","v":{"$error":"#N/A"}},"%",{"$f":"INDEX('banco de dados'!K2:K74,MATCH(C12&D10,'banco de dados'!A2:A74&'banco de dados'!B2:B74,0))","v":{"$error":"#N/A"}},"mil/mm³"]
["Outros",null,null,null,null,null,{"$f":"100-(G30+G31)","v":{"$error":"#DIV/0!"}},"%",{"$f":"I29-I30-I31","v":0},"mil/mm³",null,null,{"$f":"INDEX('banco de dados'!N2:N74,MATCH(C12&D10,'banco de dados'!A2:A74&'banco de dados'!B2:B74,0))","v":{"$error":"#N/A"}},"%",{"$f":"INDEX('banco de dados'!O2:O74,MATCH(C12&D10,'banco de dados'!A2:A74&'banco de dados'!B2:B74,0))","v":{"$error":"#N/A"}},"mil/mm³"]
[]
["BIOQUÍMICA SANGUÍNEA"]
[]
[]
[null,null,null,null,null,null,null,null,null,null,null,null,"Valores de Referência"]
["ALT/GPT",null,null,null,null,null,null,null,{"$f":"PREENCHER!F25","v":0},"U/L",null,null,null,{"$f":"INDEX('banco de dados'!B77:B78,MATCH(D10,'banco de dados'!A77:A78,0))","v":{"$error":"#N/A"}},"U/L"]
["Fosfatase Alcalina",null,null,null,null,null,null,null,{"$f":"PREENCHER!F27","v":0},"U/L",null,null,null,{"$f":"INDEX('banco de dados'!C77:C78,MATCH(D10,'banco de dados'!A77:A78,0))","v":{"$error":"#N/A"}},"U/L"]
["Creatinina",null,null,null,null,null,null,null,{"$f":"PREENCHER!F29","v":0},"mmg/dL",null,null,null,{"$f":"INDEX('banco de dados'!E77:E78,MATCH(D10,'banco de dados'!A77:A78,0))","v":{"$error":"#N/A"}},"mg/Dl"]
["Ureia",null,null,null,null,null,null,null,{"$f":"PREENCHER!F31","v":0},"mmg/dL",null,null,null,{"$f":"INDEX('banco de dados'!D77:D78,MATCH(D10,'banco de dados'!A77:A78,0))","v":{"$error":"#N/A"}},"mg/Dl"]

{"sheet":"PREENCHER","index":1,"n_rows":31,"n_cols":11,"rows_kept":31,"cut":false,"hidden":false,"merged":[[1,1,1,14],[24,8,24,11],[26,8,26,11],[28,8,28,11],[4,4,4,6],[6,4,6,6],[8,4,8,6],[10,4,10,6],[12,4,12,6],[6,10,6,12],[8,10,8,12],[10,10,10,12]]}
[]
[null,"LABORATÓRIO ANIMED - CADASTRO NOVO EXAME"]
[]
[]
[null,null,"Paciente"]
[]
[null,null,"Espécie",null,null,null,null,null,"Proprietário"]
[]
[null,null,"Raça",null,null,null,null,null,"Veterinário"]
[]
[null,null,"Idade",null,null,null,null,null,"Data",null,{"$f":"TODAY()","v":"2016-05-10"}]
[]
[null,null,"Sexo"]
[]
[]
[]
[null,null,"Eritrócitos",null,null,null,null,null,"Leucócitos Totais"]
[]
[null,null,"Hemoglobina",null,null,null,null,null,"Eosinófilos"]
[]
[null,null,"Hematócrito",null,null,null,null,null,"Linfócitos"]
[]
[null,null,"Plaquetas"]
[]
[null,null,"ALT/GPT"]
[]
[null,null,"Fosfatase Alcalina"]
[]
[null,null,"Creatinina"]
[]
[null,null,"Uréia"]

{"sheet":"banco de dados","index":2,"n_rows":78,"n_cols":16,"rows_kept":78,"cut":false,"hidden":true,"merged":[]}
["idade","especie","hemacias","hemoglobina","hematócrito","V.C.M.","H.C.M.","C.H.C.M.","Leucócitos Totais","Linfócitos %","Linfócitos #","Eosinófilos %","Eosinófilos #","outros %","outros #","Plaquetas"]
["1 mês","CANINO","3,5 a 6","8,5 a 13","26 a 39","69 a 83","22 a 25","31 a 33","8 a 16","30 a 48","2,4 a 7,7","1 a 5","0,1 a 1,0","47 a 69","3,7 a 11,1","200 a 500"]
["2 meses","CANINO","3,5 a 6","8,5 a 13","26 a 39","69 a 83","22 a 25","31 a 33","8 a 16","30 a 48","2,4 a 7,7","1 a 5","0,1 a 1,0","47 a 69","3,7 a 11,1","200 a 500"]
["3 meses","CANINO","3,5 a 6","8,5 a 13","26 a 39","69 a 83","22 a 25","31 a 33","8 a 16","30 a 48","2,4 a 7,7","1 a 5","0,1 a 1,0","47 a 69","3,7 a 11,1","200 a 500"]
["4 meses","CANINO","5,5 a 7","11 a 15,5","34 a 40","65 a 78","20 a 24","30 a 35","8 a 16","28 a 45","2,5 a 7,2","1 a 5","0,1 a 1,0","50 a 71","4,0 a 11,4","200 a 500"]
["5 meses","CANINO","5,5 a 7","11 a 15,5","34 a 40","65 a 78","20 a 24","30 a 35","8 a 16","28 a 45","2,5 a 7,2","1 a 5","0,1 a 1,0","50 a 71","4,0 a 11,4","200 a 500"]
["6 meses","CANINO","5,5 a 7","11 a 15,5","34 a 40","65 a 78","20 a 24","30 a 35","8 a 16","28 a 45","2,5 a 7,2","1 a 5","0,1 a 1,0","50 a 71","4,0 a 11,4","200 a 500"]
["7 meses","CANINO","6 a 7","14 a 17","40 a 47","65 a 78","21 a 25","30 a 35","8 a 16","20 a 40","1,6 a 6,4","1 a 6","0,1 a 1,0","54 a 79","4,3 a 12,6","200 a 500"]
["8 meses","CANINO","6 a 7","14 a 17","40 a 47","65 a 78","21 a 25","30 a 35","8 a 16","20 a 40","1,6 a 6,4","1 a 6","0,1 a 1,0","54 a 79","4,3 a 12,6","200 a 500"]
["9 meses","CANINO","6 a 7","14 a 17","40 a 47","65 a 78","21 a 25","30 a 35","8 a 16","20 a 40","1,6 a 6,4","1 a 6","0,1 a 1,0","54 a 79","4,3 a 12,6","200 a 500"]
["10 meses","CANINO","6 a 7","14 a 17","40 a 47","65 a 78","21 a 25","30 a 35","8 a 16","20 a 40","1,6 a 6,4","1 a 6","0,1 a 1,0","54 a 79","4,3 a 12,6","200 a 500"]
["11 meses","CANINO","6 a 7","14 a 17","40 a 47","65 a 78","21 a 25","30 a 35","8 a 16","20 a 40","1,6 a 6,4","1 a 6","0,1 a 1,0","54 a 79","4,3 a 12,6","200 a 500"]
["1 ano","CANINO","6 a 7","14 a 17","40 a 47","65 a 78","21 a 25","30 a 35","8 a 16","20 a 40","1,6 a 6,4","1 a 6","0,1 a 1,0","54 a 79","4,3 a 12,6","200 a 500"]
["2 anos","CANINO","5,5 a 8","12 a 18","37 a 55","60 a 77","19,5 a 24,5","30 a 36","6 a 17","12 a 30","0,7 a 5,1","2 a 10","0,1 a 1,7","60 a 86","3,6 a 14,6","200 a 500"]
["3 anos","CANINO","5,5 a 8","12 a 18","37 a 55","60 a 77","19,5 a 24,5","30 a 36","6 a 17","12 a 30","0,7 a 5,1","2 a 10","0,1 a 1,7","60 a 86","3,6 a 14,6","200 a 500"]
["4 anos","CANINO","5,5 a 8","12 a 18","37 a 55","60 a 77","19,5 a 24,5","30 a 36","6 a 17","12 a 30","0,7 a 5,1","2 a 10","0,1 a 1,7","60 a 86","3,6 a 14,6","200 a 500"]
["5 anos","CANINO","5,5 a 8","12 a 18","37 a 55","60 a 77","19,5 a 24,5","30 a 36","6 a 17","12 a 30","0,7 a 5,1","2 a 10","0,1 a 1,7","60 a 86","3,6 a 14,6","200 a 500"]
["6 anos","CANINO","5,5 a 8","12 a 18","37 a 55","60 a 77","19,5 a 24,5","30 a 36","6 a 17","12 a 30","0,7 a 5,1","2 a 10","0,1 a 1,7","60 a 86","3,6 a 14,6","200 a 500"]
["7 anos","CANINO","5,5 a 8","12 a 18","37 a 55","60 a 77","19,5 a 24,5","30 a 36","6 a 17","12 a 30","0,7 a 5,1","2 a 10","0,1 a 1,7","60 a 86","3,6 a 14,6","200 a 500"]
["8 anos","CANINO","5,5 a 8","12 a 18","37 a 55","60 a 77","19,5 a 24,5","30 a 36","6 a 17","12 a 30","0,7 a 5,1","2 a 10","0,1 a 1,7","60 a 86","3,6 a 14,6","200 a 500"]
["9 anos","CANINO","5,7 a 7,4","14 a 18","38 a 47","63 a 77","21 a 26","31 a 35","6 a 16","13 a 40","0,8 a 6,4","1 a 9","0,1 a 1,4","51 a 86","3,0 a 13,7","200 a 500"]
["10 anos","CANINO","5,7 a 7,4","14 a 18","38 a 47","63 a 77","21 a 26","31 a 35","6 a 16","13 a 40","0,8 a 6,4","1 a 9","0,1 a 1,4","51 a 86","3,0 a 13,7","200 a 500"]
["11 anos","CANINO","5,7 a 7,4","14 a 18","38 a 47","63 a 77","21 a 26","31 a 35","6 a 16","13 a 40","0,8 a 6,4","1 a 9","0,1 a 1,4","51 a 86","3,0 a 13,7","200 a 500"]
["12 anos","CANINO","5,7 a 7,4","14 a 18","38 a 47","63 a 77","21 a 26","31 a 35","6 a 16","13 a 40","0,8 a 6,4","1 a 9","0,1 a 1,4","51 a 86","3,0 a 13,7","200 a 500"]
["13 anos","CANINO","5,7 a 7,4","14 a 18","38 a 47","63 a 77","21 a 26","31 a 35","6 a 16","13 a 40","0,8 a 6,4","1 a 9","0,1 a 1,4","51 a 86","3,0 a 13,7","200 a 500"]
["14 anos","CANINO","5,7 a 7,4","14 a 18","38 a 47","63 a 77","21 a 26","31 a 35","6 a 16","13 a 40","0,8 a 6,4","1 a 9","0,1 a 1,4","51 a 86","3,0 a 13,7","200 a 500"]
["15 anos","CANINO","5,7 a 7,4","14 a 18","38 a 47","63 a 77","21 a 26","31 a 35","6 a 16","13 a 40","0,8 a 6,4","1 a 9","0,1 a 1,4","51 a 86","3,0 a 13,7","200 a 500"]
["16 anos","CANINO","5,7 a 7,4","14 a 18","38 a 47","63 a 77","21 a 26","31 a 35","6 a 16","13 a 40","0,8 a 6,4","1 a 9","0,1 a 1,4","51 a 86","3,0 a 13,7","200 a 500"]
["17 anos","CANINO","5,7 a 7,4","14 a 18","38 a 47","63 a 77","21 a 26","31 a 35","6 a 16","13 a 40","0,8 a 6,4","1 a 9","0,1 a 1,4","51 a 86","3,0 a 13,7","200 a 500"]
["18 anos","CANINO","5,7 a 7,4","14 a 18","38 a 47","63 a 77","21 a 26","31 a 35","6 a 16","13 a 40","0,8 a 6,4","1 a 9","0,1 a 1,4","51 a 86","3,0 a 13,7","200 a 500"]
["19 anos","CANINO","5,7 a 7,4","14 a 18","38 a 47","63 a 77","21 a 26","31 a 35","6 a 16","13 a 40","0,8 a 6,4","1 a 9","0,1 a 1,4","51 a 86","3,0 a 13,7","200 a 500"]
["20 anos","CANINO","5,7 a 7,4","14 a 18","38 a 47","63 a 77","21 a 26","31 a 35","6 a 16","13 a 40","0,8 a 6,4","1 a 9","0,1 a 1,4","51 a 86","3,0 a 13,7","200 a 500"]
["21 anos","CANINO","5,7 a 7,4","14 a 18","38 a 47","63 a 77","21 a 26","31 a 35","6 a 16","13 a 40","0,8 a 6,4","1 a 9","0,1 a 1,4","51 a 86","3,0 a 13,7","200 a 500"]
["22 anos","CANINO","5,7 a 7,4","14 a 18","38 a 47","63 a 77","21 a 26","31 a 35","6 a 16","13 a 40","0,8 a 6,4","1 a 9","0,1 a 1,4","51 a 86","3,0 a 13,7","200 a 500"]
["23 anos","CANINO","5,7 a 7,4","14 a 18","38 a 47","63 a 77","21 a 26","31 a 35","6 a 16","13 a 40","0,8 a 6,4","1 a 9","0,1 a 1,4","51 a 86","3,0 a 13,7","200 a 500"]
["24 anos","CANINO","5,7 a 7,4","14 a 18","38 a 47","63 a 77","21 a 26","31 a 35","6 a 16","13 a 40","0,8 a 6,4","1 a 9","0,1 a 1,4","51 a 86","3,0 a 13,7","200 a 500"]
["25 anos","CANINO","5,7 a 7,4","14 a 18","38 a 47","63 a 77","21 a 26","31 a 35","6 a 16","13 a 40","0,8 a 6,4","1 a 9","0,1 a 1,4","51 a 86","3,0 a 13,7","200 a 500"]
["26 anos","CANINO","5,7 a 7,4","14 a 18","38 a 47","63 a 77","21 a 26","31 a 35","6 a 16","13 a 40","0,8 a 6,4","1 a 9","0,1 a 1,4","51 a 86","3,0 a 13,7","200 a 500"]
["1 mês","FELINO","3,5 a 8","7 a 14","22 a 38","40 a 55","13 a 17","31 a 35","6 a 17","20 a 50","1,2 a 8,5","1 a 10","0,1 a 1,7","40 a 79","2,4 a 13,4","300 a 800"]
["2 mêses","FELINO","3,5 a 8","7 a 14","22 a 38","40 a 55","13 a 17","31 a 35","6 a 17","20 a 50","1,2 a 8,5","1 a 10","0,1 a 1,7","40 a 79","2,4 a 13,4","300 a 800"]
["3 mêses","FELINO","3,5 a 8","7 a 14","22 a 38","40 a 55","13 a 17","31 a 35","6 a 17","20 a 50","1,2 a 8,5","1 a 10","0,1 a 1,7","40 a 79","2,4 a 13,4","300 a 800"]
["4 mêses","FELINO","5 a 10","8 a 15","24 a 45","39 a 55","12,5 a 17,5","30 a 36","5,5 a 19,5","20 a 55","1,1 a 10,7","2 a 12","1,1 a 2,4","33 a 78","1,8 a 15,2","300 a 800"]
["5 mêses","FELINO","5 a 10","8 a 15","24 a 45","39 a 55","12,5 a 17,5","30 a 36","5,5 a 19,5","20 a 55","1,1 a 10,7","2 a 12","1,1 a 2,4","33 a 78","1,8 a 15,2","300 a 800"]
["6 mêses","FELINO","5 a 10","8 a 15","24 a 45","39 a 55","12,5 a 17,5","30 a 36","5,5 a 19,5","20 a 55","1,1 a 10,7","2 a 12","1,1 a 2,4","33 a 78","1,8 a 15,2","300 a 800"]
["7 mêses","FELINO","5 a 10","8 a 15","24 a 45","39 a 55","12,5 a 17,5","30 a 36","5,5 a 19,5","20 a 55","1,1 a 10,7","2 a 12","1,1 a 2,4","33 a 78","1,8 a 15,2","300 a 800"]
["8 mêses","FELINO","5 a 10","8 a 15","24 a 45","39 a 55","12,5 a 17,5","30 a 36","5,5 a 19,5","20 a 55","1,1 a 10,7","2 a 12","1,1 a 2,4","33 a 78","1,8 a 15,2","300 a 800"]
["9 mêses","FELINO","5 a 10","8 a 15","24 a 45","39 a 55","12,5 a 17,5","30 a 36","5,5 a 19,5","20 a 55","1,1 a 10,7","2 a 12","1,1 a 2,4","33 a 78","1,8 a 15,2","300 a 800"]
["10 mêses","FELINO","5 a 10","8 a 15","24 a 45","39 a 55","12,5 a 17,5","30 a 36","5,5 a 19,5","20 a 55","1,1 a 10,7","2 a 12","1,1 a 2,4","33 a 78","1,8 a 15,2","300 a 800"]
["11 mêses","FELINO","5 a 10","8 a 15","24 a 45","39 a 55","12,5 a 17,5","30 a 36","5,5 a 19,5","20 a 55","1,1 a 10,7","2 a 12","1,1 a 2,4","33 a 78","1,8 a 15,2","300 a 800"]
["1 ano","FELINO","5 a 10","8 a 15","24 a 45","39 a 55","12,5 a 17,5","30 a 36","5,5 a 19,5","20 a 55","1,1 a 10,7","2 a 12","1,1 a 2,4","33 a 78","1,8 a 15,2","300 a 800"]
["2 anos","FELINO","5 a 10","8 a 15","24 a 45","39 a 55","12,5 a 17,5","30 a 36","5,5 a 19,5","20 a 55","1,1 a 10,7","2 a 12","1,1 a 2,4","33 a 78","1,8 a 15,2","300 a 800"]
["3 anos","FELINO","5 a 10","8 a 15","24 a 45","39 a 55","12,5 a 17,5","30 a 36","5,5 a 19,5","20 a 55","1,1 a 10,7","2 a 12","1,1 a 2,4","33 a 78","1,8 a 15,2","300 a 800"]
["4 anos","FELINO","5 a 10","8 a 15","24 a 45","39 a 55","12,5 a 17,5","30 a 36","5,5 a 19,5","20 a 55","1,1 a 10,7","2 a 12","1,1 a 2,4","33 a 78","1,8 a 15,2","300 a 800"]
["5 anos","FELINO","5 a 10","8 a 15","24 a 45","39 a 55","12,5 a 17,5","30 a 36","5,5 a 19,5","20 a 55","1,1 a 10,7","2 a 12","1,1 a 2,4","33 a 78","1,8 a 15,2","300 a 800"]
["6 anos","FELINO","5 a 10","8 a 15","24 a 45","39 a 55","12,5 a 17,5","30 a 36","5,5 a 19,5","20 a 55","1,1 a 10,7","2 a 12","1,1 a 2,4","33 a 78","1,8 a 15,2","300 a 800"]
["7 anos","FELINO","5 a 10","8 a 15","24 a 45","39 a 55","12,5 a 17,5","30 a 36","5,5 a 19,5","20 a 55","1,1 a 10,7","2 a 12","1,1 a 2,4","33 a 78","1,8 a 15,2","300 a 800"]
["8 anos","FELINO","5 a 10","8 a 15","24 a 45","39 a 55","12,5 a 17,5","30 a 36","5,5 a 19,5","20 a 55","1,1 a 10,7","2 a 12","1,1 a 2,4","33 a 78","1,8 a 15,2","300 a 800"]
["9 anos","FELINO","5 a 10","8 a 15","24 a 45","39 a 55","12,5 a 17,5","30 a 36","5,5 a 19,5","20 a 55","1,1 a 10,7","2 a 12","1,1 a 2,4","33 a 78","1,8 a 15,2","300 a 800"]
["10 anos","FELINO","5 a 10","8 a 15","24 a 45","39 a 55","12,5 a 17,5","30 a 36","5,5 a 19,5","20 a 55","1,1 a 10,7","2 a 12","1,1 a 2,4","33 a 78","1,8 a 15,2","300 a 800"]
["11 anos","FELINO","5 a 10","8 a 15","24 a 45","39 a 55","12,5 a 17,5","30 a 36","5,5 a 19,5","20 a 55","1,1 a 10,7","2 a 12","1,1 a 2,4","33 a 78","1,8 a 15,2","300 a 800"]
["12 anos","FELINO","5 a 10","8 a 15","24 a 45","39 a 55","12,5 a 17,5","30 a 36","5,5 a 19,5","20 a 55","1,1 a 10,7","2 a 12","1,1 a 2,4","33 a 78","1,8 a 15,2","300 a 800"]
["13 anos","FELINO","5 a 10","8 a 15","24 a 45","39 a 55","12,5 a 17,5","30 a 36","5,5 a 19,5","20 a 55","1,1 a 10,7","2 a 12","1,1 a 2,4","33 a 78","1,8 a 15,2","300 a 800"]
["14 anos","FELINO","5 a 10","8 a 15","24 a 45","39 a 55","12,5 a 17,5","30 a 36","5,5 a 19,5","20 a 55","1,1 a 10,7","2 a 12","1,1 a 2,4","33 a 78","1,8 a 15,2","300 a 800"]
["15 anos","FELINO","5 a 10","8 a 15","24 a 45","39 a 55","12,5 a 17,5","30 a 36","5,5 a 19,5","20 a 55","1,1 a 10,7","2 a 12","1,1 a 2,4","33 a 78","1,8 a 15,2","300 a 800"]
["16 anos","FELINO","5 a 10","8 a 15","24 a 45","39 a 55","12,5 a 17,5","30 a 36","5,5 a 19,5","20 a 55","1,1 a 10,7","2 a 12","1,1 a 2,4","33 a 78","1,8 a 15,2","300 a 800"]
["17 anos","FELINO","5 a 10","8 a 15","24 a 45","39 a 55","12,5 a 17,5","30 a 36","5,5 a 19,5","20 a 55","1,1 a 10,7","2 a 12","1,1 a 2,4","33 a 78","1,8 a 15,2","300 a 800"]
["18 anos","FELINO","5 a 10","8 a 15","24 a 45","39 a 55","12,5 a 17,5","30 a 36","5,5 a 19,5","20 a 55","1,1 a 10,7","2 a 12","1,1 a 2,4","33 a 78","1,8 a 15,2","300 a 800"]
["19 anos","FELINO","5 a 10","8 a 15","24 a 45","39 a 55","12,5 a 17,5","30 a 36","5,5 a 19,5","20 a 55","1,1 a 10,7","2 a 12","1,1 a 2,4","33 a 78","1,8 a 15,2","300 a 800"]
["20 anos","FELINO","5 a 10","8 a 15","24 a 45","39 a 55","12,5 a 17,5","30 a 36","5,5 a 19,5","20 a 55","1,1 a 10,7","2 a 12","1,1 a 2,4","33 a 78","1,8 a 15,2","300 a 800"]
["21 anos","FELINO","5 a 10","8 a 15","24 a 45","39 a 55","12,5 a 17,5","30 a 36","5,5 a 19,5","20 a 55","1,1 a 10,7","2 a 12","1,1 a 2,4","33 a 78","1,8 a 15,2","300 a 800"]
["22 anos","FELINO","5 a 10","8 a 15","24 a 45","39 a 55","12,5 a 17,5","30 a 36","5,5 a 19,5","20 a 55","1,1 a 10,7","2 a 12","1,1 a 2,4","33 a 78","1,8 a 15,2","300 a 800"]
["23 anos","FELINO","5 a 10","8 a 15","24 a 45","39 a 55","12,5 a 17,5","30 a 36","5,5 a 19,5","20 a 55","1,1 a 10,7","2 a 12","1,1 a 2,4","33 a 78","1,8 a 15,2","300 a 800"]
["24 anos","FELINO","5 a 10","8 a 15","24 a 45","39 a 55","12,5 a 17,5","30 a 36","5,5 a 19,5","20 a 55","1,1 a 10,7","2 a 12","1,1 a 2,4","33 a 78","1,8 a 15,2","300 a 800"]
["25 anos","FELINO","5 a 10","8 a 15","24 a 45","39 a 55","12,5 a 17,5","30 a 36","5,5 a 19,5","20 a 55","1,1 a 10,7","2 a 12","1,1 a 2,4","33 a 78","1,8 a 15,2","300 a 800"]
[]
[null,"ALT/GPT","FOSFATASE","UREIA","CREATI"]
["CANINO","0 a 80","20 a 155","0 a 54","0,5 a 1,8"]
["FELINO","10 a 80","25 a 93","20 a 65","0,5 a 1,8"]